ctakes-notifications mailing list archives

Site index · List index
Message view « Date » · « Thread »
Top « Date » · « Thread »
From Apache Jenkins Server <jenk...@builds.apache.org>
Subject Build failed in Jenkins: ctakes-trunk-compiletest #329
Date Mon, 08 Jul 2013 22:14:53 GMT
See <https://builds.apache.org/job/ctakes-trunk-compiletest/329/changes>

Changes:

[chenpei] CTAKES-97 - Since OpenNLP 1.5+, there is no need to load up the tag dictionary anymore.
Removing unncessary/unused bit of code.

[james-masanz] allow each step to run separate by separating out the judge step

[james-masanz] need to --test-only on test step of TestAttributeModels

[chenpei] CTAKES-212 - Updated to use the latest apache parent pom and javadoc plugin that
contains the java doc security fix.

------------------------------------------
[...truncated 5933 lines...]

[INFO] --- maven-resources-plugin:2.5:testResources (default-testResources) @ ctakes-assertion
---
[INFO] [INFO] No sources to compile

[INFO] --- maven-compiler-plugin:2.4:testCompile (default-testCompile) @ ctakes-assertion
---
[INFO] [INFO] Surefire report directory: <https://builds.apache.org/job/ctakes-trunk-compiletest/ws/ctakes-assertion/target/surefire-reports>

-------------------------------------------------------
 T E S T S
-------------------------------------------------------

[INFO] --- maven-surefire-plugin:2.12:test (default-test) @ ctakes-assertion ---

Results :

Tests run: 0, Failures: 0, Errors: 0, Skipped: 0

[JENKINS] Recording test results
[INFO] [INFO] Deleting <https://builds.apache.org/job/ctakes-trunk-compiletest/ws/ctakes-temporal-res/target>
                                                                        
[INFO] ------------------------------------------------------------------------
[INFO] Building Apache cTAKES Resources temporal 3.1.0-SNAPSHOT
[INFO] ------------------------------------------------------------------------
[INFO] 
[INFO] --- maven-clean-plugin:2.4.1:clean (default-clean) @ ctakes-temporal-res ---
[INFO] 
[INFO] --- maven-remote-resources-plugin:1.4:process (default) @ ctakes-temporal-res ---
[INFO] [debug] execute contextualize
[INFO] Using 'UTF-8' encoding to copy filtered resources.

[INFO] --- maven-resources-plugin:2.5:resources (default-resources) @ ctakes-temporal-res
---
[INFO] Copying 1 resource
[INFO] Copying 3 resources
[INFO] No sources to compile
[INFO] 
[INFO] --- maven-compiler-plugin:2.4:compile (default-compile) @ ctakes-temporal-res ---
[INFO] 
[INFO] --- maven-remote-resources-plugin:1.4:process (default) @ ctakes-temporal-res ---
[INFO] [debug] execute contextualize
[INFO] Using 'UTF-8' encoding to copy filtered resources.
[INFO] Copying 1 resource
[INFO] Copying 3 resources
[INFO] Copying 3 resources

[INFO] --- maven-resources-plugin:2.5:resources (default-resources) @ ctakes-temporal-res
---
[INFO] [INFO] No sources to compile

[INFO] --- maven-compiler-plugin:2.4:compile (default-compile) @ ctakes-temporal-res ---
[debug] execute contextualize
[INFO] [INFO] Using 'UTF-8' encoding to copy filtered resources.
[INFO] skip non existing resourceDirectory <https://builds.apache.org/job/ctakes-trunk-compiletest/ws/ctakes-temporal-res/src/test/resources>
[INFO] Copying 3 resources
[INFO] Copying 3 resources

[INFO] --- maven-resources-plugin:2.5:testResources (default-testResources) @ ctakes-temporal-res
---
[INFO] [INFO] No sources to compile

[INFO] --- maven-compiler-plugin:2.4:testCompile (default-testCompile) @ ctakes-temporal-res
---
[INFO] Surefire report directory: <https://builds.apache.org/job/ctakes-trunk-compiletest/ws/ctakes-temporal-res/target/surefire-reports>
[INFO] 
-------------------------------------------------------
 T E S T S
-------------------------------------------------------

[INFO] --- maven-surefire-plugin:2.12:test (default-test) @ ctakes-temporal-res ---

Results :

Tests run: 0, Failures: 0, Errors: 0, Skipped: 0

[JENKINS] Recording test results
[INFO]                                                                         
[INFO] ------------------------------------------------------------------------
[INFO] Building Apache cTAKES Temporal Information Extraction 3.1.0-SNAPSHOT
[INFO] ------------------------------------------------------------------------
[INFO] [INFO] Deleting <https://builds.apache.org/job/ctakes-trunk-compiletest/ws/ctakes-temporal/target>

[INFO] --- maven-clean-plugin:2.4.1:clean (default-clean) @ ctakes-temporal ---
[INFO] Configured Artifact: net.sourceforge.ctakesresources:ctakes-resources-umls2011ab:3.1.0:jar
[INFO] [INFO] Unpacking /home/jenkins/jenkins-slave/maven-repositories/0/net/sourceforge/ctakesresources/ctakes-resources-umls2011ab/3.1.0/ctakes-resources-umls2011ab-3.1.0.jar
to <https://builds.apache.org/job/ctakes-trunk-compiletest/ws/ctakes-temporal/target/unpacked>
with includes "" and excludes ""

[INFO] --- maven-dependency-plugin:2.6:unpack (unpack) @ ctakes-temporal ---
[INFO] 
[INFO] --- maven-remote-resources-plugin:1.4:process (default) @ ctakes-temporal ---
Downloading: http://repo.maven.apache.org/maven2/jwnl/jwnl/1.3.3/jwnl-1.3.3.pom
[debug] execute contextualize
[INFO] [INFO] Using 'UTF-8' encoding to copy filtered resources.
[INFO] Copying 2 resources

[INFO] --- maven-resources-plugin:2.5:resources (default-resources) @ ctakes-temporal ---[INFO]
Copying 3 resources

[INFO] 
[INFO] --- maven-compiler-plugin:2.4:compile (default-compile) @ ctakes-temporal ---
[INFO] Compiling 70 source files to <https://builds.apache.org/job/ctakes-trunk-compiletest/ws/ctakes-temporal/target/classes>
[INFO] -------------------------------------------------------------
[ERROR] COMPILATION ERROR : 
[INFO] -------------------------------------------------------------
[ERROR] <https://builds.apache.org/job/ctakes-trunk-compiletest/ws/ctakes-temporal/src/main/java/org/apache/ctakes/temporal/eval/Evaluation_ImplBase.java>:[260,17]
cannot find symbol
symbol  : variable TAG_DICTIONARY_PARAM
location: class org.apache.ctakes.postagger.POSTagger
[ERROR] <https://builds.apache.org/job/ctakes-trunk-compiletest/ws/ctakes-temporal/src/main/java/org/apache/ctakes/temporal/eval/Evaluation_ImplBase.java>:[269,19]
[deprecation] locateFile(java.lang.String) in org.apache.ctakes.core.resource.FileLocator
has been deprecated
[ERROR] <https://builds.apache.org/job/ctakes-trunk-compiletest/ws/ctakes-temporal/src/main/java/org/apache/ctakes/temporal/pipelines/EventAndTimeExtractionPipeline.java>:[152,17]
cannot find symbol
symbol  : variable TAG_DICTIONARY_PARAM
location: class org.apache.ctakes.postagger.POSTagger
[ERROR] <https://builds.apache.org/job/ctakes-trunk-compiletest/ws/ctakes-temporal/src/main/java/org/apache/ctakes/temporal/pipelines/EventAndTimeExtractionPipeline.java>:[161,19]
[deprecation] locateFile(java.lang.String) in org.apache.ctakes.core.resource.FileLocator
has been deprecated
[ERROR] <https://builds.apache.org/job/ctakes-trunk-compiletest/ws/ctakes-temporal/src/main/java/org/apache/ctakes/temporal/pipelines/EventExtractionPipeline.java>:[145,17]
cannot find symbol
symbol  : variable TAG_DICTIONARY_PARAM
location: class org.apache.ctakes.postagger.POSTagger
[ERROR] <https://builds.apache.org/job/ctakes-trunk-compiletest/ws/ctakes-temporal/src/main/java/org/apache/ctakes/temporal/pipelines/EventExtractionPipeline.java>:[154,19]
[deprecation] locateFile(java.lang.String) in org.apache.ctakes.core.resource.FileLocator
has been deprecated
[INFO] 6 errors 
[INFO] -------------------------------------------------------------
[INFO] ------------------------------------------------------------------------
[INFO] Reactor Summary:
[INFO] 
[INFO] Apache cTAKES ..................................... SUCCESS [19.643s]
[INFO] Apache cTAKES common type system .................. SUCCESS [12.307s]
[INFO] Apache cTAKES utils ............................... SUCCESS [4.422s]
[INFO] Apache cTAKES Resources core ...................... SUCCESS [1.422s]
[INFO] Apache cTAKES core ................................ SUCCESS [26.560s]
[INFO] Apache cTAKES Resources pos-tagger ................ SUCCESS [2.742s]
[INFO] Apache cTAKES part-of-speech tagger ............... SUCCESS [8.419s]
[INFO] Apache cTAKES Resources ctakes-chunker-res ........ SUCCESS [4.596s]
[INFO] Apache cTAKES chunker ............................. SUCCESS [3.185s]
[INFO] Apache cTAKES document preprocessor ............... SUCCESS [4.097s]
[INFO] Apache cTAKES Resources dictionary-lookup ......... SUCCESS [1.780s]
[INFO] Apache cTAKES dictionary lookup ................... SUCCESS [28.186s]
[INFO] Apache cTAKES context dependent tokenizer ......... SUCCESS [2.266s]
[INFO] Apache cTAKES Resources lvg ....................... SUCCESS [1.604s]
[INFO] Apache cTAKES LVG lexical tools ................... SUCCESS [4.180s]
[INFO] Apache cTAKES Resources ne-contexts ............... SUCCESS [1.851s]
[INFO] Apache cTAKES named entity contexts ............... SUCCESS [4.144s]
[INFO] Apache cTAKES Resources constituency-parser ....... SUCCESS [6.365s]
[INFO] Apache cTAKES Constituency Parser ................. SUCCESS [3.457s]
[INFO] Apache cTAKES Resources coreference ............... SUCCESS [3.003s]
[INFO] Apache cTAKES Resources relation-extractor ........ SUCCESS [2.307s]
[INFO] Apache cTAKES Resources dependency-parser ......... SUCCESS [15.077s]
[INFO] Apache cTAKES Dependency Parser ................... SUCCESS [40.841s]
[INFO] Apache cTAKES Relation Extractor .................. SUCCESS [11.935s]
[INFO] Apache cTAKES CoReference Resolver ................ SUCCESS [5.170s]
[INFO] Apache cTAKES Resources drug-ner .................. SUCCESS [2.179s]
[INFO] Apache cTAKES Drug NER ............................ SUCCESS [5.432s]
[INFO] Apache cTAKES Resources side-effect ............... SUCCESS [1.725s]
[INFO] Apache cTAKES Side Effects ........................ SUCCESS [5.722s]
[INFO] Apache cTAKES Resources smoking-status ............ SUCCESS [3.041s]
[INFO] Apache cTAKES Smoking Status ...................... SUCCESS [5.830s]
[INFO] Apache cTAKES Resources pad-term-spotter-res ...... SUCCESS [1.594s]
[INFO] Apache cTAKES Pad Term Spotter .................... SUCCESS [7.059s]
[INFO] Apache cTAKES Resources assertion ................. SUCCESS [2.204s]
[INFO] Apache cTAKES Resources assertion-zoner ........... SUCCESS [1.375s]
[INFO] Apache cTAKES Assertion's zoner ................... SUCCESS [4.057s]
[INFO] Apache cTAKES Assertion ........................... SUCCESS [5.981s]
[INFO] Apache cTAKES Resources temporal .................. SUCCESS [1.618s]
[INFO] Apache cTAKES Temporal Information Extraction ..... FAILURE [20.070s]
[INFO] Apache cTAKES ctakes-clinical-pipeline ............ SKIPPED
[INFO] Apache cTAKES Distribution ........................ SKIPPED
[INFO] Apache cTAKES Regression-test ..................... SKIPPED
[INFO] Apache cTAKES template filler ..................... SKIPPED
[INFO] ------------------------------------------------------------------------
[INFO] BUILD FAILURE
[INFO] ------------------------------------------------------------------------
[INFO] Total time: 4:58.369s
[INFO] Finished at: Mon Jul 08 22:14:22 UTC 2013
[INFO] Final Memory: 37M/140M
[INFO] ------------------------------------------------------------------------
[JENKINS] Archiving disabled
[JENKINS] Archiving disabled
[JENKINS] Archiving disabled
[JENKINS] Archiving disabled
[JENKINS] Archiving disabled
[JENKINS] Archiving disabled
[JENKINS] Archiving disabled
[JENKINS] Archiving disabled
[JENKINS] Archiving disabled
[JENKINS] Archiving disabled
[JENKINS] Archiving disabled
[JENKINS] Archiving disabled
[JENKINS] Archiving disabled
[JENKINS] Archiving disabled
[JENKINS] Archiving disabled
[JENKINS] Archiving disabled
[JENKINS] Archiving disabled
[JENKINS] Archiving disabled
[JENKINS] Archiving disabled
[JENKINS] Archiving disabled
[JENKINS] Archiving disabled
[JENKINS] Archiving disabled
[JENKINS] Archiving disabled
[JENKINS] Archiving disabled
[JENKINS] Archiving disabled
[JENKINS] Archiving disabled
[JENKINS] Archiving disabled
[JENKINS] Archiving disabled
[JENKINS] Archiving disabled
[JENKINS] Archiving disabled
[JENKINS] Archiving disabled
[JENKINS] Archiving disabled
[JENKINS] Archiving disabled
[JENKINS] Archiving disabled
[JENKINS] Archiving disabled
[JENKINS] Archiving disabled
[JENKINS] Archiving disabled
[JENKINS] Archiving disabled
[JENKINS] Archiving disabled
[JENKINS] Archiving disabled
[JENKINS] Archiving disabled
[JENKINS] Archiving disabled
[JENKINS] Archiving disabled
Waiting for Jenkins to finish collecting data
mavenExecutionResult exceptions not empty
message : Failed to execute goal org.apache.maven.plugins:maven-compiler-plugin:2.4:compile
(default-compile) on project ctakes-temporal: Compilation failure
cause : Compilation failure
Stack trace : 
org.apache.maven.lifecycle.LifecycleExecutionException: Failed to execute goal org.apache.maven.plugins:maven-compiler-plugin:2.4:compile
(default-compile) on project ctakes-temporal: Compilation failure
	at org.apache.maven.lifecycle.internal.MojoExecutor.execute(MojoExecutor.java:213)
	at org.apache.maven.lifecycle.internal.MojoExecutor.execute(MojoExecutor.java:153)
	at org.apache.maven.lifecycle.internal.MojoExecutor.execute(MojoExecutor.java:145)
	at org.apache.maven.lifecycle.internal.LifecycleModuleBuilder.buildProject(LifecycleModuleBuilder.java:84)
	at org.apache.maven.lifecycle.internal.LifecycleModuleBuilder.buildProject(LifecycleModuleBuilder.java:59)
	at org.apache.maven.lifecycle.internal.LifecycleStarter.singleThreadedBuild(LifecycleStarter.java:183)
	at org.apache.maven.lifecycle.internal.LifecycleStarter.execute(LifecycleStarter.java:161)
	at org.apache.maven.DefaultMaven.doExecute(DefaultMaven.java:320)
	at org.apache.maven.DefaultMaven.execute(DefaultMaven.java:156)
	at org.jvnet.hudson.maven3.launcher.Maven3Launcher.main(Maven3Launcher.java:79)
	at sun.reflect.NativeMethodAccessorImpl.invoke0(Native Method)
	at sun.reflect.NativeMethodAccessorImpl.invoke(NativeMethodAccessorImpl.java:39)
	at sun.reflect.DelegatingMethodAccessorImpl.invoke(DelegatingMethodAccessorImpl.java:25)
	at java.lang.reflect.Method.invoke(Method.java:597)
	at org.codehaus.plexus.classworlds.launcher.Launcher.launchStandard(Launcher.java:329)
	at org.codehaus.plexus.classworlds.launcher.Launcher.launch(Launcher.java:239)
	at org.jvnet.hudson.maven3.agent.Maven3Main.launch(Maven3Main.java:158)
	at hudson.maven.Maven3Builder.call(Maven3Builder.java:100)
	at hudson.maven.Maven3Builder.call(Maven3Builder.java:66)
	at hudson.remoting.UserRequest.perform(UserRequest.java:118)
	at hudson.remoting.UserRequest.perform(UserRequest.java:48)
	at hudson.remoting.Request$2.run(Request.java:326)
	at hudson.remoting.InterceptingExecutorService$1.call(InterceptingExecutorService.java:72)
	at java.util.concurrent.FutureTask$Sync.innerRun(FutureTask.java:303)
	at java.util.concurrent.FutureTask.run(FutureTask.java:138)
	at java.util.concurrent.ThreadPoolExecutor$Worker.runTask(ThreadPoolExecutor.java:895)
	at java.util.concurrent.ThreadPoolExecutor$Worker.run(ThreadPoolExecutor.java:918)
	at java.lang.Thread.run(Thread.java:662)
Caused by: org.apache.maven.plugin.CompilationFailureException: Compilation failure
	at org.apache.maven.plugin.AbstractCompilerMojo.execute(AbstractCompilerMojo.java:678)
	at org.apache.maven.plugin.CompilerMojo.execute(CompilerMojo.java:128)
	at org.apache.maven.plugin.DefaultBuildPluginManager.executeMojo(DefaultBuildPluginManager.java:101)
	at org.apache.maven.lifecycle.internal.MojoExecutor.execute(MojoExecutor.java:209)
	... 27 more
Sending e-mails to: notifications@ctakes.apache.org
channel stopped

Mime
View raw message