ctakes-notifications mailing list archives

Site index · List index
Message view « Date » · « Thread »
Top « Date » · « Thread »
From Apache Jenkins Server <jenk...@builds.apache.org>
Subject Build failed in Jenkins: ctakes-trunk-compiletest #349
Date Thu, 18 Jul 2013 21:12:14 GMT
See <https://builds.apache.org/job/ctakes-trunk-compiletest/349/changes>

Changes:

[chenpei] CTAKES-76 using maven central now- deleting the physical jars from /lib

[chenpei] CTAKES-76 using maven central now- no need to copy them from lib for packing
- ctakes-assertion is upated to point four dependencies at their location on maven central:
- jcarafe-core
- jcarafe-ext
- mastif-i2b2 (previously named med-facts-i2b2)
- mastif-zoner (previously named med-facts-zoner)

[mattcoarr] As per CTAKES-76, ctakes-assertion is upated to point four dependencies at their
location on maven central:
- jcarafe-core
- jcarafe-ext
- mastif-i2b2 (previously named med-facts-i2b2)
- mastif-zoner (previously named med-facts-zoner)

------------------------------------------
[...truncated 5779 lines...]
[INFO] --- maven-remote-resources-plugin:1.4:process (default) @ ctakes-assertion-zoner ---
Downloading: http://repo.maven.apache.org/maven2/jwnl/jwnl/1.3.3/jwnl-1.3.3.pom
[debug] execute contextualize
[INFO] [INFO] Using 'UTF-8' encoding to copy filtered resources.
[INFO] Copying 1 resource
[INFO] Copying 3 resources
[INFO] Copying 3 resources

[INFO] --- maven-resources-plugin:2.5:resources (default-resources) @ ctakes-assertion-zoner
---
[INFO] JCasGen: Output going to '<https://builds.apache.org/job/ctakes-trunk-compiletest/ws/ctakes-assertion-zoner/target/generated-sources/jcasgen'>
[INFO] [INFO] JCasGen: Reading the XML TAE descriptor, and creating types, for xml input file
'<https://builds.apache.org/job/ctakes-trunk-compiletest/ws/ctakes-assertion-zoner/src/main/resources/org/apache/ctakes/assertion/zoner/types/TypeSystem.xml'.>
[INFO] JCasGen: Replacing: 'org.apache.ctakes.assertion.zoner.types.Heading'.
[INFO] JCasGen: Replacing: 'org.apache.ctakes.assertion.zoner.types.Heading_Type'.
[INFO] JCasGen: Replacing: 'org.apache.ctakes.assertion.zoner.types.Subzone'.
[INFO] JCasGen: Replacing: 'org.apache.ctakes.assertion.zoner.types.Subzone_Type'.
[INFO] JCasGen: Replacing: 'org.apache.ctakes.assertion.zoner.types.Zone'.
[INFO] JCasGen: Replacing: 'org.apache.ctakes.assertion.zoner.types.Zone_Type'.

[INFO] --- jcasgen-maven-plugin:0.9.3:generate (default) @ ctakes-assertion-zoner ---
[INFO] [INFO] Nothing to compile - all classes are up to date

[INFO] --- maven-compiler-plugin:2.4:compile (default-compile) @ ctakes-assertion-zoner ---
[debug] execute contextualize
[INFO] [INFO] Using 'UTF-8' encoding to copy filtered resources.
[INFO] skip non existing resourceDirectory <https://builds.apache.org/job/ctakes-trunk-compiletest/ws/ctakes-assertion-zoner/src/test/resources>
[INFO] Copying 3 resources
[INFO] Copying 3 resources

[INFO] --- maven-resources-plugin:2.5:testResources (default-testResources) @ ctakes-assertion-zoner
---
[INFO] [INFO] No sources to compile

[INFO] --- maven-compiler-plugin:2.4:testCompile (default-testCompile) @ ctakes-assertion-zoner
---
[INFO] [INFO] Surefire report directory: <https://builds.apache.org/job/ctakes-trunk-compiletest/ws/ctakes-assertion-zoner/target/surefire-reports>

-------------------------------------------------------
 T E S T S
-------------------------------------------------------

[INFO] --- maven-surefire-plugin:2.12:test (default-test) @ ctakes-assertion-zoner ---

Results :

Tests run: 0, Failures: 0, Errors: 0, Skipped: 0

[JENKINS] Recording test results
[INFO]                                                                         
[INFO] ------------------------------------------------------------------------
[INFO] Building Apache cTAKES Assertion 3.1.0-SNAPSHOT
[INFO] ------------------------------------------------------------------------
Downloading: http://repo.maven.apache.org/maven2/net/sf/carafe/jcarafe/jcarafe-core_2.9.1/0.9.8.3.RC4/jcarafe-core_2.9.1-0.9.8.3.RC4.pom
Downloaded: http://repo.maven.apache.org/maven2/net/sf/carafe/jcarafe/jcarafe-core_2.9.1/0.9.8.3.RC4/jcarafe-core_2.9.1-0.9.8.3.RC4.pom
(3 KB at 5.9 KB/sec)
Downloading: http://repo.maven.apache.org/maven2/net/sf/carafe/jcarafe/jcarafe-ext_2.9.1/0.9.8.3.RC4/jcarafe-ext_2.9.1-0.9.8.3.RC4.pom
Downloaded: http://repo.maven.apache.org/maven2/net/sf/carafe/jcarafe/jcarafe-ext_2.9.1/0.9.8.3.RC4/jcarafe-ext_2.9.1-0.9.8.3.RC4.pom
(3 KB at 8.9 KB/sec)
Downloading: http://repo.maven.apache.org/maven2/org/mitre/jcarafe-core_2.9.1/0.9.8.2/jcarafe-core_2.9.1-0.9.8.2.pom
Downloading: http://scala-tools.org/repo-snapshots/org/mitre/jcarafe-core_2.9.1/0.9.8.2/jcarafe-core_2.9.1-0.9.8.2.pom
Downloading: http://rcf.mitre.org/project/chatter/repo/org/mitre/jcarafe-core_2.9.1/0.9.8.2/jcarafe-core_2.9.1-0.9.8.2.pom
Downloading: http://scala-tools.org/repo-releases/org/mitre/jcarafe-core_2.9.1/0.9.8.2/jcarafe-core_2.9.1-0.9.8.2.pom
Downloading: http://repo.maven.apache.org/maven2/net/sf/trove4j/trove4j/3.0.2/trove4j-3.0.2.pom
Downloaded: http://repo.maven.apache.org/maven2/net/sf/trove4j/trove4j/3.0.2/trove4j-3.0.2.pom
(2 KB at 32.0 KB/sec)
Downloading: http://repo.maven.apache.org/maven2/net/sf/mastif/mastif-i2b2/1.4/mastif-i2b2-1.4.pom
Downloaded: http://repo.maven.apache.org/maven2/net/sf/mastif/mastif-i2b2/1.4/mastif-i2b2-1.4.pom
(7 KB at 22.3 KB/sec)
[INFO] ------------------------------------------------------------------------
[INFO] Reactor Summary:
[INFO] 
[INFO] Apache cTAKES ..................................... SUCCESS [17.287s]
[INFO] Apache cTAKES common type system .................. SUCCESS [10.226s]
[INFO] Apache cTAKES utils ............................... SUCCESS [2.827s]
[INFO] Apache cTAKES Resources core ...................... SUCCESS [2.419s]
[INFO] Apache cTAKES core ................................ SUCCESS [13.317s]
[INFO] Apache cTAKES Resources pos-tagger ................ SUCCESS [2.411s]
[INFO] Apache cTAKES part-of-speech tagger ............... SUCCESS [4.959s]
[INFO] Apache cTAKES Resources ctakes-chunker-res ........ SUCCESS [4.996s]
[INFO] Apache cTAKES chunker ............................. SUCCESS [2.607s]
[INFO] Apache cTAKES document preprocessor ............... SUCCESS [2.578s]
[INFO] Apache cTAKES Resources dictionary-lookup ......... SUCCESS [1.470s]
[INFO] Apache cTAKES dictionary lookup ................... SUCCESS [20.907s]
[INFO] Apache cTAKES context dependent tokenizer ......... SUCCESS [1.987s]
[INFO] Apache cTAKES Resources lvg ....................... SUCCESS [2.148s]
[INFO] Apache cTAKES LVG lexical tools ................... SUCCESS [3.334s]
[INFO] Apache cTAKES Resources ne-contexts ............... SUCCESS [1.270s]
[INFO] Apache cTAKES named entity contexts ............... SUCCESS [3.984s]
[INFO] Apache cTAKES Resources constituency-parser ....... SUCCESS [6.950s]
[INFO] Apache cTAKES Constituency Parser ................. SUCCESS [2.180s]
[INFO] Apache cTAKES Resources coreference ............... SUCCESS [1.686s]
[INFO] Apache cTAKES Resources relation-extractor ........ SUCCESS [1.360s]
[INFO] Apache cTAKES Resources dependency-parser ......... SUCCESS [6.280s]
[INFO] Apache cTAKES Dependency Parser ................... SUCCESS [35.405s]
[INFO] Apache cTAKES Relation Extractor .................. SUCCESS [9.441s]
[INFO] Apache cTAKES CoReference Resolver ................ SUCCESS [5.624s]
[INFO] Apache cTAKES Resources drug-ner .................. SUCCESS [1.916s]
[INFO] Apache cTAKES Drug NER ............................ SUCCESS [4.858s]
[INFO] Apache cTAKES Resources side-effect ............... SUCCESS [2.087s]
[INFO] Apache cTAKES Side Effects ........................ SUCCESS [5.944s]
[INFO] Apache cTAKES Resources smoking-status ............ SUCCESS [1.364s]
[INFO] Apache cTAKES Smoking Status ...................... SUCCESS [5.403s]
[INFO] Apache cTAKES Resources pad-term-spotter-res ...... SUCCESS [1.848s]
[INFO] Apache cTAKES Pad Term Spotter .................... SUCCESS [5.639s]
[INFO] Apache cTAKES Resources assertion ................. SUCCESS [2.564s]
[INFO] Apache cTAKES Resources assertion-zoner ........... SUCCESS [2.837s]
[INFO] Apache cTAKES Assertion's zoner ................... SUCCESS [2.175s]
[INFO] Apache cTAKES Assertion ........................... FAILURE [1.902s]
[INFO] Apache cTAKES Resources temporal .................. SKIPPED
[INFO] Apache cTAKES Temporal Information Extraction ..... SKIPPED
[INFO] Apache cTAKES ctakes-clinical-pipeline ............ SKIPPED
[INFO] Apache cTAKES Distribution ........................ SKIPPED
[INFO] Apache cTAKES Regression-test ..................... SKIPPED
[INFO] Apache cTAKES template filler ..................... SKIPPED
[INFO] ------------------------------------------------------------------------
[INFO] BUILD FAILURE
[INFO] ------------------------------------------------------------------------
[INFO] Total time: 3:35.498s
[INFO] Finished at: Thu Jul 18 21:11:43 UTC 2013
[INFO] Final Memory: 32M/134M
[INFO] ------------------------------------------------------------------------
[JENKINS] Archiving disabled
[JENKINS] Archiving disabled
[JENKINS] Archiving disabled
[JENKINS] Archiving disabled
[JENKINS] Archiving disabled
[JENKINS] Archiving disabled
[JENKINS] Archiving disabled
[JENKINS] Archiving disabled
[JENKINS] Archiving disabled
[JENKINS] Archiving disabled
[JENKINS] Archiving disabled
[JENKINS] Archiving disabled
[JENKINS] Archiving disabled
[JENKINS] Archiving disabled
[JENKINS] Archiving disabled
[JENKINS] Archiving disabled
[JENKINS] Archiving disabled
[JENKINS] Archiving disabled
[JENKINS] Archiving disabled
[JENKINS] Archiving disabled
[JENKINS] Archiving disabled
[JENKINS] Archiving disabled
[JENKINS] Archiving disabled
[JENKINS] Archiving disabled
[JENKINS] Archiving disabled
[JENKINS] Archiving disabled
[JENKINS] Archiving disabled
[JENKINS] Archiving disabled
[JENKINS] Archiving disabled
[JENKINS] Archiving disabled
[JENKINS] Archiving disabled
[JENKINS] Archiving disabled
[JENKINS] Archiving disabled
[JENKINS] Archiving disabled
[JENKINS] Archiving disabled
[JENKINS] Archiving disabled
[JENKINS] Archiving disabled
[JENKINS] Archiving disabled
[JENKINS] Archiving disabled
[JENKINS] Archiving disabled
[JENKINS] Archiving disabled
[JENKINS] Archiving disabled
[JENKINS] Archiving disabled
Waiting for Jenkins to finish collecting data
mavenExecutionResult exceptions not empty
message : Failed to execute goal on project ctakes-assertion: Could not resolve dependencies
for project org.apache.ctakes:ctakes-assertion:jar:3.1.0-SNAPSHOT: Failed to collect dependencies
for [org.apache.ctakes:ctakes-assertion-res:jar:3.1.0-SNAPSHOT (compile), org.apache.ctakes:ctakes-assertion-zoner:jar:3.1.0-SNAPSHOT
(compile), org.apache.ctakes:ctakes-type-system:jar:3.1.0-SNAPSHOT (compile), org.apache.ctakes:ctakes-dictionary-lookup:jar:3.1.0-SNAPSHOT
(compile), org.apache.ctakes:ctakes-core:jar:3.1.0-SNAPSHOT (compile), org.apache.ctakes:ctakes-constituency-parser:jar:3.1.0-SNAPSHOT
(compile), org.apache.ctakes:ctakes-utils:jar:3.1.0-SNAPSHOT (compile), org.apache.ctakes:ctakes-pos-tagger:jar:3.1.0-SNAPSHOT
(compile), org.apache.ctakes:ctakes-dependency-parser:jar:3.1.0-SNAPSHOT (compile), org.cleartk:cleartk-ml:jar:1.3.0
(compile), org.cleartk:cleartk-ml-libsvm:jar:1.2.0 (compile), org.cleartk:cleartk-ml-opennlp-maxent:jar:1.1.2
(compile), org.cleartk:cleartk-util:jar:0.9.2 (compile), org.cleartk:cleartk-eval:jar:0.9.2
(compile), args4j:args4j:jar:2.0.16 (compile), commons-io:commons-io:jar:2.0.1 (compile),
commons-lang:commons-lang:jar:2.4 (compile), commons-logging:commons-logging:jar:1.1.1 (compile),
com.google.guava:guava:jar:10.0 (compile), commons-cli:commons-cli:jar:1.2 (compile), com.carrotsearch:hppc:jar:0.4.1
(compile), jdom:jdom:jar:1.0 (compile), junit:junit:jar:[4.10,4.10] (test), log4j:log4j:jar:1.2.16
(compile), org.apache.opennlp:opennlp-maxent:jar:3.0.2-incubating (compile), org.apache.opennlp:opennlp-tools:jar:1.5.2-incubating
(compile), org.apache.lucene:lucene-core:jar:4.0.0 (compile), tw.edu.ntu.csie:libsvm:jar:3.1
(compile), org.springframework:spring-core:jar:3.1.2.RELEASE (compile), org.uimafit:uimafit:jar:1.4.0
(compile), org.codehaus.jackson:jackson-core-asl:jar:1.5.0 (compile), org.codehaus.jackson:jackson-mapper-asl:jar:1.5.0
(compile), org.scala-lang:scala-library:jar:2.9.0 (compile), org.scala-tools.sbinary:sbinary_2.9.0:jar:0.4.0
(compile), net.sf.carafe.jcarafe:jcarafe-core_2.9.1:jar:0.9.8.3.RC4 (compile), net.sf.carafe.jcarafe:jcarafe-ext_2.9.1:jar:0.9.8.3.RC4
(compile), net.sf.mastif:mastif-i2b2:jar:1.4 (compile), net.sf.mastif:mastif-zoner:jar:1.4
(compile), org.apache.ctakes:ctakes-lvg:jar:3.1.0-SNAPSHOT (compile), org.apache.ctakes:ctakes-context-tokenizer:jar:3.1.0-SNAPSHOT
(compile), org.apache.ctakes:ctakes-chunker:jar:3.1.0-SNAPSHOT (compile)]
cause : Could not resolve dependencies for project org.apache.ctakes:ctakes-assertion:jar:3.1.0-SNAPSHOT:
Failed to collect dependencies for [org.apache.ctakes:ctakes-assertion-res:jar:3.1.0-SNAPSHOT
(compile), org.apache.ctakes:ctakes-assertion-zoner:jar:3.1.0-SNAPSHOT (compile), org.apache.ctakes:ctakes-type-system:jar:3.1.0-SNAPSHOT
(compile), org.apache.ctakes:ctakes-dictionary-lookup:jar:3.1.0-SNAPSHOT (compile), org.apache.ctakes:ctakes-core:jar:3.1.0-SNAPSHOT
(compile), org.apache.ctakes:ctakes-constituency-parser:jar:3.1.0-SNAPSHOT (compile), org.apache.ctakes:ctakes-utils:jar:3.1.0-SNAPSHOT
(compile), org.apache.ctakes:ctakes-pos-tagger:jar:3.1.0-SNAPSHOT (compile), org.apache.ctakes:ctakes-dependency-parser:jar:3.1.0-SNAPSHOT
(compile), org.cleartk:cleartk-ml:jar:1.3.0 (compile), org.cleartk:cleartk-ml-libsvm:jar:1.2.0
(compile), org.cleartk:cleartk-ml-opennlp-maxent:jar:1.1.2 (compile), org.cleartk:cleartk-util:jar:0.9.2
(compile), org.cleartk:cleartk-eval:jar:0.9.2 (compile), args4j:args4j:jar:2.0.16 (compile),
commons-io:commons-io:jar:2.0.1 (compile), commons-lang:commons-lang:jar:2.4 (compile), commons-logging:commons-logging:jar:1.1.1
(compile), com.google.guava:guava:jar:10.0 (compile), commons-cli:commons-cli:jar:1.2 (compile),
com.carrotsearch:hppc:jar:0.4.1 (compile), jdom:jdom:jar:1.0 (compile), junit:junit:jar:[4.10,4.10]
(test), log4j:log4j:jar:1.2.16 (compile), org.apache.opennlp:opennlp-maxent:jar:3.0.2-incubating
(compile), org.apache.opennlp:opennlp-tools:jar:1.5.2-incubating (compile), org.apache.lucene:lucene-core:jar:4.0.0
(compile), tw.edu.ntu.csie:libsvm:jar:3.1 (compile), org.springframework:spring-core:jar:3.1.2.RELEASE
(compile), org.uimafit:uimafit:jar:1.4.0 (compile), org.codehaus.jackson:jackson-core-asl:jar:1.5.0
(compile), org.codehaus.jackson:jackson-mapper-asl:jar:1.5.0 (compile), org.scala-lang:scala-library:jar:2.9.0
(compile), org.scala-tools.sbinary:sbinary_2.9.0:jar:0.4.0 (compile), net.sf.carafe.jcarafe:jcarafe-core_2.9.1:jar:0.9.8.3.RC4
(compile), net.sf.carafe.jcarafe:jcarafe-ext_2.9.1:jar:0.9.8.3.RC4 (compile), net.sf.mastif:mastif-i2b2:jar:1.4
(compile), net.sf.mastif:mastif-zoner:jar:1.4 (compile), org.apache.ctakes:ctakes-lvg:jar:3.1.0-SNAPSHOT
(compile), org.apache.ctakes:ctakes-context-tokenizer:jar:3.1.0-SNAPSHOT (compile), org.apache.ctakes:ctakes-chunker:jar:3.1.0-SNAPSHOT
(compile)]
Stack trace : 
org.apache.maven.lifecycle.LifecycleExecutionException: Failed to execute goal on project
ctakes-assertion: Could not resolve dependencies for project org.apache.ctakes:ctakes-assertion:jar:3.1.0-SNAPSHOT:
Failed to collect dependencies for [org.apache.ctakes:ctakes-assertion-res:jar:3.1.0-SNAPSHOT
(compile), org.apache.ctakes:ctakes-assertion-zoner:jar:3.1.0-SNAPSHOT (compile), org.apache.ctakes:ctakes-type-system:jar:3.1.0-SNAPSHOT
(compile), org.apache.ctakes:ctakes-dictionary-lookup:jar:3.1.0-SNAPSHOT (compile), org.apache.ctakes:ctakes-core:jar:3.1.0-SNAPSHOT
(compile), org.apache.ctakes:ctakes-constituency-parser:jar:3.1.0-SNAPSHOT (compile), org.apache.ctakes:ctakes-utils:jar:3.1.0-SNAPSHOT
(compile), org.apache.ctakes:ctakes-pos-tagger:jar:3.1.0-SNAPSHOT (compile), org.apache.ctakes:ctakes-dependency-parser:jar:3.1.0-SNAPSHOT
(compile), org.cleartk:cleartk-ml:jar:1.3.0 (compile), org.cleartk:cleartk-ml-libsvm:jar:1.2.0
(compile), org.cleartk:cleartk-ml-opennlp-maxent:jar:1.1.2 (compile), org.cleartk:cleartk-util:jar:0.9.2
(compile), org.cleartk:cleartk-eval:jar:0.9.2 (compile), args4j:args4j:jar:2.0.16 (compile),
commons-io:commons-io:jar:2.0.1 (compile), commons-lang:commons-lang:jar:2.4 (compile), commons-logging:commons-logging:jar:1.1.1
(compile), com.google.guava:guava:jar:10.0 (compile), commons-cli:commons-cli:jar:1.2 (compile),
com.carrotsearch:hppc:jar:0.4.1 (compile), jdom:jdom:jar:1.0 (compile), junit:junit:jar:[4.10,4.10]
(test), log4j:log4j:jar:1.2.16 (compile), org.apache.opennlp:opennlp-maxent:jar:3.0.2-incubating
(compile), org.apache.opennlp:opennlp-tools:jar:1.5.2-incubating (compile), org.apache.lucene:lucene-core:jar:4.0.0
(compile), tw.edu.ntu.csie:libsvm:jar:3.1 (compile), org.springframework:spring-core:jar:3.1.2.RELEASE
(compile), org.uimafit:uimafit:jar:1.4.0 (compile), org.codehaus.jackson:jackson-core-asl:jar:1.5.0
(compile), org.codehaus.jackson:jackson-mapper-asl:jar:1.5.0 (compile), org.scala-lang:scala-library:jar:2.9.0
(compile), org.scala-tools.sbinary:sbinary_2.9.0:jar:0.4.0 (compile), net.sf.carafe.jcarafe:jcarafe-core_2.9.1:jar:0.9.8.3.RC4
(compile), net.sf.carafe.jcarafe:jcarafe-ext_2.9.1:jar:0.9.8.3.RC4 (compile), net.sf.mastif:mastif-i2b2:jar:1.4
(compile), net.sf.mastif:mastif-zoner:jar:1.4 (compile), org.apache.ctakes:ctakes-lvg:jar:3.1.0-SNAPSHOT
(compile), org.apache.ctakes:ctakes-context-tokenizer:jar:3.1.0-SNAPSHOT (compile), org.apache.ctakes:ctakes-chunker:jar:3.1.0-SNAPSHOT
(compile)]
	at org.apache.maven.lifecycle.internal.LifecycleDependencyResolver.getDependencies(LifecycleDependencyResolver.java:210)
	at org.apache.maven.lifecycle.internal.LifecycleDependencyResolver.resolveProjectDependencies(LifecycleDependencyResolver.java:117)
	at org.apache.maven.lifecycle.internal.MojoExecutor.ensureDependenciesAreResolved(MojoExecutor.java:258)
	at org.apache.maven.lifecycle.internal.MojoExecutor.execute(MojoExecutor.java:201)
	at org.apache.maven.lifecycle.internal.MojoExecutor.execute(MojoExecutor.java:153)
	at org.apache.maven.lifecycle.internal.MojoExecutor.execute(MojoExecutor.java:145)
	at org.apache.maven.lifecycle.internal.LifecycleModuleBuilder.buildProject(LifecycleModuleBuilder.java:84)
	at org.apache.maven.lifecycle.internal.LifecycleModuleBuilder.buildProject(LifecycleModuleBuilder.java:59)
	at org.apache.maven.lifecycle.internal.LifecycleStarter.singleThreadedBuild(LifecycleStarter.java:183)
	at org.apache.maven.lifecycle.internal.LifecycleStarter.execute(LifecycleStarter.java:161)
	at org.apache.maven.DefaultMaven.doExecute(DefaultMaven.java:320)
	at org.apache.maven.DefaultMaven.execute(DefaultMaven.java:156)
	at org.jvnet.hudson.maven3.launcher.Maven3Launcher.main(Maven3Launcher.java:79)
	at sun.reflect.NativeMethodAccessorImpl.invoke0(Native Method)
	at sun.reflect.NativeMethodAccessorImpl.invoke(NativeMethodAccessorImpl.java:39)
	at sun.reflect.DelegatingMethodAccessorImpl.invoke(DelegatingMethodAccessorImpl.java:25)
	at java.lang.reflect.Method.invoke(Method.java:597)
	at org.codehaus.plexus.classworlds.launcher.Launcher.launchStandard(Launcher.java:329)
	at org.codehaus.plexus.classworlds.launcher.Launcher.launch(Launcher.java:239)
	at org.jvnet.hudson.maven3.agent.Maven3Main.launch(Maven3Main.java:158)
	at hudson.maven.Maven3Builder.call(Maven3Builder.java:100)
	at hudson.maven.Maven3Builder.call(Maven3Builder.java:66)
	at hudson.remoting.UserRequest.perform(UserRequest.java:118)
	at hudson.remoting.UserRequest.perform(UserRequest.java:48)
	at hudson.remoting.Request$2.run(Request.java:326)
	at hudson.remoting.InterceptingExecutorService$1.call(InterceptingExecutorService.java:72)
	at java.util.concurrent.FutureTask$Sync.innerRun(FutureTask.java:303)
	at java.util.concurrent.FutureTask.run(FutureTask.java:138)
	at java.util.concurrent.ThreadPoolExecutor$Worker.runTask(ThreadPoolExecutor.java:895)
	at java.util.concurrent.ThreadPoolExecutor$Worker.run(ThreadPoolExecutor.java:918)
	at java.lang.Thread.run(Thread.java:662)
Caused by: org.apache.maven.project.DependencyResolutionException: Could not resolve dependencies
for project org.apache.ctakes:ctakes-assertion:jar:3.1.0-SNAPSHOT: Failed to collect dependencies
for [org.apache.ctakes:ctakes-assertion-res:jar:3.1.0-SNAPSHOT (compile), org.apache.ctakes:ctakes-assertion-zoner:jar:3.1.0-SNAPSHOT
(compile), org.apache.ctakes:ctakes-type-system:jar:3.1.0-SNAPSHOT (compile), org.apache.ctakes:ctakes-dictionary-lookup:jar:3.1.0-SNAPSHOT
(compile), org.apache.ctakes:ctakes-core:jar:3.1.0-SNAPSHOT (compile), org.apache.ctakes:ctakes-constituency-parser:jar:3.1.0-SNAPSHOT
(compile), org.apache.ctakes:ctakes-utils:jar:3.1.0-SNAPSHOT (compile), org.apache.ctakes:ctakes-pos-tagger:jar:3.1.0-SNAPSHOT
(compile), org.apache.ctakes:ctakes-dependency-parser:jar:3.1.0-SNAPSHOT (compile), org.cleartk:cleartk-ml:jar:1.3.0
(compile), org.cleartk:cleartk-ml-libsvm:jar:1.2.0 (compile), org.cleartk:cleartk-ml-opennlp-maxent:jar:1.1.2
(compile), org.cleartk:cleartk-util:jar:0.9.2 (compile), org.cleartk:cleartk-eval:jar:0.9.2
(compile), args4j:args4j:jar:2.0.16 (compile), commons-io:commons-io:jar:2.0.1 (compile),
commons-lang:commons-lang:jar:2.4 (compile), commons-logging:commons-logging:jar:1.1.1 (compile),
com.google.guava:guava:jar:10.0 (compile), commons-cli:commons-cli:jar:1.2 (compile), com.carrotsearch:hppc:jar:0.4.1
(compile), jdom:jdom:jar:1.0 (compile), junit:junit:jar:[4.10,4.10] (test), log4j:log4j:jar:1.2.16
(compile), org.apache.opennlp:opennlp-maxent:jar:3.0.2-incubating (compile), org.apache.opennlp:opennlp-tools:jar:1.5.2-incubating
(compile), org.apache.lucene:lucene-core:jar:4.0.0 (compile), tw.edu.ntu.csie:libsvm:jar:3.1
(compile), org.springframework:spring-core:jar:3.1.2.RELEASE (compile), org.uimafit:uimafit:jar:1.4.0
(compile), org.codehaus.jackson:jackson-core-asl:jar:1.5.0 (compile), org.codehaus.jackson:jackson-mapper-asl:jar:1.5.0
(compile), org.scala-lang:scala-library:jar:2.9.0 (compile), org.scala-tools.sbinary:sbinary_2.9.0:jar:0.4.0
(compile), net.sf.carafe.jcarafe:jcarafe-core_2.9.1:jar:0.9.8.3.RC4 (compile), net.sf.carafe.jcarafe:jcarafe-ext_2.9.1:jar:0.9.8.3.RC4
(compile), net.sf.mastif:mastif-i2b2:jar:1.4 (compile), net.sf.mastif:mastif-zoner:jar:1.4
(compile), org.apache.ctakes:ctakes-lvg:jar:3.1.0-SNAPSHOT (compile), org.apache.ctakes:ctakes-context-tokenizer:jar:3.1.0-SNAPSHOT
(compile), org.apache.ctakes:ctakes-chunker:jar:3.1.0-SNAPSHOT (compile)]
	at org.apache.maven.project.DefaultProjectDependenciesResolver.resolve(DefaultProjectDependenciesResolver.java:158)
	at org.apache.maven.lifecycle.internal.LifecycleDependencyResolver.getDependencies(LifecycleDependencyResolver.java:185)
	... 30 more
Caused by: org.sonatype.aether.collection.DependencyCollectionException: Failed to collect
dependencies for [org.apache.ctakes:ctakes-assertion-res:jar:3.1.0-SNAPSHOT (compile), org.apache.ctakes:ctakes-assertion-zoner:jar:3.1.0-SNAPSHOT
(compile), org.apache.ctakes:ctakes-type-system:jar:3.1.0-SNAPSHOT (compile), org.apache.ctakes:ctakes-dictionary-lookup:jar:3.1.0-SNAPSHOT
(compile), org.apache.ctakes:ctakes-core:jar:3.1.0-SNAPSHOT (compile), org.apache.ctakes:ctakes-constituency-parser:jar:3.1.0-SNAPSHOT
(compile), org.apache.ctakes:ctakes-utils:jar:3.1.0-SNAPSHOT (compile), org.apache.ctakes:ctakes-pos-tagger:jar:3.1.0-SNAPSHOT
(compile), org.apache.ctakes:ctakes-dependency-parser:jar:3.1.0-SNAPSHOT (compile), org.cleartk:cleartk-ml:jar:1.3.0
(compile), org.cleartk:cleartk-ml-libsvm:jar:1.2.0 (compile), org.cleartk:cleartk-ml-opennlp-maxent:jar:1.1.2
(compile), org.cleartk:cleartk-util:jar:0.9.2 (compile), org.cleartk:cleartk-eval:jar:0.9.2
(compile), args4j:args4j:jar:2.0.16 (compile), commons-io:commons-io:jar:2.0.1 (compile),
commons-lang:commons-lang:jar:2.4 (compile), commons-logging:commons-logging:jar:1.1.1 (compile),
com.google.guava:guava:jar:10.0 (compile), commons-cli:commons-cli:jar:1.2 (compile), com.carrotsearch:hppc:jar:0.4.1
(compile), jdom:jdom:jar:1.0 (compile), junit:junit:jar:[4.10,4.10] (test), log4j:log4j:jar:1.2.16
(compile), org.apache.opennlp:opennlp-maxent:jar:3.0.2-incubating (compile), org.apache.opennlp:opennlp-tools:jar:1.5.2-incubating
(compile), org.apache.lucene:lucene-core:jar:4.0.0 (compile), tw.edu.ntu.csie:libsvm:jar:3.1
(compile), org.springframework:spring-core:jar:3.1.2.RELEASE (compile), org.uimafit:uimafit:jar:1.4.0
(compile), org.codehaus.jackson:jackson-core-asl:jar:1.5.0 (compile), org.codehaus.jackson:jackson-mapper-asl:jar:1.5.0
(compile), org.scala-lang:scala-library:jar:2.9.0 (compile), org.scala-tools.sbinary:sbinary_2.9.0:jar:0.4.0
(compile), net.sf.carafe.jcarafe:jcarafe-core_2.9.1:jar:0.9.8.3.RC4 (compile), net.sf.carafe.jcarafe:jcarafe-ext_2.9.1:jar:0.9.8.3.RC4
(compile), net.sf.mastif:mastif-i2b2:jar:1.4 (compile), net.sf.mastif:mastif-zoner:jar:1.4
(compile), org.apache.ctakes:ctakes-lvg:jar:3.1.0-SNAPSHOT (compile), org.apache.ctakes:ctakes-context-tokenizer:jar:3.1.0-SNAPSHOT
(compile), org.apache.ctakes:ctakes-chunker:jar:3.1.0-SNAPSHOT (compile)]
	at org.sonatype.aether.impl.internal.DefaultDependencyCollector.collectDependencies(DefaultDependencyCollector.java:258)
	at org.sonatype.aether.impl.internal.DefaultRepositorySystem.collectDependencies(DefaultRepositorySystem.java:308)
	at org.apache.maven.project.DefaultProjectDependenciesResolver.resolve(DefaultProjectDependenciesResolver.java:150)
	... 31 more
Caused by: org.sonatype.aether.resolution.ArtifactDescriptorException: Failed to read artifact
descriptor for org.mitre:jcarafe-core_2.9.1:jar:0.9.8.2
	at org.apache.maven.repository.internal.DefaultArtifactDescriptorReader.loadPom(DefaultArtifactDescriptorReader.java:296)
	at org.apache.maven.repository.internal.DefaultArtifactDescriptorReader.readArtifactDescriptor(DefaultArtifactDescriptorReader.java:186)
	at org.sonatype.aether.impl.internal.DefaultDependencyCollector.process(DefaultDependencyCollector.java:412)
	at org.sonatype.aether.impl.internal.DefaultDependencyCollector.process(DefaultDependencyCollector.java:544)
	at org.sonatype.aether.impl.internal.DefaultDependencyCollector.collectDependencies(DefaultDependencyCollector.java:240)
	... 33 more
Caused by: org.sonatype.aether.resolution.ArtifactResolutionException: Could not transfer
artifact org.mitre:jcarafe-core_2.9.1:pom:0.9.8.2 from/to mitrechatterrepository (http://rcf.mitre.org/project/chatter/repo/):
rcf.mitre.org
	at org.sonatype.aether.impl.internal.DefaultArtifactResolver.resolve(DefaultArtifactResolver.java:538)
	at org.sonatype.aether.impl.internal.DefaultArtifactResolver.resolveArtifacts(DefaultArtifactResolver.java:216)
	at org.sonatype.aether.impl.internal.DefaultArtifactResolver.resolveArtifact(DefaultArtifactResolver.java:193)
	at org.apache.maven.repository.internal.DefaultArtifactDescriptorReader.loadPom(DefaultArtifactDescriptorReader.java:281)
	... 37 more
Caused by: org.sonatype.aether.transfer.ArtifactTransferException: Could not transfer artifact
org.mitre:jcarafe-core_2.9.1:pom:0.9.8.2 from/to mitrechatterrepository (http://rcf.mitre.org/project/chatter/repo/):
rcf.mitre.org
	at org.sonatype.aether.connector.wagon.WagonRepositoryConnector$4.wrap(WagonRepositoryConnector.java:951)
	at org.sonatype.aether.connector.wagon.WagonRepositoryConnector$4.wrap(WagonRepositoryConnector.java:941)
	at org.sonatype.aether.connector.wagon.WagonRepositoryConnector$GetTask.run(WagonRepositoryConnector.java:669)
	at org.sonatype.aether.util.concurrency.RunnableErrorForwarder$1.run(RunnableErrorForwarder.java:60)
	... 3 more
Caused by: org.apache.maven.wagon.TransferFailedException: rcf.mitre.org
	at org.apache.maven.wagon.shared.http4.AbstractHttpClientWagon.fillInputData(AbstractHttpClientWagon.java:799)
	at org.apache.maven.wagon.StreamWagon.getInputStream(StreamWagon.java:116)
	at org.apache.maven.wagon.StreamWagon.getIfNewer(StreamWagon.java:88)
	at org.apache.maven.wagon.StreamWagon.get(StreamWagon.java:61)
	at org.sonatype.aether.connector.wagon.WagonRepositoryConnector$GetTask.run(WagonRepositoryConnector.java:601)
	... 4 more
Caused by: java.net.UnknownHostException: rcf.mitre.org
	at java.net.Inet6AddressImpl.lookupAllHostAddr(Native Method)
	at java.net.InetAddress$1.lookupAllHostAddr(InetAddress.java:876)
	at java.net.InetAddress.getAddressFromNameService(InetAddress.java:1229)
	at java.net.InetAddress.getAllByName0(InetAddress.java:1180)
	at java.net.InetAddress.getAllByName(InetAddress.java:1110)
	at java.net.InetAddress.getAllByName(InetAddress.java:1046)
	at org.apache.maven.wagon.providers.http.httpclient.impl.conn.DefaultClientConnectionOperator.resolveHostname(DefaultClientConnectionOperator.java:242)
	at org.apache.maven.wagon.providers.http.httpclient.impl.conn.DefaultClientConnectionOperator.openConnection(DefaultClientConnectionOperator.java:130)
	at org.apache.maven.wagon.providers.http.httpclient.impl.conn.AbstractPoolEntry.open(AbstractPoolEntry.java:149)
	at org.apache.maven.wagon.providers.http.httpclient.impl.conn.AbstractPooledConnAdapter.open(AbstractPooledConnAdapter.java:121)
	at org.apache.maven.wagon.providers.http.httpclient.impl.client.DefaultRequestDirector.tryConnect(DefaultRequestDirector.java:573)
	at org.apache.maven.wagon.providers.http.httpclient.impl.client.DefaultRequestDirector.execute(DefaultRequestDirector.java:425)
	at org.apache.maven.wagon.providers.http.httpclient.impl.client.AbstractHttpClient.execute(AbstractHttpClient.java:820)
	at org.apache.maven.wagon.providers.http.httpclient.impl.client.AbstractHttpClient.execute(AbstractHttpClient.java:754)
	at org.apache.maven.wagon.shared.http4.AbstractHttpClientWagon.execute(AbstractHttpClientWagon.java:674)
	at org.apache.maven.wagon.shared.http4.AbstractHttpClientWagon.fillInputData(AbstractHttpClientWagon.java:793)
	... 8 more
Sending e-mails to: notifications@ctakes.apache.org mcoarr@mitre.org pei@peistation.com
channel stopped

Mime
View raw message