ctakes-notifications mailing list archives

Site index · List index
Message view « Date » · « Thread »
Top « Date » · « Thread »
From Apache Jenkins Server <jenk...@builds.apache.org>
Subject Build failed in Jenkins: ctakes-trunk-compiletest » Apache cTAKES ctakes-clinical-pipeline #338
Date Thu, 11 Jul 2013 20:46:33 GMT
See <https://builds.apache.org/job/ctakes-trunk-compiletest/org.apache.ctakes$ctakes-clinical-pipeline/338/>

------------------------------------------
[INFO]                                                                         
[INFO] ------------------------------------------------------------------------
[INFO] Building Apache cTAKES ctakes-clinical-pipeline 3.1.0-SNAPSHOT
[INFO] ------------------------------------------------------------------------
[INFO] Deleting <https://builds.apache.org/job/ctakes-trunk-compiletest/org.apache.ctakes$ctakes-clinical-pipeline/ws/target>
[INFO] 
[INFO] --- maven-clean-plugin:2.4.1:clean (default-clean) @ ctakes-clinical-pipeline ---
[INFO] 
[INFO] --- maven-remote-resources-plugin:1.4:process (default) @ ctakes-clinical-pipeline
---
Downloading: http://repo.maven.apache.org/maven2/jwnl/jwnl/1.3.3/jwnl-1.3.3.pom
[debug] execute contextualize
[INFO] Using 'UTF-8' encoding to copy filtered resources.
[INFO] skip non existing resourceDirectory <https://builds.apache.org/job/ctakes-trunk-compiletest/org.apache.ctakes$ctakes-clinical-pipeline/ws/src/main/resources>
[INFO] [INFO] Copying 3 resources

[INFO] --- maven-resources-plugin:2.5:resources (default-resources) @ ctakes-clinical-pipeline
---
[INFO] 
[INFO] --- maven-compiler-plugin:2.4:compile (default-compile) @ ctakes-clinical-pipeline
---
[INFO] Compiling 4 source files to <https://builds.apache.org/job/ctakes-trunk-compiletest/org.apache.ctakes$ctakes-clinical-pipeline/ws/target/classes>
[INFO] -------------------------------------------------------------
[ERROR] COMPILATION ERROR : 
[INFO] -------------------------------------------------------------
[ERROR] <https://builds.apache.org/job/ctakes-trunk-compiletest/org.apache.ctakes$ctakes-clinical-pipeline/ws/src/main/java/org/apache/ctakes/clinicalpipeline/runtime/BagOfAnnotationsGenerator.java>:[74,55]
[unchecked] unchecked cast
found   : java.lang.reflect.Type
required: java.lang.Class<T>
[ERROR] <https://builds.apache.org/job/ctakes-trunk-compiletest/org.apache.ctakes$ctakes-clinical-pipeline/ws/src/main/java/org/apache/ctakes/clinicalpipeline/ae/ExtractionPrepAnnotator.java>:[167,17]
[unchecked] unchecked call to add(E) as a member of the raw type java.util.Set
[ERROR] <https://builds.apache.org/job/ctakes-trunk-compiletest/org.apache.ctakes$ctakes-clinical-pipeline/ws/src/main/java/org/apache/ctakes/clinicalpipeline/ClinicalPipelineWithUmls.java>:[56,94]
cannot find symbol
symbol  : variable CORPUS_WO_GOLD_STD_TO_RUN_THROUGH_CTAKES
location: class org.apache.ctakes.assertion.util.AssertionConst
[ERROR] <https://builds.apache.org/job/ctakes-trunk-compiletest/org.apache.ctakes$ctakes-clinical-pipeline/ws/src/main/java/org/apache/ctakes/clinicalpipeline/ClinicalPipelineWithUmls.java>:[58,64]
cannot find symbol
symbol  : variable CORPUS_WO_GOLD_STD_TO_RUN_THROUGH_CTAKES
location: class org.apache.ctakes.assertion.util.AssertionConst
[INFO] 4 errors 
[INFO] -------------------------------------------------------------

Mime
View raw message