ctakes-notifications mailing list archives

Site index · List index
Message view « Date » · « Thread »
Top « Date » · « Thread »
From Apache Jenkins Server <jenk...@builds.apache.org>
Subject Build failed in Jenkins: ctakes-trunk-compiletest » Apache cTAKES Assertion #336
Date Thu, 11 Jul 2013 16:10:02 GMT
See <https://builds.apache.org/job/ctakes-trunk-compiletest/org.apache.ctakes$ctakes-assertion/336/changes>

Changes:

[james-masanz] get even more context if user enters m again

[tmill] Made dep path features somewhat self-documenting. Added back in one broken dep feature.

------------------------------------------
[INFO]                                                                         
[INFO] ------------------------------------------------------------------------
[INFO] Building Apache cTAKES Assertion 3.1.0-SNAPSHOT
[INFO] ------------------------------------------------------------------------
[INFO] [INFO] Deleting <https://builds.apache.org/job/ctakes-trunk-compiletest/org.apache.ctakes$ctakes-assertion/ws/target>

[INFO] --- maven-clean-plugin:2.4.1:clean (default-clean) @ ctakes-assertion ---
[INFO] 
[INFO] --- maven-remote-resources-plugin:1.4:process (default) @ ctakes-assertion ---
Downloading: http://repo.maven.apache.org/maven2/jwnl/jwnl/1.3.3/jwnl-1.3.3.pom
[debug] execute contextualize
[INFO] [INFO] Using 'UTF-8' encoding to copy filtered resources.

[INFO] --- maven-resources-plugin:2.5:resources (default-resources) @ ctakes-assertion ---
[INFO] Copying 1 resource
[INFO] Copying 3 resources
[INFO] [INFO] JCasGen: Output going to '<https://builds.apache.org/job/ctakes-trunk-compiletest/org.apache.ctakes$ctakes-assertion/ws/target/generated-sources/jcasgen'>
[INFO] JCasGen: Reading the XML TAE descriptor, and creating types, for xml input file '<https://builds.apache.org/job/ctakes-trunk-compiletest/org.apache.ctakes$ctakes-assertion/ws/src/main/resources/org/apache/ctakes/assertion/types/TypeSystem.xml'.>
[INFO] JCasGen: Creating: 'org.apache.ctakes.assertion.medfacts.types.Assertion'.
[INFO] JCasGen: Creating: 'org.apache.ctakes.assertion.medfacts.types.Assertion_Type'.
[INFO] JCasGen: Creating: 'org.apache.ctakes.assertion.medfacts.types.Concept'.
[INFO] JCasGen: Creating: 'org.apache.ctakes.assertion.medfacts.types.Concept_Type'.

[INFO] --- jcasgen-maven-plugin:0.9.3:generate (default) @ ctakes-assertion ---
[INFO] 
[INFO] --- maven-compiler-plugin:2.4:compile (default-compile) @ ctakes-assertion ---
[INFO] Compiling 71 source files to <https://builds.apache.org/job/ctakes-trunk-compiletest/org.apache.ctakes$ctakes-assertion/ws/target/classes>
[INFO] -------------------------------------------------------------
[ERROR] COMPILATION ERROR : 
[INFO] -------------------------------------------------------------
[ERROR] <https://builds.apache.org/job/ctakes-trunk-compiletest/org.apache.ctakes$ctakes-assertion/ws/src/main/java/org/apache/ctakes/assertion/medfacts/cleartk/TrainAssertionModel.java>:[41,29]
[deprecation] org.cleartk.classifier.CleartkAnnotatorDescriptionFactory in org.cleartk.classifier
has been deprecated
[ERROR] <https://builds.apache.org/job/ctakes-trunk-compiletest/org.apache.ctakes$ctakes-assertion/ws/src/main/java/org/apache/ctakes/assertion/medfacts/cleartk/TrainAssertionModel.java>:[45,37]
[deprecation] org.cleartk.classifier.opennlp.DefaultMaxentDataWriterFactory in org.cleartk.classifier.opennlp
has been deprecated
[ERROR] <https://builds.apache.org/job/ctakes-trunk-compiletest/org.apache.ctakes$ctakes-assertion/ws/src/main/java/org/apache/ctakes/assertion/medfacts/cleartk/TrainAssertionModel.java>:[46,37]
[deprecation] org.cleartk.classifier.opennlp.MaxentDataWriter in org.cleartk.classifier.opennlp
has been deprecated
[ERROR] <https://builds.apache.org/job/ctakes-trunk-compiletest/org.apache.ctakes$ctakes-assertion/ws/src/main/java/org/apache/ctakes/assertion/medfacts/cleartk/SubjectCleartkAnalysisEngine.java>:[31,47]
[deprecation] org.cleartk.classifier.feature.extractor.ContextExtractor in org.cleartk.classifier.feature.extractor
has been deprecated
[ERROR] <https://builds.apache.org/job/ctakes-trunk-compiletest/org.apache.ctakes$ctakes-assertion/ws/src/main/java/org/apache/ctakes/assertion/medfacts/cleartk/CreateAssertionDescriptor.java>:[21,37]
[deprecation] org.cleartk.classifier.opennlp.DefaultMaxentDataWriterFactory in org.cleartk.classifier.opennlp
has been deprecated
[ERROR] <https://builds.apache.org/job/ctakes-trunk-compiletest/org.apache.ctakes$ctakes-assertion/ws/src/main/java/org/apache/ctakes/assertion/medfacts/cleartk/AssertionSampleFeatureGenerator.java>:[8,54]
[deprecation] org.cleartk.classifier.feature.extractor.simple.SpannedTextExtractor in org.cleartk.classifier.feature.extractor.simple
has been deprecated
[ERROR] <https://builds.apache.org/job/ctakes-trunk-compiletest/org.apache.ctakes$ctakes-assertion/ws/src/main/java/org/apache/ctakes/assertion/medfacts/cleartk/AssertionSampleFeatureGenerator.java>:[9,49]
[deprecation] org.cleartk.classifier.feature.proliferate.CapitalTypeProliferator in org.cleartk.classifier.feature.proliferate
has been deprecated
[ERROR] <https://builds.apache.org/job/ctakes-trunk-compiletest/org.apache.ctakes$ctakes-assertion/ws/src/main/java/org/apache/ctakes/assertion/medfacts/cleartk/AssertionSampleFeatureGenerator.java>:[10,49]
[deprecation] org.cleartk.classifier.feature.proliferate.CharacterNGramProliferator in org.cleartk.classifier.feature.proliferate
has been deprecated
[ERROR] <https://builds.apache.org/job/ctakes-trunk-compiletest/org.apache.ctakes$ctakes-assertion/ws/src/main/java/org/apache/ctakes/assertion/medfacts/cleartk/AssertionSampleFeatureGenerator.java>:[11,49]
[deprecation] org.cleartk.classifier.feature.proliferate.LowerCaseProliferator in org.cleartk.classifier.feature.proliferate
has been deprecated
[ERROR] <https://builds.apache.org/job/ctakes-trunk-compiletest/org.apache.ctakes$ctakes-assertion/ws/src/main/java/org/apache/ctakes/assertion/medfacts/cleartk/AssertionSampleFeatureGenerator.java>:[12,49]
[deprecation] org.cleartk.classifier.feature.proliferate.NumericTypeProliferator in org.cleartk.classifier.feature.proliferate
has been deprecated
[ERROR] <https://builds.apache.org/job/ctakes-trunk-compiletest/org.apache.ctakes$ctakes-assertion/ws/src/main/java/org/apache/ctakes/assertion/medfacts/cleartk/AssertionSampleFeatureGenerator.java>:[13,49]
[deprecation] org.cleartk.classifier.feature.proliferate.ProliferatingExtractor in org.cleartk.classifier.feature.proliferate
has been deprecated
[ERROR] <https://builds.apache.org/job/ctakes-trunk-compiletest/org.apache.ctakes$ctakes-assertion/ws/src/main/java/org/apache/ctakes/assertion/util/NegationManualDepContextAnalyzer.java>:[159,33]
cannot find symbol
symbol  : method getName()
location: class org.apache.ctakes.dependency.parser.util.DependencyRegex
[ERROR] <https://builds.apache.org/job/ctakes-trunk-compiletest/org.apache.ctakes$ctakes-assertion/ws/src/main/java/org/apache/ctakes/assertion/util/NegationDepRegex.java>:[463,5]
cannot find symbol
symbol  : constructor DependencyRegex(com.googlecode.clearnlp.dependency.DEPNode[],int,java.lang.String)
location: class org.apache.ctakes.dependency.parser.util.DependencyRegex
[ERROR] <https://builds.apache.org/job/ctakes-trunk-compiletest/org.apache.ctakes$ctakes-assertion/ws/src/main/java/org/apache/ctakes/assertion/util/NegationDepRegex.java>:[467,5]
cannot find symbol
symbol  : constructor DependencyRegex(com.googlecode.clearnlp.dependency.DEPNode[],int,java.lang.String)
location: class org.apache.ctakes.dependency.parser.util.DependencyRegex
[ERROR] <https://builds.apache.org/job/ctakes-trunk-compiletest/org.apache.ctakes$ctakes-assertion/ws/src/main/java/org/apache/ctakes/assertion/util/NegationDepRegex.java>:[471,5]
cannot find symbol
symbol  : constructor DependencyRegex(com.googlecode.clearnlp.dependency.DEPNode[],int,java.lang.String)
location: class org.apache.ctakes.dependency.parser.util.DependencyRegex
[ERROR] <https://builds.apache.org/job/ctakes-trunk-compiletest/org.apache.ctakes$ctakes-assertion/ws/src/main/java/org/apache/ctakes/assertion/util/NegationDepRegex.java>:[475,5]
cannot find symbol
symbol  : constructor DependencyRegex(com.googlecode.clearnlp.dependency.DEPNode[],int,java.lang.String)
location: class org.apache.ctakes.dependency.parser.util.DependencyRegex
[ERROR] <https://builds.apache.org/job/ctakes-trunk-compiletest/org.apache.ctakes$ctakes-assertion/ws/src/main/java/org/apache/ctakes/assertion/util/NegationDepRegex.java>:[479,5]
cannot find symbol
symbol  : constructor DependencyRegex(com.googlecode.clearnlp.dependency.DEPNode[],int,java.lang.String)
location: class org.apache.ctakes.dependency.parser.util.DependencyRegex
[ERROR] <https://builds.apache.org/job/ctakes-trunk-compiletest/org.apache.ctakes$ctakes-assertion/ws/src/main/java/org/apache/ctakes/assertion/util/NegationDepRegex.java>:[484,5]
cannot find symbol
symbol  : constructor DependencyRegex(com.googlecode.clearnlp.dependency.DEPNode[],int,java.lang.String)
location: class org.apache.ctakes.dependency.parser.util.DependencyRegex
[ERROR] <https://builds.apache.org/job/ctakes-trunk-compiletest/org.apache.ctakes$ctakes-assertion/ws/src/main/java/org/apache/ctakes/assertion/util/NegationDepRegex.java>:[490,5]
cannot find symbol
symbol  : constructor DependencyRegex(com.googlecode.clearnlp.dependency.DEPNode[],int,java.lang.String)
location: class org.apache.ctakes.dependency.parser.util.DependencyRegex
[ERROR] <https://builds.apache.org/job/ctakes-trunk-compiletest/org.apache.ctakes$ctakes-assertion/ws/src/main/java/org/apache/ctakes/assertion/util/NegationDepRegex.java>:[494,5]
cannot find symbol
symbol  : constructor DependencyRegex(com.googlecode.clearnlp.dependency.DEPNode[],int,java.lang.String)
location: class org.apache.ctakes.dependency.parser.util.DependencyRegex
[ERROR] <https://builds.apache.org/job/ctakes-trunk-compiletest/org.apache.ctakes$ctakes-assertion/ws/src/main/java/org/apache/ctakes/assertion/util/NegationDepRegex.java>:[498,5]
cannot find symbol
symbol  : constructor DependencyRegex(com.googlecode.clearnlp.dependency.DEPNode[],int,java.lang.String)
location: class org.apache.ctakes.dependency.parser.util.DependencyRegex
[ERROR] <https://builds.apache.org/job/ctakes-trunk-compiletest/org.apache.ctakes$ctakes-assertion/ws/src/main/java/org/apache/ctakes/assertion/util/NegationDepRegex.java>:[502,5]
cannot find symbol
symbol  : constructor DependencyRegex(com.googlecode.clearnlp.dependency.DEPNode[],int,java.lang.String)
location: class org.apache.ctakes.dependency.parser.util.DependencyRegex
[ERROR] <https://builds.apache.org/job/ctakes-trunk-compiletest/org.apache.ctakes$ctakes-assertion/ws/src/main/java/org/apache/ctakes/assertion/util/NegationDepRegex.java>:[506,5]
cannot find symbol
symbol  : constructor DependencyRegex(com.googlecode.clearnlp.dependency.DEPNode[],int,java.lang.String)
location: class org.apache.ctakes.dependency.parser.util.DependencyRegex
[ERROR] <https://builds.apache.org/job/ctakes-trunk-compiletest/org.apache.ctakes$ctakes-assertion/ws/src/main/java/org/apache/ctakes/assertion/util/NegationDepRegex.java>:[510,5]
cannot find symbol
symbol  : constructor DependencyRegex(com.googlecode.clearnlp.dependency.DEPNode[],int,java.lang.String)
location: class org.apache.ctakes.dependency.parser.util.DependencyRegex
[ERROR] <https://builds.apache.org/job/ctakes-trunk-compiletest/org.apache.ctakes$ctakes-assertion/ws/src/main/java/org/apache/ctakes/assertion/util/NegationDepRegex.java>:[520,26]
cannot find symbol
symbol  : method getName()
location: class org.apache.ctakes.dependency.parser.util.DependencyRegex
[ERROR] <https://builds.apache.org/job/ctakes-trunk-compiletest/org.apache.ctakes$ctakes-assertion/ws/src/main/java/org/apache/ctakes/assertion/eval/AssertionEvaluation.java>:[342,55]
[unchecked] unchecked call to addAll(org.cleartk.eval.AnnotationStatistics<OUTCOME_TYPE>)
as a member of the raw type org.cleartk.eval.AnnotationStatistics
[ERROR] <https://builds.apache.org/job/ctakes-trunk-compiletest/org.apache.ctakes$ctakes-assertion/ws/src/main/java/org/apache/ctakes/assertion/eval/AssertionEvaluation.java>:[847,24]
[unchecked] unchecked call to <ANNOTATION_TYPE,SPAN_TYPE>add(java.util.Collection<?
extends ANNOTATION_TYPE>,java.util.Collection<? extends ANNOTATION_TYPE>,com.google.common.base.Function<ANNOTATION_TYPE,SPAN_TYPE>,com.google.common.base.Function<ANNOTATION_TYPE,OUTCOME_TYPE>)
as a member of the raw type org.cleartk.eval.AnnotationStatistics
[ERROR] <https://builds.apache.org/job/ctakes-trunk-compiletest/org.apache.ctakes$ctakes-assertion/ws/src/main/java/org/apache/ctakes/assertion/eval/AssertionEvaluation.java>:[857,27]
[unchecked] unchecked call to <ANNOTATION_TYPE,SPAN_TYPE>add(java.util.Collection<?
extends ANNOTATION_TYPE>,java.util.Collection<? extends ANNOTATION_TYPE>,com.google.common.base.Function<ANNOTATION_TYPE,SPAN_TYPE>,com.google.common.base.Function<ANNOTATION_TYPE,OUTCOME_TYPE>)
as a member of the raw type org.cleartk.eval.AnnotationStatistics
[ERROR] <https://builds.apache.org/job/ctakes-trunk-compiletest/org.apache.ctakes$ctakes-assertion/ws/src/main/java/org/apache/ctakes/assertion/eval/AssertionEvaluation.java>:[867,27]
[unchecked] unchecked call to <ANNOTATION_TYPE,SPAN_TYPE>add(java.util.Collection<?
extends ANNOTATION_TYPE>,java.util.Collection<? extends ANNOTATION_TYPE>,com.google.common.base.Function<ANNOTATION_TYPE,SPAN_TYPE>,com.google.common.base.Function<ANNOTATION_TYPE,OUTCOME_TYPE>)
as a member of the raw type org.cleartk.eval.AnnotationStatistics
[ERROR] <https://builds.apache.org/job/ctakes-trunk-compiletest/org.apache.ctakes$ctakes-assertion/ws/src/main/java/org/apache/ctakes/assertion/eval/AssertionEvaluation.java>:[877,23]
[unchecked] unchecked call to <ANNOTATION_TYPE,SPAN_TYPE>add(java.util.Collection<?
extends ANNOTATION_TYPE>,java.util.Collection<? extends ANNOTATION_TYPE>,com.google.common.base.Function<ANNOTATION_TYPE,SPAN_TYPE>,com.google.common.base.Function<ANNOTATION_TYPE,OUTCOME_TYPE>)
as a member of the raw type org.cleartk.eval.AnnotationStatistics
[ERROR] <https://builds.apache.org/job/ctakes-trunk-compiletest/org.apache.ctakes$ctakes-assertion/ws/src/main/java/org/apache/ctakes/assertion/eval/AssertionEvaluation.java>:[887,23]
[unchecked] unchecked call to <ANNOTATION_TYPE,SPAN_TYPE>add(java.util.Collection<?
extends ANNOTATION_TYPE>,java.util.Collection<? extends ANNOTATION_TYPE>,com.google.common.base.Function<ANNOTATION_TYPE,SPAN_TYPE>,com.google.common.base.Function<ANNOTATION_TYPE,OUTCOME_TYPE>)
as a member of the raw type org.cleartk.eval.AnnotationStatistics
[ERROR] <https://builds.apache.org/job/ctakes-trunk-compiletest/org.apache.ctakes$ctakes-assertion/ws/src/main/java/org/apache/ctakes/assertion/eval/AssertionEvaluation.java>:[898,23]
[unchecked] unchecked call to <ANNOTATION_TYPE,SPAN_TYPE>add(java.util.Collection<?
extends ANNOTATION_TYPE>,java.util.Collection<? extends ANNOTATION_TYPE>,com.google.common.base.Function<ANNOTATION_TYPE,SPAN_TYPE>,com.google.common.base.Function<ANNOTATION_TYPE,OUTCOME_TYPE>)
as a member of the raw type org.cleartk.eval.AnnotationStatistics
[ERROR] <https://builds.apache.org/job/ctakes-trunk-compiletest/org.apache.ctakes$ctakes-assertion/ws/src/main/java/org/apache/ctakes/assertion/medfacts/cleartk/TrainAssertionModel.java>:[291,72]
[deprecation] org.cleartk.classifier.opennlp.DefaultMaxentDataWriterFactory in org.cleartk.classifier.opennlp
has been deprecated
[ERROR] <https://builds.apache.org/job/ctakes-trunk-compiletest/org.apache.ctakes$ctakes-assertion/ws/src/main/java/org/apache/ctakes/assertion/medfacts/cleartk/extractors/TreeFragmentFeatureExtractor.java>:[59,41]
[deprecation] locateFile(java.lang.String) in org.apache.ctakes.core.resource.FileLocator
has been deprecated
[ERROR] <https://builds.apache.org/job/ctakes-trunk-compiletest/org.apache.ctakes$ctakes-assertion/ws/src/main/java/org/apache/ctakes/assertion/medfacts/cleartk/extractors/TreeFragmentFeatureExtractor.java>:[68,31]
[deprecation] locateFile(java.lang.String) in org.apache.ctakes.core.resource.FileLocator
has been deprecated
[ERROR] <https://builds.apache.org/job/ctakes-trunk-compiletest/org.apache.ctakes$ctakes-assertion/ws/src/main/java/org/apache/ctakes/assertion/medfacts/cleartk/extractors/ContextWordWindowExtractor.java>:[38,30]
[deprecation] locateFile(java.lang.String) in org.apache.ctakes.core.resource.FileLocator
has been deprecated
[ERROR] <https://builds.apache.org/job/ctakes-trunk-compiletest/org.apache.ctakes$ctakes-assertion/ws/src/main/java/org/apache/ctakes/assertion/cr/XmiCollectionReaderCtakes.java>:[81,18]
[unchecked] unchecked call to add(E) as a member of the raw type java.util.ArrayList
[ERROR] <https://builds.apache.org/job/ctakes-trunk-compiletest/org.apache.ctakes$ctakes-assertion/ws/src/main/java/org/apache/ctakes/assertion/medfacts/cleartk/AlternateCuePhraseAnnotator.java>:[42,25]
[deprecation] locateFile(java.lang.String) in org.apache.ctakes.core.resource.FileLocator
has been deprecated
[ERROR] <https://builds.apache.org/job/ctakes-trunk-compiletest/org.apache.ctakes$ctakes-assertion/ws/src/main/java/org/apache/ctakes/assertion/pipelines/RunJudgeAttributeInstances.java>:[90,35]
[unchecked] unchecked conversion
found   : java.util.List
required: java.util.List<java.io.File>
[ERROR] <https://builds.apache.org/job/ctakes-trunk-compiletest/org.apache.ctakes$ctakes-assertion/ws/src/main/java/org/apache/ctakes/assertion/medfacts/cleartk/CreateAssertionDescriptor.java>:[33,90]
[deprecation] org.cleartk.classifier.opennlp.DefaultMaxentDataWriterFactory in org.cleartk.classifier.opennlp
has been deprecated
[ERROR] <https://builds.apache.org/job/ctakes-trunk-compiletest/org.apache.ctakes$ctakes-assertion/ws/src/main/java/org/apache/ctakes/assertion/medfacts/CasIndexer.java>:[74,21]
[unchecked] unchecked cast
found   : org.apache.uima.jcas.tcas.Annotation
required: T
[ERROR] <https://builds.apache.org/job/ctakes-trunk-compiletest/org.apache.ctakes$ctakes-assertion/ws/src/main/java/org/apache/ctakes/assertion/pipelines/GenerateTreeRepresentation.java>:[86,41]
[deprecation] locateFile(java.lang.String) in org.apache.ctakes.core.resource.FileLocator
has been deprecated
[INFO] 42 errors 
[INFO] -------------------------------------------------------------

Mime
View raw message