ctakes-notifications mailing list archives

Site index · List index
Message view « Date » · « Thread »
Top « Date » · « Thread »
From Apache Jenkins Server <jenk...@builds.apache.org>
Subject Build failed in Jenkins: ctakes-trunk-compiletest #336
Date Thu, 11 Jul 2013 16:13:55 GMT
See <https://builds.apache.org/job/ctakes-trunk-compiletest/336/changes>

Changes:

[james-masanz] get even more context if user enters m again

[tmill] Made dep path features somewhat self-documenting. Added back in one broken dep feature.

[james-masanz] wrapper for running plaintext clinical documents pipeline without needing a
run configuration, and that uses directories listed in AssertionConst.java

------------------------------------------
[...truncated 5826 lines...]
Results :

Tests run: 0, Failures: 0, Errors: 0, Skipped: 0

[JENKINS] Recording test results
[INFO]                                                                         
[INFO] ------------------------------------------------------------------------
[INFO] Building Apache cTAKES Assertion 3.1.0-SNAPSHOT
[INFO] ------------------------------------------------------------------------
[INFO] [INFO] Deleting <https://builds.apache.org/job/ctakes-trunk-compiletest/ws/ctakes-assertion/target>

[INFO] --- maven-clean-plugin:2.4.1:clean (default-clean) @ ctakes-assertion ---
[INFO] 
[INFO] --- maven-remote-resources-plugin:1.4:process (default) @ ctakes-assertion ---
Downloading: http://repo.maven.apache.org/maven2/jwnl/jwnl/1.3.3/jwnl-1.3.3.pom
[debug] execute contextualize
[INFO] [INFO] Using 'UTF-8' encoding to copy filtered resources.

[INFO] --- maven-resources-plugin:2.5:resources (default-resources) @ ctakes-assertion ---
[INFO] Copying 1 resource
[INFO] Copying 3 resources
[INFO] [INFO] JCasGen: Output going to '<https://builds.apache.org/job/ctakes-trunk-compiletest/ws/ctakes-assertion/target/generated-sources/jcasgen'>
[INFO] JCasGen: Reading the XML TAE descriptor, and creating types, for xml input file '<https://builds.apache.org/job/ctakes-trunk-compiletest/ws/ctakes-assertion/src/main/resources/org/apache/ctakes/assertion/types/TypeSystem.xml'.>
[INFO] JCasGen: Creating: 'org.apache.ctakes.assertion.medfacts.types.Assertion'.
[INFO] JCasGen: Creating: 'org.apache.ctakes.assertion.medfacts.types.Assertion_Type'.
[INFO] JCasGen: Creating: 'org.apache.ctakes.assertion.medfacts.types.Concept'.
[INFO] JCasGen: Creating: 'org.apache.ctakes.assertion.medfacts.types.Concept_Type'.

[INFO] --- jcasgen-maven-plugin:0.9.3:generate (default) @ ctakes-assertion ---
[INFO] 
[INFO] --- maven-compiler-plugin:2.4:compile (default-compile) @ ctakes-assertion ---
[INFO] Compiling 71 source files to <https://builds.apache.org/job/ctakes-trunk-compiletest/ws/ctakes-assertion/target/classes>
[INFO] -------------------------------------------------------------
[ERROR] COMPILATION ERROR : 
[INFO] -------------------------------------------------------------
[ERROR] <https://builds.apache.org/job/ctakes-trunk-compiletest/ws/ctakes-assertion/src/main/java/org/apache/ctakes/assertion/medfacts/cleartk/TrainAssertionModel.java>:[41,29]
[deprecation] org.cleartk.classifier.CleartkAnnotatorDescriptionFactory in org.cleartk.classifier
has been deprecated
[ERROR] <https://builds.apache.org/job/ctakes-trunk-compiletest/ws/ctakes-assertion/src/main/java/org/apache/ctakes/assertion/medfacts/cleartk/TrainAssertionModel.java>:[45,37]
[deprecation] org.cleartk.classifier.opennlp.DefaultMaxentDataWriterFactory in org.cleartk.classifier.opennlp
has been deprecated
[ERROR] <https://builds.apache.org/job/ctakes-trunk-compiletest/ws/ctakes-assertion/src/main/java/org/apache/ctakes/assertion/medfacts/cleartk/TrainAssertionModel.java>:[46,37]
[deprecation] org.cleartk.classifier.opennlp.MaxentDataWriter in org.cleartk.classifier.opennlp
has been deprecated
[ERROR] <https://builds.apache.org/job/ctakes-trunk-compiletest/ws/ctakes-assertion/src/main/java/org/apache/ctakes/assertion/medfacts/cleartk/SubjectCleartkAnalysisEngine.java>:[31,47]
[deprecation] org.cleartk.classifier.feature.extractor.ContextExtractor in org.cleartk.classifier.feature.extractor
has been deprecated
[ERROR] <https://builds.apache.org/job/ctakes-trunk-compiletest/ws/ctakes-assertion/src/main/java/org/apache/ctakes/assertion/medfacts/cleartk/CreateAssertionDescriptor.java>:[21,37]
[deprecation] org.cleartk.classifier.opennlp.DefaultMaxentDataWriterFactory in org.cleartk.classifier.opennlp
has been deprecated
[ERROR] <https://builds.apache.org/job/ctakes-trunk-compiletest/ws/ctakes-assertion/src/main/java/org/apache/ctakes/assertion/medfacts/cleartk/AssertionSampleFeatureGenerator.java>:[8,54]
[deprecation] org.cleartk.classifier.feature.extractor.simple.SpannedTextExtractor in org.cleartk.classifier.feature.extractor.simple
has been deprecated
[ERROR] <https://builds.apache.org/job/ctakes-trunk-compiletest/ws/ctakes-assertion/src/main/java/org/apache/ctakes/assertion/medfacts/cleartk/AssertionSampleFeatureGenerator.java>:[9,49]
[deprecation] org.cleartk.classifier.feature.proliferate.CapitalTypeProliferator in org.cleartk.classifier.feature.proliferate
has been deprecated
[ERROR] <https://builds.apache.org/job/ctakes-trunk-compiletest/ws/ctakes-assertion/src/main/java/org/apache/ctakes/assertion/medfacts/cleartk/AssertionSampleFeatureGenerator.java>:[10,49]
[deprecation] org.cleartk.classifier.feature.proliferate.CharacterNGramProliferator in org.cleartk.classifier.feature.proliferate
has been deprecated
[ERROR] <https://builds.apache.org/job/ctakes-trunk-compiletest/ws/ctakes-assertion/src/main/java/org/apache/ctakes/assertion/medfacts/cleartk/AssertionSampleFeatureGenerator.java>:[11,49]
[deprecation] org.cleartk.classifier.feature.proliferate.LowerCaseProliferator in org.cleartk.classifier.feature.proliferate
has been deprecated
[ERROR] <https://builds.apache.org/job/ctakes-trunk-compiletest/ws/ctakes-assertion/src/main/java/org/apache/ctakes/assertion/medfacts/cleartk/AssertionSampleFeatureGenerator.java>:[12,49]
[deprecation] org.cleartk.classifier.feature.proliferate.NumericTypeProliferator in org.cleartk.classifier.feature.proliferate
has been deprecated
[ERROR] <https://builds.apache.org/job/ctakes-trunk-compiletest/ws/ctakes-assertion/src/main/java/org/apache/ctakes/assertion/medfacts/cleartk/AssertionSampleFeatureGenerator.java>:[13,49]
[deprecation] org.cleartk.classifier.feature.proliferate.ProliferatingExtractor in org.cleartk.classifier.feature.proliferate
has been deprecated
[ERROR] <https://builds.apache.org/job/ctakes-trunk-compiletest/ws/ctakes-assertion/src/main/java/org/apache/ctakes/assertion/util/NegationManualDepContextAnalyzer.java>:[159,33]
cannot find symbol
symbol  : method getName()
location: class org.apache.ctakes.dependency.parser.util.DependencyRegex
[ERROR] <https://builds.apache.org/job/ctakes-trunk-compiletest/ws/ctakes-assertion/src/main/java/org/apache/ctakes/assertion/util/NegationDepRegex.java>:[463,5]
cannot find symbol
symbol  : constructor DependencyRegex(com.googlecode.clearnlp.dependency.DEPNode[],int,java.lang.String)
location: class org.apache.ctakes.dependency.parser.util.DependencyRegex
[ERROR] <https://builds.apache.org/job/ctakes-trunk-compiletest/ws/ctakes-assertion/src/main/java/org/apache/ctakes/assertion/util/NegationDepRegex.java>:[467,5]
cannot find symbol
symbol  : constructor DependencyRegex(com.googlecode.clearnlp.dependency.DEPNode[],int,java.lang.String)
location: class org.apache.ctakes.dependency.parser.util.DependencyRegex
[ERROR] <https://builds.apache.org/job/ctakes-trunk-compiletest/ws/ctakes-assertion/src/main/java/org/apache/ctakes/assertion/util/NegationDepRegex.java>:[471,5]
cannot find symbol
symbol  : constructor DependencyRegex(com.googlecode.clearnlp.dependency.DEPNode[],int,java.lang.String)
location: class org.apache.ctakes.dependency.parser.util.DependencyRegex
[ERROR] <https://builds.apache.org/job/ctakes-trunk-compiletest/ws/ctakes-assertion/src/main/java/org/apache/ctakes/assertion/util/NegationDepRegex.java>:[475,5]
cannot find symbol
symbol  : constructor DependencyRegex(com.googlecode.clearnlp.dependency.DEPNode[],int,java.lang.String)
location: class org.apache.ctakes.dependency.parser.util.DependencyRegex
[ERROR] <https://builds.apache.org/job/ctakes-trunk-compiletest/ws/ctakes-assertion/src/main/java/org/apache/ctakes/assertion/util/NegationDepRegex.java>:[479,5]
cannot find symbol
symbol  : constructor DependencyRegex(com.googlecode.clearnlp.dependency.DEPNode[],int,java.lang.String)
location: class org.apache.ctakes.dependency.parser.util.DependencyRegex
[ERROR] <https://builds.apache.org/job/ctakes-trunk-compiletest/ws/ctakes-assertion/src/main/java/org/apache/ctakes/assertion/util/NegationDepRegex.java>:[484,5]
cannot find symbol
symbol  : constructor DependencyRegex(com.googlecode.clearnlp.dependency.DEPNode[],int,java.lang.String)
location: class org.apache.ctakes.dependency.parser.util.DependencyRegex
[ERROR] <https://builds.apache.org/job/ctakes-trunk-compiletest/ws/ctakes-assertion/src/main/java/org/apache/ctakes/assertion/util/NegationDepRegex.java>:[490,5]
cannot find symbol
symbol  : constructor DependencyRegex(com.googlecode.clearnlp.dependency.DEPNode[],int,java.lang.String)
location: class org.apache.ctakes.dependency.parser.util.DependencyRegex
[ERROR] <https://builds.apache.org/job/ctakes-trunk-compiletest/ws/ctakes-assertion/src/main/java/org/apache/ctakes/assertion/util/NegationDepRegex.java>:[494,5]
cannot find symbol
symbol  : constructor DependencyRegex(com.googlecode.clearnlp.dependency.DEPNode[],int,java.lang.String)
location: class org.apache.ctakes.dependency.parser.util.DependencyRegex
[ERROR] <https://builds.apache.org/job/ctakes-trunk-compiletest/ws/ctakes-assertion/src/main/java/org/apache/ctakes/assertion/util/NegationDepRegex.java>:[498,5]
cannot find symbol
symbol  : constructor DependencyRegex(com.googlecode.clearnlp.dependency.DEPNode[],int,java.lang.String)
location: class org.apache.ctakes.dependency.parser.util.DependencyRegex
[ERROR] <https://builds.apache.org/job/ctakes-trunk-compiletest/ws/ctakes-assertion/src/main/java/org/apache/ctakes/assertion/util/NegationDepRegex.java>:[502,5]
cannot find symbol
symbol  : constructor DependencyRegex(com.googlecode.clearnlp.dependency.DEPNode[],int,java.lang.String)
location: class org.apache.ctakes.dependency.parser.util.DependencyRegex
[ERROR] <https://builds.apache.org/job/ctakes-trunk-compiletest/ws/ctakes-assertion/src/main/java/org/apache/ctakes/assertion/util/NegationDepRegex.java>:[506,5]
cannot find symbol
symbol  : constructor DependencyRegex(com.googlecode.clearnlp.dependency.DEPNode[],int,java.lang.String)
location: class org.apache.ctakes.dependency.parser.util.DependencyRegex
[ERROR] <https://builds.apache.org/job/ctakes-trunk-compiletest/ws/ctakes-assertion/src/main/java/org/apache/ctakes/assertion/util/NegationDepRegex.java>:[510,5]
cannot find symbol
symbol  : constructor DependencyRegex(com.googlecode.clearnlp.dependency.DEPNode[],int,java.lang.String)
location: class org.apache.ctakes.dependency.parser.util.DependencyRegex
[ERROR] <https://builds.apache.org/job/ctakes-trunk-compiletest/ws/ctakes-assertion/src/main/java/org/apache/ctakes/assertion/util/NegationDepRegex.java>:[520,26]
cannot find symbol
symbol  : method getName()
location: class org.apache.ctakes.dependency.parser.util.DependencyRegex
[ERROR] <https://builds.apache.org/job/ctakes-trunk-compiletest/ws/ctakes-assertion/src/main/java/org/apache/ctakes/assertion/eval/AssertionEvaluation.java>:[342,55]
[unchecked] unchecked call to addAll(org.cleartk.eval.AnnotationStatistics<OUTCOME_TYPE>)
as a member of the raw type org.cleartk.eval.AnnotationStatistics
[ERROR] <https://builds.apache.org/job/ctakes-trunk-compiletest/ws/ctakes-assertion/src/main/java/org/apache/ctakes/assertion/eval/AssertionEvaluation.java>:[847,24]
[unchecked] unchecked call to <ANNOTATION_TYPE,SPAN_TYPE>add(java.util.Collection<?
extends ANNOTATION_TYPE>,java.util.Collection<? extends ANNOTATION_TYPE>,com.google.common.base.Function<ANNOTATION_TYPE,SPAN_TYPE>,com.google.common.base.Function<ANNOTATION_TYPE,OUTCOME_TYPE>)
as a member of the raw type org.cleartk.eval.AnnotationStatistics
[ERROR] <https://builds.apache.org/job/ctakes-trunk-compiletest/ws/ctakes-assertion/src/main/java/org/apache/ctakes/assertion/eval/AssertionEvaluation.java>:[857,27]
[unchecked] unchecked call to <ANNOTATION_TYPE,SPAN_TYPE>add(java.util.Collection<?
extends ANNOTATION_TYPE>,java.util.Collection<? extends ANNOTATION_TYPE>,com.google.common.base.Function<ANNOTATION_TYPE,SPAN_TYPE>,com.google.common.base.Function<ANNOTATION_TYPE,OUTCOME_TYPE>)
as a member of the raw type org.cleartk.eval.AnnotationStatistics
[ERROR] <https://builds.apache.org/job/ctakes-trunk-compiletest/ws/ctakes-assertion/src/main/java/org/apache/ctakes/assertion/eval/AssertionEvaluation.java>:[867,27]
[unchecked] unchecked call to <ANNOTATION_TYPE,SPAN_TYPE>add(java.util.Collection<?
extends ANNOTATION_TYPE>,java.util.Collection<? extends ANNOTATION_TYPE>,com.google.common.base.Function<ANNOTATION_TYPE,SPAN_TYPE>,com.google.common.base.Function<ANNOTATION_TYPE,OUTCOME_TYPE>)
as a member of the raw type org.cleartk.eval.AnnotationStatistics
[ERROR] <https://builds.apache.org/job/ctakes-trunk-compiletest/ws/ctakes-assertion/src/main/java/org/apache/ctakes/assertion/eval/AssertionEvaluation.java>:[877,23]
[unchecked] unchecked call to <ANNOTATION_TYPE,SPAN_TYPE>add(java.util.Collection<?
extends ANNOTATION_TYPE>,java.util.Collection<? extends ANNOTATION_TYPE>,com.google.common.base.Function<ANNOTATION_TYPE,SPAN_TYPE>,com.google.common.base.Function<ANNOTATION_TYPE,OUTCOME_TYPE>)
as a member of the raw type org.cleartk.eval.AnnotationStatistics
[ERROR] <https://builds.apache.org/job/ctakes-trunk-compiletest/ws/ctakes-assertion/src/main/java/org/apache/ctakes/assertion/eval/AssertionEvaluation.java>:[887,23]
[unchecked] unchecked call to <ANNOTATION_TYPE,SPAN_TYPE>add(java.util.Collection<?
extends ANNOTATION_TYPE>,java.util.Collection<? extends ANNOTATION_TYPE>,com.google.common.base.Function<ANNOTATION_TYPE,SPAN_TYPE>,com.google.common.base.Function<ANNOTATION_TYPE,OUTCOME_TYPE>)
as a member of the raw type org.cleartk.eval.AnnotationStatistics
[ERROR] <https://builds.apache.org/job/ctakes-trunk-compiletest/ws/ctakes-assertion/src/main/java/org/apache/ctakes/assertion/eval/AssertionEvaluation.java>:[898,23]
[unchecked] unchecked call to <ANNOTATION_TYPE,SPAN_TYPE>add(java.util.Collection<?
extends ANNOTATION_TYPE>,java.util.Collection<? extends ANNOTATION_TYPE>,com.google.common.base.Function<ANNOTATION_TYPE,SPAN_TYPE>,com.google.common.base.Function<ANNOTATION_TYPE,OUTCOME_TYPE>)
as a member of the raw type org.cleartk.eval.AnnotationStatistics
[ERROR] <https://builds.apache.org/job/ctakes-trunk-compiletest/ws/ctakes-assertion/src/main/java/org/apache/ctakes/assertion/medfacts/cleartk/TrainAssertionModel.java>:[291,72]
[deprecation] org.cleartk.classifier.opennlp.DefaultMaxentDataWriterFactory in org.cleartk.classifier.opennlp
has been deprecated
[ERROR] <https://builds.apache.org/job/ctakes-trunk-compiletest/ws/ctakes-assertion/src/main/java/org/apache/ctakes/assertion/medfacts/cleartk/extractors/TreeFragmentFeatureExtractor.java>:[59,41]
[deprecation] locateFile(java.lang.String) in org.apache.ctakes.core.resource.FileLocator
has been deprecated
[ERROR] <https://builds.apache.org/job/ctakes-trunk-compiletest/ws/ctakes-assertion/src/main/java/org/apache/ctakes/assertion/medfacts/cleartk/extractors/TreeFragmentFeatureExtractor.java>:[68,31]
[deprecation] locateFile(java.lang.String) in org.apache.ctakes.core.resource.FileLocator
has been deprecated
[ERROR] <https://builds.apache.org/job/ctakes-trunk-compiletest/ws/ctakes-assertion/src/main/java/org/apache/ctakes/assertion/medfacts/cleartk/extractors/ContextWordWindowExtractor.java>:[38,30]
[deprecation] locateFile(java.lang.String) in org.apache.ctakes.core.resource.FileLocator
has been deprecated
[ERROR] <https://builds.apache.org/job/ctakes-trunk-compiletest/ws/ctakes-assertion/src/main/java/org/apache/ctakes/assertion/cr/XmiCollectionReaderCtakes.java>:[81,18]
[unchecked] unchecked call to add(E) as a member of the raw type java.util.ArrayList
[ERROR] <https://builds.apache.org/job/ctakes-trunk-compiletest/ws/ctakes-assertion/src/main/java/org/apache/ctakes/assertion/medfacts/cleartk/AlternateCuePhraseAnnotator.java>:[42,25]
[deprecation] locateFile(java.lang.String) in org.apache.ctakes.core.resource.FileLocator
has been deprecated
[ERROR] <https://builds.apache.org/job/ctakes-trunk-compiletest/ws/ctakes-assertion/src/main/java/org/apache/ctakes/assertion/pipelines/RunJudgeAttributeInstances.java>:[90,35]
[unchecked] unchecked conversion
found   : java.util.List
required: java.util.List<java.io.File>
[ERROR] <https://builds.apache.org/job/ctakes-trunk-compiletest/ws/ctakes-assertion/src/main/java/org/apache/ctakes/assertion/medfacts/cleartk/CreateAssertionDescriptor.java>:[33,90]
[deprecation] org.cleartk.classifier.opennlp.DefaultMaxentDataWriterFactory in org.cleartk.classifier.opennlp
has been deprecated
[ERROR] <https://builds.apache.org/job/ctakes-trunk-compiletest/ws/ctakes-assertion/src/main/java/org/apache/ctakes/assertion/medfacts/CasIndexer.java>:[74,21]
[unchecked] unchecked cast
found   : org.apache.uima.jcas.tcas.Annotation
required: T
[ERROR] <https://builds.apache.org/job/ctakes-trunk-compiletest/ws/ctakes-assertion/src/main/java/org/apache/ctakes/assertion/pipelines/GenerateTreeRepresentation.java>:[86,41]
[deprecation] locateFile(java.lang.String) in org.apache.ctakes.core.resource.FileLocator
has been deprecated
[INFO] 42 errors 
[INFO] -------------------------------------------------------------
[INFO] ------------------------------------------------------------------------
[INFO] Reactor Summary:
[INFO] 
[INFO] Apache cTAKES ..................................... SUCCESS [27.480s]
[INFO] Apache cTAKES common type system .................. SUCCESS [16.960s]
[INFO] Apache cTAKES utils ............................... SUCCESS [5.424s]
[INFO] Apache cTAKES Resources core ...................... SUCCESS [3.498s]
[INFO] Apache cTAKES core ................................ SUCCESS [19.251s]
[INFO] Apache cTAKES Resources pos-tagger ................ SUCCESS [8.055s]
[INFO] Apache cTAKES part-of-speech tagger ............... SUCCESS [8.782s]
[INFO] Apache cTAKES Resources ctakes-chunker-res ........ SUCCESS [4.240s]
[INFO] Apache cTAKES chunker ............................. SUCCESS [4.868s]
[INFO] Apache cTAKES document preprocessor ............... SUCCESS [4.571s]
[INFO] Apache cTAKES Resources dictionary-lookup ......... SUCCESS [2.481s]
[INFO] Apache cTAKES dictionary lookup ................... SUCCESS [1:07.431s]
[INFO] Apache cTAKES context dependent tokenizer ......... SUCCESS [2.639s]
[INFO] Apache cTAKES Resources lvg ....................... SUCCESS [3.149s]
[INFO] Apache cTAKES LVG lexical tools ................... SUCCESS [5.827s]
[INFO] Apache cTAKES Resources ne-contexts ............... SUCCESS [1.438s]
[INFO] Apache cTAKES named entity contexts ............... SUCCESS [5.250s]
[INFO] Apache cTAKES Resources constituency-parser ....... SUCCESS [3.789s]
[INFO] Apache cTAKES Constituency Parser ................. SUCCESS [4.318s]
[INFO] Apache cTAKES Resources coreference ............... SUCCESS [6.080s]
[INFO] Apache cTAKES Resources relation-extractor ........ SUCCESS [3.561s]
[INFO] Apache cTAKES Resources dependency-parser ......... SUCCESS [20.825s]
[INFO] Apache cTAKES Dependency Parser ................... SUCCESS [41.191s]
[INFO] Apache cTAKES Relation Extractor .................. SUCCESS [11.896s]
[INFO] Apache cTAKES CoReference Resolver ................ SUCCESS [6.497s]
[INFO] Apache cTAKES Resources drug-ner .................. SUCCESS [1.965s]
[INFO] Apache cTAKES Drug NER ............................ SUCCESS [4.931s]
[INFO] Apache cTAKES Resources side-effect ............... SUCCESS [2.408s]
[INFO] Apache cTAKES Side Effects ........................ SUCCESS [5.763s]
[INFO] Apache cTAKES Resources smoking-status ............ SUCCESS [1.595s]
[INFO] Apache cTAKES Smoking Status ...................... SUCCESS [6.239s]
[INFO] Apache cTAKES Resources pad-term-spotter-res ...... SUCCESS [1.586s]
[INFO] Apache cTAKES Pad Term Spotter .................... SUCCESS [6.443s]
[INFO] Apache cTAKES Resources assertion ................. SUCCESS [3.130s]
[INFO] Apache cTAKES Resources assertion-zoner ........... SUCCESS [2.607s]
[INFO] Apache cTAKES Assertion's zoner ................... SUCCESS [3.409s]
[INFO] Apache cTAKES Assertion ........................... FAILURE [5.549s]
[INFO] Apache cTAKES Resources temporal .................. SKIPPED
[INFO] Apache cTAKES Temporal Information Extraction ..... SKIPPED
[INFO] Apache cTAKES ctakes-clinical-pipeline ............ SKIPPED
[INFO] Apache cTAKES Distribution ........................ SKIPPED
[INFO] Apache cTAKES Regression-test ..................... SKIPPED
[INFO] Apache cTAKES template filler ..................... SKIPPED
[INFO] ------------------------------------------------------------------------
[INFO] BUILD FAILURE
[INFO] ------------------------------------------------------------------------
[INFO] Total time: 5:46.501s
[INFO] Finished at: Thu Jul 11 16:09:43 UTC 2013
[INFO] Final Memory: 35M/208M
[INFO] ------------------------------------------------------------------------
[JENKINS] Archiving disabled
[JENKINS] Archiving disabled
[JENKINS] Archiving disabled
[JENKINS] Archiving disabled
[JENKINS] Archiving disabled
[JENKINS] Archiving disabled
[JENKINS] Archiving disabled
[JENKINS] Archiving disabled
[JENKINS] Archiving disabled
[JENKINS] Archiving disabled
[JENKINS] Archiving disabled
[JENKINS] Archiving disabled
[JENKINS] Archiving disabled
[JENKINS] Archiving disabled
[JENKINS] Archiving disabled
[JENKINS] Archiving disabled
[JENKINS] Archiving disabled
[JENKINS] Archiving disabled
[JENKINS] Archiving disabled
[JENKINS] Archiving disabled
[JENKINS] Archiving disabled
[JENKINS] Archiving disabled
[JENKINS] Archiving disabled
[JENKINS] Archiving disabled
[JENKINS] Archiving disabled
[JENKINS] Archiving disabled
[JENKINS] Archiving disabled
[JENKINS] Archiving disabled
[JENKINS] Archiving disabled
[JENKINS] Archiving disabled
[JENKINS] Archiving disabled
[JENKINS] Archiving disabled
[JENKINS] Archiving disabled
[JENKINS] Archiving disabled
[JENKINS] Archiving disabled
[JENKINS] Archiving disabled
[JENKINS] Archiving disabled
[JENKINS] Archiving disabled
[JENKINS] Archiving disabled
[JENKINS] Archiving disabled
[JENKINS] Archiving disabled
[JENKINS] Archiving disabled
[JENKINS] Archiving disabled
Waiting for Jenkins to finish collecting data
mavenExecutionResult exceptions not empty
message : Failed to execute goal org.apache.maven.plugins:maven-compiler-plugin:2.4:compile
(default-compile) on project ctakes-assertion: Compilation failure
cause : Compilation failure
Stack trace : 
org.apache.maven.lifecycle.LifecycleExecutionException: Failed to execute goal org.apache.maven.plugins:maven-compiler-plugin:2.4:compile
(default-compile) on project ctakes-assertion: Compilation failure
	at org.apache.maven.lifecycle.internal.MojoExecutor.execute(MojoExecutor.java:213)
	at org.apache.maven.lifecycle.internal.MojoExecutor.execute(MojoExecutor.java:153)
	at org.apache.maven.lifecycle.internal.MojoExecutor.execute(MojoExecutor.java:145)
	at org.apache.maven.lifecycle.internal.LifecycleModuleBuilder.buildProject(LifecycleModuleBuilder.java:84)
	at org.apache.maven.lifecycle.internal.LifecycleModuleBuilder.buildProject(LifecycleModuleBuilder.java:59)
	at org.apache.maven.lifecycle.internal.LifecycleStarter.singleThreadedBuild(LifecycleStarter.java:183)
	at org.apache.maven.lifecycle.internal.LifecycleStarter.execute(LifecycleStarter.java:161)
	at org.apache.maven.DefaultMaven.doExecute(DefaultMaven.java:320)
	at org.apache.maven.DefaultMaven.execute(DefaultMaven.java:156)
	at org.jvnet.hudson.maven3.launcher.Maven3Launcher.main(Maven3Launcher.java:79)
	at sun.reflect.NativeMethodAccessorImpl.invoke0(Native Method)
	at sun.reflect.NativeMethodAccessorImpl.invoke(NativeMethodAccessorImpl.java:39)
	at sun.reflect.DelegatingMethodAccessorImpl.invoke(DelegatingMethodAccessorImpl.java:25)
	at java.lang.reflect.Method.invoke(Method.java:597)
	at org.codehaus.plexus.classworlds.launcher.Launcher.launchStandard(Launcher.java:329)
	at org.codehaus.plexus.classworlds.launcher.Launcher.launch(Launcher.java:239)
	at org.jvnet.hudson.maven3.agent.Maven3Main.launch(Maven3Main.java:158)
	at hudson.maven.Maven3Builder.call(Maven3Builder.java:100)
	at hudson.maven.Maven3Builder.call(Maven3Builder.java:66)
	at hudson.remoting.UserRequest.perform(UserRequest.java:118)
	at hudson.remoting.UserRequest.perform(UserRequest.java:48)
	at hudson.remoting.Request$2.run(Request.java:326)
	at hudson.remoting.InterceptingExecutorService$1.call(InterceptingExecutorService.java:72)
	at java.util.concurrent.FutureTask$Sync.innerRun(FutureTask.java:303)
	at java.util.concurrent.FutureTask.run(FutureTask.java:138)
	at java.util.concurrent.ThreadPoolExecutor$Worker.runTask(ThreadPoolExecutor.java:895)
	at java.util.concurrent.ThreadPoolExecutor$Worker.run(ThreadPoolExecutor.java:918)
	at java.lang.Thread.run(Thread.java:662)
Caused by: org.apache.maven.plugin.CompilationFailureException: Compilation failure
	at org.apache.maven.plugin.AbstractCompilerMojo.execute(AbstractCompilerMojo.java:678)
	at org.apache.maven.plugin.CompilerMojo.execute(CompilerMojo.java:128)
	at org.apache.maven.plugin.DefaultBuildPluginManager.executeMojo(DefaultBuildPluginManager.java:101)
	at org.apache.maven.lifecycle.internal.MojoExecutor.execute(MojoExecutor.java:209)
	... 27 more
Sending e-mails to: notifications@ctakes.apache.org masanz.james@gmail.com timothy.miller@childrens.harvard.edu
channel stopped

Mime
View raw message