ctakes-notifications mailing list archives

Site index · List index
Message view « Date » · « Thread »
Top « Date » · « Thread »
From Apache Jenkins Server <jenk...@builds.apache.org>
Subject Build failed in Jenkins: ctakes-trunk-compiletest » Apache cTAKES Temporal Information Extraction #316
Date Thu, 27 Jun 2013 16:13:16 GMT
See <https://builds.apache.org/job/ctakes-trunk-compiletest/org.apache.ctakes$ctakes-temporal/316/changes>

Changes:

[tmill] Checked in changes to allow for meta-timex classifier.

------------------------------------------
[INFO]                                                                         
[INFO] ------------------------------------------------------------------------
[INFO] Building Apache cTAKES Temporal Information Extraction 3.1.0-SNAPSHOT
[INFO] ------------------------------------------------------------------------
[INFO] Deleting <https://builds.apache.org/job/ctakes-trunk-compiletest/org.apache.ctakes$ctakes-temporal/ws/target>
[INFO] 
[INFO] --- maven-clean-plugin:2.4.1:clean (default-clean) @ ctakes-temporal ---
[INFO] Configured Artifact: net.sourceforge.ctakesresources:ctakes-resources-umls2011ab:3.1.0:jar
[INFO] [INFO] Unpacking /home/jenkins/jenkins-slave/maven-repositories/0/net/sourceforge/ctakesresources/ctakes-resources-umls2011ab/3.1.0/ctakes-resources-umls2011ab-3.1.0.jar
to <https://builds.apache.org/job/ctakes-trunk-compiletest/org.apache.ctakes$ctakes-temporal/ws/target/unpacked>
with includes "" and excludes ""

[INFO] --- maven-dependency-plugin:2.6:unpack (unpack) @ ctakes-temporal ---
[INFO] 
[INFO] --- maven-remote-resources-plugin:1.3:process (default) @ ctakes-temporal ---
Downloading: http://repo.maven.apache.org/maven2/de/tudarmstadt/ukp/dkpro/core/de.tudarmstadt.ukp.dkpro.core.api.resources-asl/1.3.0/de.tudarmstadt.ukp.dkpro.core.api.resources-asl-1.3.0.pom
[INFO] [debug] execute contextualize
[INFO] Using 'UTF-8' encoding to copy filtered resources.

[INFO] --- maven-resources-plugin:2.5:resources (default-resources) @ ctakes-temporal ---
[INFO] Copying 2 resources
[INFO] Copying 3 resources
[INFO] 
[INFO] --- maven-compiler-plugin:2.4:compile (default-compile) @ ctakes-temporal ---
[INFO] Compiling 69 source files to <https://builds.apache.org/job/ctakes-trunk-compiletest/org.apache.ctakes$ctakes-temporal/ws/target/classes>
[INFO] -------------------------------------------------------------
[ERROR] COMPILATION ERROR : 
[INFO] -------------------------------------------------------------
[ERROR] <https://builds.apache.org/job/ctakes-trunk-compiletest/org.apache.ctakes$ctakes-temporal/ws/src/main/java/org/apache/ctakes/temporal/eval/EvaluationOfTimeSpans.java>:[30,36]
cannot find symbol
symbol  : class MetaTimeAnnotator
location: package org.apache.ctakes.temporal.ae
[ERROR] <https://builds.apache.org/job/ctakes-trunk-compiletest/org.apache.ctakes$ctakes-temporal/ws/src/main/java/org/apache/ctakes/temporal/eval/Evaluation_ImplBase.java>:[269,19]
[deprecation] locateFile(java.lang.String) in org.apache.ctakes.core.resource.FileLocator
has been deprecated
[ERROR] <https://builds.apache.org/job/ctakes-trunk-compiletest/org.apache.ctakes$ctakes-temporal/ws/src/main/java/org/apache/ctakes/temporal/pipelines/EventAndTimeExtractionPipeline.java>:[161,19]
[deprecation] locateFile(java.lang.String) in org.apache.ctakes.core.resource.FileLocator
has been deprecated
[ERROR] <https://builds.apache.org/job/ctakes-trunk-compiletest/org.apache.ctakes$ctakes-temporal/ws/src/main/java/org/apache/ctakes/temporal/eval/EvaluationOfTimeSpans.java>:[71,25]
cannot find symbol
symbol  : class MetaTimeAnnotator
location: class org.apache.ctakes.temporal.eval.EvaluationOfTimeSpans
[ERROR] <https://builds.apache.org/job/ctakes-trunk-compiletest/org.apache.ctakes$ctakes-temporal/ws/src/main/java/org/apache/ctakes/temporal/eval/EvaluationOfTimeSpans.java>:[77,35]
cannot find symbol
symbol  : class MetaTimeAnnotator
location: class org.apache.ctakes.temporal.eval.EvaluationOfTimeSpans
[ERROR] <https://builds.apache.org/job/ctakes-trunk-compiletest/org.apache.ctakes$ctakes-temporal/ws/src/main/java/org/apache/ctakes/temporal/eval/EvaluationOfTimeSpans.java>:[137,7]
cannot find symbol
symbol  : class MetaTimeAnnotator
location: class org.apache.ctakes.temporal.eval.EvaluationOfTimeSpans
[ERROR] <https://builds.apache.org/job/ctakes-trunk-compiletest/org.apache.ctakes$ctakes-temporal/ws/src/main/java/org/apache/ctakes/temporal/eval/EvaluationOfTimeSpans.java>:[138,13]
cannot find symbol
symbol  : variable MetaTimeAnnotator
location: class org.apache.ctakes.temporal.eval.EvaluationOfTimeSpans
[ERROR] <https://builds.apache.org/job/ctakes-trunk-compiletest/org.apache.ctakes$ctakes-temporal/ws/src/main/java/org/apache/ctakes/temporal/eval/EvaluationOfTimeSpans.java>:[170,7]
cannot find symbol
symbol  : class MetaTimeAnnotator
location: class org.apache.ctakes.temporal.eval.EvaluationOfTimeSpans
[ERROR] <https://builds.apache.org/job/ctakes-trunk-compiletest/org.apache.ctakes$ctakes-temporal/ws/src/main/java/org/apache/ctakes/temporal/eval/EvaluationOfTimeSpans.java>:[171,13]
cannot find symbol
symbol  : variable MetaTimeAnnotator
location: class org.apache.ctakes.temporal.eval.EvaluationOfTimeSpans
[ERROR] <https://builds.apache.org/job/ctakes-trunk-compiletest/org.apache.ctakes$ctakes-temporal/ws/src/main/java/org/apache/ctakes/temporal/pipelines/EventExtractionPipeline.java>:[154,19]
[deprecation] locateFile(java.lang.String) in org.apache.ctakes.core.resource.FileLocator
has been deprecated
[INFO] 10 errors 
[INFO] -------------------------------------------------------------

Mime
View raw message