ctakes-notifications mailing list archives

Site index · List index
Message view « Date » · « Thread »
Top « Date » · « Thread »
From Apache Jenkins Server <jenk...@builds.apache.org>
Subject Build failed in Jenkins: ctakes-trunk-package » Apache cTAKES Assertion #93
Date Fri, 19 Apr 2013 08:29:10 GMT
See <https://builds.apache.org/job/ctakes-trunk-package/org.apache.ctakes$ctakes-assertion/93/changes>

Changes:

[swu] instance gathering for assertion module, works ok on gold standard data, making changes
to the _initialview.  doesn't get rid of skipped instances that are involved in some relation.

[tmill] Checked in work on many features -- unified feature interface for cue word features
and modified dependency regex features for new dependency parser.

------------------------------------------
[...truncated 59 lines...]
[ERROR] <https://builds.apache.org/job/ctakes-trunk-package/org.apache.ctakes$ctakes-assertion/ws/src/main/java/org/apache/ctakes/assertion/medfacts/cleartk/SubjectCleartkAnalysisEngine.java>:[40,49]
[deprecation] org.cleartk.classifier.feature.proliferate.ProliferatingExtractor in org.cleartk.classifier.feature.proliferate
has been deprecated
[ERROR] <https://builds.apache.org/job/ctakes-trunk-package/org.apache.ctakes$ctakes-assertion/ws/src/main/java/org/apache/ctakes/assertion/eval/AssertionEvaluation.java>:[59,37]
[deprecation] org.cleartk.classifier.opennlp.DefaultMaxentDataWriterFactory in org.cleartk.classifier.opennlp
has been deprecated
[ERROR] <https://builds.apache.org/job/ctakes-trunk-package/org.apache.ctakes$ctakes-assertion/ws/src/main/java/org/apache/ctakes/assertion/medfacts/cleartk/CreateAssertionDescriptor.java>:[21,37]
[deprecation] org.cleartk.classifier.opennlp.DefaultMaxentDataWriterFactory in org.cleartk.classifier.opennlp
has been deprecated
[ERROR] <https://builds.apache.org/job/ctakes-trunk-package/org.apache.ctakes$ctakes-assertion/ws/src/main/java/org/apache/ctakes/assertion/medfacts/cleartk/HistoryCleartkAnalysisEngine.java>:[31,47]
[deprecation] org.cleartk.classifier.feature.extractor.ContextExtractor in org.cleartk.classifier.feature.extractor
has been deprecated
[ERROR] <https://builds.apache.org/job/ctakes-trunk-package/org.apache.ctakes$ctakes-assertion/ws/src/main/java/org/apache/ctakes/assertion/medfacts/cleartk/GenericCleartkAnalysisEngine.java>:[30,47]
[deprecation] org.cleartk.classifier.feature.extractor.ContextExtractor in org.cleartk.classifier.feature.extractor
has been deprecated
[ERROR] <https://builds.apache.org/job/ctakes-trunk-package/org.apache.ctakes$ctakes-assertion/ws/src/main/java/org/apache/ctakes/assertion/medfacts/cleartk/AssertionSampleFeatureGenerator.java>:[8,54]
[deprecation] org.cleartk.classifier.feature.extractor.simple.SpannedTextExtractor in org.cleartk.classifier.feature.extractor.simple
has been deprecated
[ERROR] <https://builds.apache.org/job/ctakes-trunk-package/org.apache.ctakes$ctakes-assertion/ws/src/main/java/org/apache/ctakes/assertion/medfacts/cleartk/AssertionSampleFeatureGenerator.java>:[9,49]
[deprecation] org.cleartk.classifier.feature.proliferate.CapitalTypeProliferator in org.cleartk.classifier.feature.proliferate
has been deprecated
[ERROR] <https://builds.apache.org/job/ctakes-trunk-package/org.apache.ctakes$ctakes-assertion/ws/src/main/java/org/apache/ctakes/assertion/medfacts/cleartk/AssertionSampleFeatureGenerator.java>:[10,49]
[deprecation] org.cleartk.classifier.feature.proliferate.CharacterNGramProliferator in org.cleartk.classifier.feature.proliferate
has been deprecated
[ERROR] <https://builds.apache.org/job/ctakes-trunk-package/org.apache.ctakes$ctakes-assertion/ws/src/main/java/org/apache/ctakes/assertion/medfacts/cleartk/AssertionSampleFeatureGenerator.java>:[11,49]
[deprecation] org.cleartk.classifier.feature.proliferate.LowerCaseProliferator in org.cleartk.classifier.feature.proliferate
has been deprecated
[ERROR] <https://builds.apache.org/job/ctakes-trunk-package/org.apache.ctakes$ctakes-assertion/ws/src/main/java/org/apache/ctakes/assertion/medfacts/cleartk/AssertionSampleFeatureGenerator.java>:[12,49]
[deprecation] org.cleartk.classifier.feature.proliferate.NumericTypeProliferator in org.cleartk.classifier.feature.proliferate
has been deprecated
[ERROR] <https://builds.apache.org/job/ctakes-trunk-package/org.apache.ctakes$ctakes-assertion/ws/src/main/java/org/apache/ctakes/assertion/medfacts/cleartk/AssertionSampleFeatureGenerator.java>:[13,49]
[deprecation] org.cleartk.classifier.feature.proliferate.ProliferatingExtractor in org.cleartk.classifier.feature.proliferate
has been deprecated
[ERROR] <https://builds.apache.org/job/ctakes-trunk-package/org.apache.ctakes$ctakes-assertion/ws/src/main/java/org/apache/ctakes/assertion/medfacts/cleartk/TrainAssertionModel.java>:[41,29]
[deprecation] org.cleartk.classifier.CleartkAnnotatorDescriptionFactory in org.cleartk.classifier
has been deprecated
[ERROR] <https://builds.apache.org/job/ctakes-trunk-package/org.apache.ctakes$ctakes-assertion/ws/src/main/java/org/apache/ctakes/assertion/medfacts/cleartk/TrainAssertionModel.java>:[45,37]
[deprecation] org.cleartk.classifier.opennlp.DefaultMaxentDataWriterFactory in org.cleartk.classifier.opennlp
has been deprecated
[ERROR] <https://builds.apache.org/job/ctakes-trunk-package/org.apache.ctakes$ctakes-assertion/ws/src/main/java/org/apache/ctakes/assertion/medfacts/cleartk/TrainAssertionModel.java>:[46,37]
[deprecation] org.cleartk.classifier.opennlp.MaxentDataWriter in org.cleartk.classifier.opennlp
has been deprecated
[ERROR] <https://builds.apache.org/job/ctakes-trunk-package/org.apache.ctakes$ctakes-assertion/ws/src/main/java/org/apache/ctakes/assertion/util/NegationDepRegex.java>:[87,55]
cannot find symbol
symbol  : class DependencyRegex
location: class org.apache.ctakes.assertion.util.NegationDepRegex
[ERROR] <https://builds.apache.org/job/ctakes-trunk-package/org.apache.ctakes$ctakes-assertion/ws/src/main/java/org/apache/ctakes/assertion/util/NegationDepRegex.java>:[302,56]
cannot find symbol
symbol  : variable ANY_TOKEN
location: class org.apache.ctakes.assertion.util.NegationDepRegex
[ERROR] <https://builds.apache.org/job/ctakes-trunk-package/org.apache.ctakes$ctakes-assertion/ws/src/main/java/org/apache/ctakes/assertion/util/NegationDepRegex.java>:[303,34]
cannot find symbol
symbol  : variable DependencyRegex
location: class org.apache.ctakes.assertion.util.NegationDepRegex
[ERROR] <https://builds.apache.org/job/ctakes-trunk-package/org.apache.ctakes$ctakes-assertion/ws/src/main/java/org/apache/ctakes/assertion/util/NegationDepRegex.java>:[309,61]
cannot find symbol
symbol  : method fromSet(java.util.Set<java.lang.String>)
location: class org.apache.ctakes.assertion.util.NegationDepRegex
[ERROR] <https://builds.apache.org/job/ctakes-trunk-package/org.apache.ctakes$ctakes-assertion/ws/src/main/java/org/apache/ctakes/assertion/util/NegationDepRegex.java>:[311,56]
cannot find symbol
symbol  : variable ANY_TOKEN
location: class org.apache.ctakes.assertion.util.NegationDepRegex
[ERROR] <https://builds.apache.org/job/ctakes-trunk-package/org.apache.ctakes$ctakes-assertion/ws/src/main/java/org/apache/ctakes/assertion/util/NegationDepRegex.java>:[317,64]
cannot find symbol
symbol  : method fromSet(java.util.Set<java.lang.String>)
location: class org.apache.ctakes.assertion.util.NegationDepRegex
[ERROR] <https://builds.apache.org/job/ctakes-trunk-package/org.apache.ctakes$ctakes-assertion/ws/src/main/java/org/apache/ctakes/assertion/util/NegationDepRegex.java>:[320,64]
cannot find symbol
symbol  : method fromSet(java.util.Set<java.lang.String>)
location: class org.apache.ctakes.assertion.util.NegationDepRegex
[ERROR] <https://builds.apache.org/job/ctakes-trunk-package/org.apache.ctakes$ctakes-assertion/ws/src/main/java/org/apache/ctakes/assertion/util/NegationDepRegex.java>:[322,64]
cannot find symbol
symbol  : variable ANY_TOKEN
location: class org.apache.ctakes.assertion.util.NegationDepRegex
[ERROR] <https://builds.apache.org/job/ctakes-trunk-package/org.apache.ctakes$ctakes-assertion/ws/src/main/java/org/apache/ctakes/assertion/util/NegationDepRegex.java>:[324,36]
cannot find symbol
symbol  : variable DependencyRegex
location: class org.apache.ctakes.assertion.util.NegationDepRegex
[ERROR] <https://builds.apache.org/job/ctakes-trunk-package/org.apache.ctakes$ctakes-assertion/ws/src/main/java/org/apache/ctakes/assertion/util/NegationDepRegex.java>:[329,67]
cannot find symbol
symbol  : method fromSet(java.util.Set<java.lang.String>)
location: class org.apache.ctakes.assertion.util.NegationDepRegex
[ERROR] <https://builds.apache.org/job/ctakes-trunk-package/org.apache.ctakes$ctakes-assertion/ws/src/main/java/org/apache/ctakes/assertion/util/NegationDepRegex.java>:[332,67]
cannot find symbol
symbol  : method fromSet(java.util.Set<java.lang.String>)
location: class org.apache.ctakes.assertion.util.NegationDepRegex
[ERROR] <https://builds.apache.org/job/ctakes-trunk-package/org.apache.ctakes$ctakes-assertion/ws/src/main/java/org/apache/ctakes/assertion/util/NegationDepRegex.java>:[334,67]
cannot find symbol
symbol  : method fromSet(java.util.Set<java.lang.String>)
location: class org.apache.ctakes.assertion.util.NegationDepRegex
[ERROR] <https://builds.apache.org/job/ctakes-trunk-package/org.apache.ctakes$ctakes-assertion/ws/src/main/java/org/apache/ctakes/assertion/util/NegationDepRegex.java>:[337,40]
cannot find symbol
symbol  : variable ANY_VERB
location: class org.apache.ctakes.assertion.util.NegationDepRegex
[ERROR] <https://builds.apache.org/job/ctakes-trunk-package/org.apache.ctakes$ctakes-assertion/ws/src/main/java/org/apache/ctakes/assertion/util/NegationDepRegex.java>:[338,67]
cannot find symbol
symbol  : variable ANY_TOKEN
location: class org.apache.ctakes.assertion.util.NegationDepRegex
[ERROR] <https://builds.apache.org/job/ctakes-trunk-package/org.apache.ctakes$ctakes-assertion/ws/src/main/java/org/apache/ctakes/assertion/util/NegationDepRegex.java>:[344,75]
cannot find symbol
symbol  : method fromSet(java.util.Set<java.lang.String>)
location: class org.apache.ctakes.assertion.util.NegationDepRegex
[ERROR] <https://builds.apache.org/job/ctakes-trunk-package/org.apache.ctakes$ctakes-assertion/ws/src/main/java/org/apache/ctakes/assertion/util/NegationDepRegex.java>:[347,75]
cannot find symbol
symbol  : method fromSet(java.util.Set<java.lang.String>)
location: class org.apache.ctakes.assertion.util.NegationDepRegex
[ERROR] <https://builds.apache.org/job/ctakes-trunk-package/org.apache.ctakes$ctakes-assertion/ws/src/main/java/org/apache/ctakes/assertion/util/NegationDepRegex.java>:[350,75]
cannot find symbol
symbol  : method fromSet(java.util.Set<java.lang.String>)
location: class org.apache.ctakes.assertion.util.NegationDepRegex
[ERROR] <https://builds.apache.org/job/ctakes-trunk-package/org.apache.ctakes$ctakes-assertion/ws/src/main/java/org/apache/ctakes/assertion/util/NegationDepRegex.java>:[352,75]
cannot find symbol
symbol  : method fromSet(java.util.Set<java.lang.String>)
location: class org.apache.ctakes.assertion.util.NegationDepRegex
[ERROR] <https://builds.apache.org/job/ctakes-trunk-package/org.apache.ctakes$ctakes-assertion/ws/src/main/java/org/apache/ctakes/assertion/util/NegationDepRegex.java>:[355,73]
cannot find symbol
symbol  : method fromSet(java.util.Set<java.lang.String>)
location: class org.apache.ctakes.assertion.util.NegationDepRegex
[ERROR] <https://builds.apache.org/job/ctakes-trunk-package/org.apache.ctakes$ctakes-assertion/ws/src/main/java/org/apache/ctakes/assertion/util/NegationDepRegex.java>:[358,73]
cannot find symbol
symbol  : variable ANY_TOKEN
location: class org.apache.ctakes.assertion.util.NegationDepRegex
[ERROR] <https://builds.apache.org/job/ctakes-trunk-package/org.apache.ctakes$ctakes-assertion/ws/src/main/java/org/apache/ctakes/assertion/util/NegationDepRegex.java>:[364,59]
cannot find symbol
symbol  : method fromSet(java.util.Set<java.lang.String>)
location: class org.apache.ctakes.assertion.util.NegationDepRegex
[ERROR] <https://builds.apache.org/job/ctakes-trunk-package/org.apache.ctakes$ctakes-assertion/ws/src/main/java/org/apache/ctakes/assertion/util/NegationDepRegex.java>:[367,56]
cannot find symbol
symbol  : variable ANY_TOKEN
location: class org.apache.ctakes.assertion.util.NegationDepRegex
[ERROR] <https://builds.apache.org/job/ctakes-trunk-package/org.apache.ctakes$ctakes-assertion/ws/src/main/java/org/apache/ctakes/assertion/util/NegationDepRegex.java>:[373,66]
cannot find symbol
symbol  : method fromSet(java.util.Set<java.lang.String>)
location: class org.apache.ctakes.assertion.util.NegationDepRegex
[ERROR] <https://builds.apache.org/job/ctakes-trunk-package/org.apache.ctakes$ctakes-assertion/ws/src/main/java/org/apache/ctakes/assertion/util/NegationDepRegex.java>:[376,66]
cannot find symbol
symbol  : method fromSet(java.util.Set<java.lang.String>)
location: class org.apache.ctakes.assertion.util.NegationDepRegex
[ERROR] <https://builds.apache.org/job/ctakes-trunk-package/org.apache.ctakes$ctakes-assertion/ws/src/main/java/org/apache/ctakes/assertion/util/NegationDepRegex.java>:[378,66]
cannot find symbol
symbol  : variable ANY_TOKEN
location: class org.apache.ctakes.assertion.util.NegationDepRegex
[ERROR] <https://builds.apache.org/job/ctakes-trunk-package/org.apache.ctakes$ctakes-assertion/ws/src/main/java/org/apache/ctakes/assertion/util/NegationDepRegex.java>:[385,54]
cannot find symbol
symbol  : method fromSet(java.util.Set<java.lang.String>)
location: class org.apache.ctakes.assertion.util.NegationDepRegex
[ERROR] <https://builds.apache.org/job/ctakes-trunk-package/org.apache.ctakes$ctakes-assertion/ws/src/main/java/org/apache/ctakes/assertion/util/NegationDepRegex.java>:[388,54]
cannot find symbol
symbol  : variable ANY_TOKEN
location: class org.apache.ctakes.assertion.util.NegationDepRegex
[ERROR] <https://builds.apache.org/job/ctakes-trunk-package/org.apache.ctakes$ctakes-assertion/ws/src/main/java/org/apache/ctakes/assertion/util/NegationDepRegex.java>:[389,33]
cannot find symbol
symbol  : variable DependencyRegex
location: class org.apache.ctakes.assertion.util.NegationDepRegex
[ERROR] <https://builds.apache.org/job/ctakes-trunk-package/org.apache.ctakes$ctakes-assertion/ws/src/main/java/org/apache/ctakes/assertion/util/NegationDepRegex.java>:[394,54]
cannot find symbol
symbol  : method fromSet(java.util.Set<java.lang.String>)
location: class org.apache.ctakes.assertion.util.NegationDepRegex
[ERROR] <https://builds.apache.org/job/ctakes-trunk-package/org.apache.ctakes$ctakes-assertion/ws/src/main/java/org/apache/ctakes/assertion/util/NegationDepRegex.java>:[397,54]
cannot find symbol
symbol  : variable ANY_TOKEN
location: class org.apache.ctakes.assertion.util.NegationDepRegex
[ERROR] <https://builds.apache.org/job/ctakes-trunk-package/org.apache.ctakes$ctakes-assertion/ws/src/main/java/org/apache/ctakes/assertion/util/NegationDepRegex.java>:[398,33]
cannot find symbol
symbol  : variable DependencyRegex
location: class org.apache.ctakes.assertion.util.NegationDepRegex
[ERROR] <https://builds.apache.org/job/ctakes-trunk-package/org.apache.ctakes$ctakes-assertion/ws/src/main/java/org/apache/ctakes/assertion/util/NegationDepRegex.java>:[403,58]
cannot find symbol
symbol  : method fromSet(java.util.Set<java.lang.String>)
location: class org.apache.ctakes.assertion.util.NegationDepRegex
[ERROR] <https://builds.apache.org/job/ctakes-trunk-package/org.apache.ctakes$ctakes-assertion/ws/src/main/java/org/apache/ctakes/assertion/util/NegationDepRegex.java>:[406,58]
cannot find symbol
symbol  : method fromSet(java.util.Set<java.lang.String>)
location: class org.apache.ctakes.assertion.util.NegationDepRegex
[ERROR] <https://builds.apache.org/job/ctakes-trunk-package/org.apache.ctakes$ctakes-assertion/ws/src/main/java/org/apache/ctakes/assertion/util/NegationDepRegex.java>:[408,58]
cannot find symbol
symbol  : method fromSet(java.util.Set<java.lang.String>)
location: class org.apache.ctakes.assertion.util.NegationDepRegex
[ERROR] <https://builds.apache.org/job/ctakes-trunk-package/org.apache.ctakes$ctakes-assertion/ws/src/main/java/org/apache/ctakes/assertion/util/NegationDepRegex.java>:[411,58]
cannot find symbol
symbol  : variable ANY_TOKEN
location: class org.apache.ctakes.assertion.util.NegationDepRegex
[ERROR] <https://builds.apache.org/job/ctakes-trunk-package/org.apache.ctakes$ctakes-assertion/ws/src/main/java/org/apache/ctakes/assertion/util/NegationDepRegex.java>:[430,60]
cannot find symbol
symbol  : method fromSet(java.util.Set<java.lang.String>)
location: class org.apache.ctakes.assertion.util.NegationDepRegex
[ERROR] <https://builds.apache.org/job/ctakes-trunk-package/org.apache.ctakes$ctakes-assertion/ws/src/main/java/org/apache/ctakes/assertion/util/NegationDepRegex.java>:[432,60]
cannot find symbol
symbol  : method fromSet(java.util.Set<java.lang.String>)
location: class org.apache.ctakes.assertion.util.NegationDepRegex
[ERROR] <https://builds.apache.org/job/ctakes-trunk-package/org.apache.ctakes$ctakes-assertion/ws/src/main/java/org/apache/ctakes/assertion/util/NegationDepRegex.java>:[435,60]
cannot find symbol
symbol  : variable ANY_TOKEN
location: class org.apache.ctakes.assertion.util.NegationDepRegex
[ERROR] <https://builds.apache.org/job/ctakes-trunk-package/org.apache.ctakes$ctakes-assertion/ws/src/main/java/org/apache/ctakes/assertion/util/NegationDepRegex.java>:[442,62]
cannot find symbol
symbol  : method fromSet(java.util.Set<java.lang.String>)
location: class org.apache.ctakes.assertion.util.NegationDepRegex
[ERROR] <https://builds.apache.org/job/ctakes-trunk-package/org.apache.ctakes$ctakes-assertion/ws/src/main/java/org/apache/ctakes/assertion/util/NegationDepRegex.java>:[444,62]
cannot find symbol
symbol  : variable ANY_TOKEN
location: class org.apache.ctakes.assertion.util.NegationDepRegex
[ERROR] <https://builds.apache.org/job/ctakes-trunk-package/org.apache.ctakes$ctakes-assertion/ws/src/main/java/org/apache/ctakes/assertion/util/NegationDepRegex.java>:[446,62]
cannot find symbol
symbol  : variable ANY_TOKEN
location: class org.apache.ctakes.assertion.util.NegationDepRegex
[ERROR] <https://builds.apache.org/job/ctakes-trunk-package/org.apache.ctakes$ctakes-assertion/ws/src/main/java/org/apache/ctakes/assertion/util/NegationDepRegex.java>:[448,62]
cannot find symbol
symbol  : variable ANY_TOKEN
location: class org.apache.ctakes.assertion.util.NegationDepRegex
[ERROR] <https://builds.apache.org/job/ctakes-trunk-package/org.apache.ctakes$ctakes-assertion/ws/src/main/java/org/apache/ctakes/assertion/util/NegationDepRegex.java>:[454,53]
cannot find symbol
symbol  : method fromSet(java.util.Set<java.lang.String>)
location: class org.apache.ctakes.assertion.util.NegationDepRegex
[ERROR] <https://builds.apache.org/job/ctakes-trunk-package/org.apache.ctakes$ctakes-assertion/ws/src/main/java/org/apache/ctakes/assertion/util/NegationDepRegex.java>:[456,53]
cannot find symbol
symbol  : variable ANY_TOKEN
location: class org.apache.ctakes.assertion.util.NegationDepRegex
[ERROR] <https://builds.apache.org/job/ctakes-trunk-package/org.apache.ctakes$ctakes-assertion/ws/src/main/java/org/apache/ctakes/assertion/util/NegationDepRegex.java>:[457,32]
cannot find symbol
symbol  : variable DependencyRegex
location: class org.apache.ctakes.assertion.util.NegationDepRegex
[ERROR] <https://builds.apache.org/job/ctakes-trunk-package/org.apache.ctakes$ctakes-assertion/ws/src/main/java/org/apache/ctakes/assertion/util/NegationDepRegex.java>:[462,2]
cannot find symbol
symbol  : class DependencyRegex
location: class org.apache.ctakes.assertion.util.NegationDepRegex
[ERROR] <https://builds.apache.org/job/ctakes-trunk-package/org.apache.ctakes$ctakes-assertion/ws/src/main/java/org/apache/ctakes/assertion/util/NegationDepRegex.java>:[463,9]
cannot find symbol
symbol  : class DependencyRegex
location: class org.apache.ctakes.assertion.util.NegationDepRegex
[ERROR] <https://builds.apache.org/job/ctakes-trunk-package/org.apache.ctakes$ctakes-assertion/ws/src/main/java/org/apache/ctakes/assertion/util/NegationDepRegex.java>:[466,2]
cannot find symbol
symbol  : class DependencyRegex
location: class org.apache.ctakes.assertion.util.NegationDepRegex
[ERROR] <https://builds.apache.org/job/ctakes-trunk-package/org.apache.ctakes$ctakes-assertion/ws/src/main/java/org/apache/ctakes/assertion/util/NegationDepRegex.java>:[467,9]
cannot find symbol
symbol  : class DependencyRegex
location: class org.apache.ctakes.assertion.util.NegationDepRegex
[ERROR] <https://builds.apache.org/job/ctakes-trunk-package/org.apache.ctakes$ctakes-assertion/ws/src/main/java/org/apache/ctakes/assertion/util/NegationDepRegex.java>:[470,2]
cannot find symbol
symbol  : class DependencyRegex
location: class org.apache.ctakes.assertion.util.NegationDepRegex
[ERROR] <https://builds.apache.org/job/ctakes-trunk-package/org.apache.ctakes$ctakes-assertion/ws/src/main/java/org/apache/ctakes/assertion/util/NegationDepRegex.java>:[471,9]
cannot find symbol
symbol  : class DependencyRegex
location: class org.apache.ctakes.assertion.util.NegationDepRegex
[ERROR] <https://builds.apache.org/job/ctakes-trunk-package/org.apache.ctakes$ctakes-assertion/ws/src/main/java/org/apache/ctakes/assertion/util/NegationDepRegex.java>:[474,2]
cannot find symbol
symbol  : class DependencyRegex
location: class org.apache.ctakes.assertion.util.NegationDepRegex
[ERROR] <https://builds.apache.org/job/ctakes-trunk-package/org.apache.ctakes$ctakes-assertion/ws/src/main/java/org/apache/ctakes/assertion/util/NegationDepRegex.java>:[475,9]
cannot find symbol
symbol  : class DependencyRegex
location: class org.apache.ctakes.assertion.util.NegationDepRegex
[ERROR] <https://builds.apache.org/job/ctakes-trunk-package/org.apache.ctakes$ctakes-assertion/ws/src/main/java/org/apache/ctakes/assertion/util/NegationDepRegex.java>:[478,2]
cannot find symbol
symbol  : class DependencyRegex
location: class org.apache.ctakes.assertion.util.NegationDepRegex
[ERROR] <https://builds.apache.org/job/ctakes-trunk-package/org.apache.ctakes$ctakes-assertion/ws/src/main/java/org/apache/ctakes/assertion/util/NegationDepRegex.java>:[479,9]
cannot find symbol
symbol  : class DependencyRegex
location: class org.apache.ctakes.assertion.util.NegationDepRegex
[ERROR] <https://builds.apache.org/job/ctakes-trunk-package/org.apache.ctakes$ctakes-assertion/ws/src/main/java/org/apache/ctakes/assertion/util/NegationDepRegex.java>:[483,2]
cannot find symbol
symbol  : class DependencyRegex
location: class org.apache.ctakes.assertion.util.NegationDepRegex
[ERROR] <https://builds.apache.org/job/ctakes-trunk-package/org.apache.ctakes$ctakes-assertion/ws/src/main/java/org/apache/ctakes/assertion/util/NegationDepRegex.java>:[484,9]
cannot find symbol
symbol  : class DependencyRegex
location: class org.apache.ctakes.assertion.util.NegationDepRegex
[ERROR] <https://builds.apache.org/job/ctakes-trunk-package/org.apache.ctakes$ctakes-assertion/ws/src/main/java/org/apache/ctakes/assertion/util/NegationDepRegex.java>:[489,2]
cannot find symbol
symbol  : class DependencyRegex
location: class org.apache.ctakes.assertion.util.NegationDepRegex
[ERROR] <https://builds.apache.org/job/ctakes-trunk-package/org.apache.ctakes$ctakes-assertion/ws/src/main/java/org/apache/ctakes/assertion/util/NegationDepRegex.java>:[490,9]
cannot find symbol
symbol  : class DependencyRegex
location: class org.apache.ctakes.assertion.util.NegationDepRegex
[ERROR] <https://builds.apache.org/job/ctakes-trunk-package/org.apache.ctakes$ctakes-assertion/ws/src/main/java/org/apache/ctakes/assertion/util/NegationDepRegex.java>:[493,2]
cannot find symbol
symbol  : class DependencyRegex
location: class org.apache.ctakes.assertion.util.NegationDepRegex
[ERROR] <https://builds.apache.org/job/ctakes-trunk-package/org.apache.ctakes$ctakes-assertion/ws/src/main/java/org/apache/ctakes/assertion/util/NegationDepRegex.java>:[494,9]
cannot find symbol
symbol  : class DependencyRegex
location: class org.apache.ctakes.assertion.util.NegationDepRegex
[ERROR] <https://builds.apache.org/job/ctakes-trunk-package/org.apache.ctakes$ctakes-assertion/ws/src/main/java/org/apache/ctakes/assertion/util/NegationDepRegex.java>:[497,2]
cannot find symbol
symbol  : class DependencyRegex
location: class org.apache.ctakes.assertion.util.NegationDepRegex
[ERROR] <https://builds.apache.org/job/ctakes-trunk-package/org.apache.ctakes$ctakes-assertion/ws/src/main/java/org/apache/ctakes/assertion/util/NegationDepRegex.java>:[498,9]
cannot find symbol
symbol  : class DependencyRegex
location: class org.apache.ctakes.assertion.util.NegationDepRegex
[ERROR] <https://builds.apache.org/job/ctakes-trunk-package/org.apache.ctakes$ctakes-assertion/ws/src/main/java/org/apache/ctakes/assertion/util/NegationDepRegex.java>:[501,2]
cannot find symbol
symbol  : class DependencyRegex
location: class org.apache.ctakes.assertion.util.NegationDepRegex
[ERROR] <https://builds.apache.org/job/ctakes-trunk-package/org.apache.ctakes$ctakes-assertion/ws/src/main/java/org/apache/ctakes/assertion/util/NegationDepRegex.java>:[502,9]
cannot find symbol
symbol  : class DependencyRegex
location: class org.apache.ctakes.assertion.util.NegationDepRegex
[ERROR] <https://builds.apache.org/job/ctakes-trunk-package/org.apache.ctakes$ctakes-assertion/ws/src/main/java/org/apache/ctakes/assertion/util/NegationDepRegex.java>:[505,2]
cannot find symbol
symbol  : class DependencyRegex
location: class org.apache.ctakes.assertion.util.NegationDepRegex
[ERROR] <https://builds.apache.org/job/ctakes-trunk-package/org.apache.ctakes$ctakes-assertion/ws/src/main/java/org/apache/ctakes/assertion/util/NegationDepRegex.java>:[506,9]
cannot find symbol
symbol  : class DependencyRegex
location: class org.apache.ctakes.assertion.util.NegationDepRegex
[ERROR] <https://builds.apache.org/job/ctakes-trunk-package/org.apache.ctakes$ctakes-assertion/ws/src/main/java/org/apache/ctakes/assertion/util/NegationDepRegex.java>:[509,2]
cannot find symbol
symbol  : class DependencyRegex
location: class org.apache.ctakes.assertion.util.NegationDepRegex
[ERROR] <https://builds.apache.org/job/ctakes-trunk-package/org.apache.ctakes$ctakes-assertion/ws/src/main/java/org/apache/ctakes/assertion/util/NegationDepRegex.java>:[510,9]
cannot find symbol
symbol  : class DependencyRegex
location: class org.apache.ctakes.assertion.util.NegationDepRegex
[ERROR] <https://builds.apache.org/job/ctakes-trunk-package/org.apache.ctakes$ctakes-assertion/ws/src/main/java/org/apache/ctakes/assertion/util/NegationDepRegex.java>:[519,7]
cannot find symbol
symbol  : class DependencyRegex
location: class org.apache.ctakes.assertion.util.NegationDepRegex
[ERROR] <https://builds.apache.org/job/ctakes-trunk-package/org.apache.ctakes$ctakes-assertion/ws/src/main/java/org/apache/ctakes/assertion/medfacts/cleartk/SubjectCleartkAnalysisEngine.java>:[71,49]
[deprecation] org.cleartk.classifier.feature.extractor.ContextExtractor in org.cleartk.classifier.feature.extractor
has been deprecated
[ERROR] <https://builds.apache.org/job/ctakes-trunk-package/org.apache.ctakes$ctakes-assertion/ws/src/main/java/org/apache/ctakes/assertion/medfacts/cleartk/SubjectCleartkAnalysisEngine.java>:[74,8]
[deprecation] org.cleartk.classifier.feature.extractor.ContextExtractor in org.cleartk.classifier.feature.extractor
has been deprecated
[ERROR] <https://builds.apache.org/job/ctakes-trunk-package/org.apache.ctakes$ctakes-assertion/ws/src/main/java/org/apache/ctakes/assertion/eval/AssertionEvaluation.java>:[257,72]
[deprecation] org.cleartk.classifier.opennlp.DefaultMaxentDataWriterFactory in org.cleartk.classifier.opennlp
has been deprecated
[ERROR] <https://builds.apache.org/job/ctakes-trunk-package/org.apache.ctakes$ctakes-assertion/ws/src/main/java/org/apache/ctakes/assertion/eval/AssertionEvaluation.java>:[310,55]
[unchecked] unchecked call to addAll(org.cleartk.eval.AnnotationStatistics<OUTCOME_TYPE>)
as a member of the raw type org.cleartk.eval.AnnotationStatistics
[ERROR] <https://builds.apache.org/job/ctakes-trunk-package/org.apache.ctakes$ctakes-assertion/ws/src/main/java/org/apache/ctakes/assertion/eval/AssertionEvaluation.java>:[696,24]
[unchecked] unchecked call to <ANNOTATION_TYPE,SPAN_TYPE>add(java.util.Collection<?
extends ANNOTATION_TYPE>,java.util.Collection<? extends ANNOTATION_TYPE>,com.google.common.base.Function<ANNOTATION_TYPE,SPAN_TYPE>,com.google.common.base.Function<ANNOTATION_TYPE,OUTCOME_TYPE>)
as a member of the raw type org.cleartk.eval.AnnotationStatistics
[ERROR] <https://builds.apache.org/job/ctakes-trunk-package/org.apache.ctakes$ctakes-assertion/ws/src/main/java/org/apache/ctakes/assertion/eval/AssertionEvaluation.java>:[706,27]
[unchecked] unchecked call to <ANNOTATION_TYPE,SPAN_TYPE>add(java.util.Collection<?
extends ANNOTATION_TYPE>,java.util.Collection<? extends ANNOTATION_TYPE>,com.google.common.base.Function<ANNOTATION_TYPE,SPAN_TYPE>,com.google.common.base.Function<ANNOTATION_TYPE,OUTCOME_TYPE>)
as a member of the raw type org.cleartk.eval.AnnotationStatistics
[ERROR] <https://builds.apache.org/job/ctakes-trunk-package/org.apache.ctakes$ctakes-assertion/ws/src/main/java/org/apache/ctakes/assertion/eval/AssertionEvaluation.java>:[716,27]
[unchecked] unchecked call to <ANNOTATION_TYPE,SPAN_TYPE>add(java.util.Collection<?
extends ANNOTATION_TYPE>,java.util.Collection<? extends ANNOTATION_TYPE>,com.google.common.base.Function<ANNOTATION_TYPE,SPAN_TYPE>,com.google.common.base.Function<ANNOTATION_TYPE,OUTCOME_TYPE>)
as a member of the raw type org.cleartk.eval.AnnotationStatistics
[ERROR] <https://builds.apache.org/job/ctakes-trunk-package/org.apache.ctakes$ctakes-assertion/ws/src/main/java/org/apache/ctakes/assertion/eval/AssertionEvaluation.java>:[726,23]
[unchecked] unchecked call to <ANNOTATION_TYPE,SPAN_TYPE>add(java.util.Collection<?
extends ANNOTATION_TYPE>,java.util.Collection<? extends ANNOTATION_TYPE>,com.google.common.base.Function<ANNOTATION_TYPE,SPAN_TYPE>,com.google.common.base.Function<ANNOTATION_TYPE,OUTCOME_TYPE>)
as a member of the raw type org.cleartk.eval.AnnotationStatistics
[ERROR] <https://builds.apache.org/job/ctakes-trunk-package/org.apache.ctakes$ctakes-assertion/ws/src/main/java/org/apache/ctakes/assertion/eval/AssertionEvaluation.java>:[736,23]
[unchecked] unchecked call to <ANNOTATION_TYPE,SPAN_TYPE>add(java.util.Collection<?
extends ANNOTATION_TYPE>,java.util.Collection<? extends ANNOTATION_TYPE>,com.google.common.base.Function<ANNOTATION_TYPE,SPAN_TYPE>,com.google.common.base.Function<ANNOTATION_TYPE,OUTCOME_TYPE>)
as a member of the raw type org.cleartk.eval.AnnotationStatistics
[ERROR] <https://builds.apache.org/job/ctakes-trunk-package/org.apache.ctakes$ctakes-assertion/ws/src/main/java/org/apache/ctakes/assertion/eval/AssertionEvaluation.java>:[747,23]
[unchecked] unchecked call to <ANNOTATION_TYPE,SPAN_TYPE>add(java.util.Collection<?
extends ANNOTATION_TYPE>,java.util.Collection<? extends ANNOTATION_TYPE>,com.google.common.base.Function<ANNOTATION_TYPE,SPAN_TYPE>,com.google.common.base.Function<ANNOTATION_TYPE,OUTCOME_TYPE>)
as a member of the raw type org.cleartk.eval.AnnotationStatistics
[ERROR] <https://builds.apache.org/job/ctakes-trunk-package/org.apache.ctakes$ctakes-assertion/ws/src/main/java/org/apache/ctakes/assertion/medfacts/cleartk/CreateAssertionDescriptor.java>:[33,90]
[deprecation] org.cleartk.classifier.opennlp.DefaultMaxentDataWriterFactory in org.cleartk.classifier.opennlp
has been deprecated
[ERROR] <https://builds.apache.org/job/ctakes-trunk-package/org.apache.ctakes$ctakes-assertion/ws/src/main/java/org/apache/ctakes/assertion/medfacts/CasIndexer.java>:[74,21]
[unchecked] unchecked cast
found   : org.apache.uima.jcas.tcas.Annotation
required: T
[ERROR] <https://builds.apache.org/job/ctakes-trunk-package/org.apache.ctakes$ctakes-assertion/ws/src/main/java/org/apache/ctakes/assertion/medfacts/cleartk/HistoryCleartkAnalysisEngine.java>:[59,49]
[deprecation] org.cleartk.classifier.feature.extractor.ContextExtractor in org.cleartk.classifier.feature.extractor
has been deprecated
[ERROR] <https://builds.apache.org/job/ctakes-trunk-package/org.apache.ctakes$ctakes-assertion/ws/src/main/java/org/apache/ctakes/assertion/medfacts/cleartk/HistoryCleartkAnalysisEngine.java>:[62,8]
[deprecation] org.cleartk.classifier.feature.extractor.ContextExtractor in org.cleartk.classifier.feature.extractor
has been deprecated
[ERROR] <https://builds.apache.org/job/ctakes-trunk-package/org.apache.ctakes$ctakes-assertion/ws/src/main/java/org/apache/ctakes/assertion/pipelines/RunJudgeAttributeInstances.java>:[93,35]
[unchecked] unchecked conversion
found   : java.util.List
required: java.util.List<java.io.File>
[ERROR] <https://builds.apache.org/job/ctakes-trunk-package/org.apache.ctakes$ctakes-assertion/ws/src/main/java/org/apache/ctakes/assertion/cr/XmiCollectionReaderCtakes.java>:[81,18]
[unchecked] unchecked call to add(E) as a member of the raw type java.util.ArrayList
[ERROR] <https://builds.apache.org/job/ctakes-trunk-package/org.apache.ctakes$ctakes-assertion/ws/src/main/java/org/apache/ctakes/assertion/medfacts/cleartk/GenericCleartkAnalysisEngine.java>:[58,49]
[deprecation] org.cleartk.classifier.feature.extractor.ContextExtractor in org.cleartk.classifier.feature.extractor
has been deprecated
[ERROR] <https://builds.apache.org/job/ctakes-trunk-package/org.apache.ctakes$ctakes-assertion/ws/src/main/java/org/apache/ctakes/assertion/medfacts/cleartk/GenericCleartkAnalysisEngine.java>:[61,8]
[deprecation] org.cleartk.classifier.feature.extractor.ContextExtractor in org.cleartk.classifier.feature.extractor
has been deprecated
[ERROR] <https://builds.apache.org/job/ctakes-trunk-package/org.apache.ctakes$ctakes-assertion/ws/src/main/java/org/apache/ctakes/assertion/medfacts/cleartk/TrainAssertionModel.java>:[292,72]
[deprecation] org.cleartk.classifier.opennlp.DefaultMaxentDataWriterFactory in org.cleartk.classifier.opennlp
has been deprecated
[INFO] 131 errors 
[INFO] -------------------------------------------------------------

Mime
View raw message