ctakes-notifications mailing list archives

Site index · List index
Message view « Date » · « Thread »
Top « Date » · « Thread »
From Apache Jenkins Server <jenk...@builds.apache.org>
Subject Build failed in Jenkins: ctakes-trunk-package #93
Date Fri, 19 Apr 2013 08:34:09 GMT
See <https://builds.apache.org/job/ctakes-trunk-package/93/changes>

Changes:

[swu] instance gathering for assertion module, works ok on gold standard data, making changes
to the _initialview.  doesn't get rid of skipped instances that are involved in some relation.

[tmill] Checked in work on many features -- unified feature interface for cue word features
and modified dependency regex features for new dependency parser.

------------------------------------------
[...truncated 3407 lines...]
location: class org.apache.ctakes.assertion.util.NegationDepRegex
[ERROR] <https://builds.apache.org/job/ctakes-trunk-package/ws/ctakes-assertion/src/main/java/org/apache/ctakes/assertion/util/NegationDepRegex.java>:[448,62]
cannot find symbol
symbol  : variable ANY_TOKEN
location: class org.apache.ctakes.assertion.util.NegationDepRegex
[ERROR] <https://builds.apache.org/job/ctakes-trunk-package/ws/ctakes-assertion/src/main/java/org/apache/ctakes/assertion/util/NegationDepRegex.java>:[454,53]
cannot find symbol
symbol  : method fromSet(java.util.Set<java.lang.String>)
location: class org.apache.ctakes.assertion.util.NegationDepRegex
[ERROR] <https://builds.apache.org/job/ctakes-trunk-package/ws/ctakes-assertion/src/main/java/org/apache/ctakes/assertion/util/NegationDepRegex.java>:[456,53]
cannot find symbol
symbol  : variable ANY_TOKEN
location: class org.apache.ctakes.assertion.util.NegationDepRegex
[ERROR] <https://builds.apache.org/job/ctakes-trunk-package/ws/ctakes-assertion/src/main/java/org/apache/ctakes/assertion/util/NegationDepRegex.java>:[457,32]
cannot find symbol
symbol  : variable DependencyRegex
location: class org.apache.ctakes.assertion.util.NegationDepRegex
[ERROR] <https://builds.apache.org/job/ctakes-trunk-package/ws/ctakes-assertion/src/main/java/org/apache/ctakes/assertion/util/NegationDepRegex.java>:[462,2]
cannot find symbol
symbol  : class DependencyRegex
location: class org.apache.ctakes.assertion.util.NegationDepRegex
[ERROR] <https://builds.apache.org/job/ctakes-trunk-package/ws/ctakes-assertion/src/main/java/org/apache/ctakes/assertion/util/NegationDepRegex.java>:[463,9]
cannot find symbol
symbol  : class DependencyRegex
location: class org.apache.ctakes.assertion.util.NegationDepRegex
[ERROR] <https://builds.apache.org/job/ctakes-trunk-package/ws/ctakes-assertion/src/main/java/org/apache/ctakes/assertion/util/NegationDepRegex.java>:[466,2]
cannot find symbol
symbol  : class DependencyRegex
location: class org.apache.ctakes.assertion.util.NegationDepRegex
[ERROR] <https://builds.apache.org/job/ctakes-trunk-package/ws/ctakes-assertion/src/main/java/org/apache/ctakes/assertion/util/NegationDepRegex.java>:[467,9]
cannot find symbol
symbol  : class DependencyRegex
location: class org.apache.ctakes.assertion.util.NegationDepRegex
[ERROR] <https://builds.apache.org/job/ctakes-trunk-package/ws/ctakes-assertion/src/main/java/org/apache/ctakes/assertion/util/NegationDepRegex.java>:[470,2]
cannot find symbol
symbol  : class DependencyRegex
location: class org.apache.ctakes.assertion.util.NegationDepRegex
[ERROR] <https://builds.apache.org/job/ctakes-trunk-package/ws/ctakes-assertion/src/main/java/org/apache/ctakes/assertion/util/NegationDepRegex.java>:[471,9]
cannot find symbol
symbol  : class DependencyRegex
location: class org.apache.ctakes.assertion.util.NegationDepRegex
[ERROR] <https://builds.apache.org/job/ctakes-trunk-package/ws/ctakes-assertion/src/main/java/org/apache/ctakes/assertion/util/NegationDepRegex.java>:[474,2]
cannot find symbol
symbol  : class DependencyRegex
location: class org.apache.ctakes.assertion.util.NegationDepRegex
[ERROR] <https://builds.apache.org/job/ctakes-trunk-package/ws/ctakes-assertion/src/main/java/org/apache/ctakes/assertion/util/NegationDepRegex.java>:[475,9]
cannot find symbol
symbol  : class DependencyRegex
location: class org.apache.ctakes.assertion.util.NegationDepRegex
[ERROR] <https://builds.apache.org/job/ctakes-trunk-package/ws/ctakes-assertion/src/main/java/org/apache/ctakes/assertion/util/NegationDepRegex.java>:[478,2]
cannot find symbol
symbol  : class DependencyRegex
location: class org.apache.ctakes.assertion.util.NegationDepRegex
[ERROR] <https://builds.apache.org/job/ctakes-trunk-package/ws/ctakes-assertion/src/main/java/org/apache/ctakes/assertion/util/NegationDepRegex.java>:[479,9]
cannot find symbol
symbol  : class DependencyRegex
location: class org.apache.ctakes.assertion.util.NegationDepRegex
[ERROR] <https://builds.apache.org/job/ctakes-trunk-package/ws/ctakes-assertion/src/main/java/org/apache/ctakes/assertion/util/NegationDepRegex.java>:[483,2]
cannot find symbol
symbol  : class DependencyRegex
location: class org.apache.ctakes.assertion.util.NegationDepRegex
[ERROR] <https://builds.apache.org/job/ctakes-trunk-package/ws/ctakes-assertion/src/main/java/org/apache/ctakes/assertion/util/NegationDepRegex.java>:[484,9]
cannot find symbol
symbol  : class DependencyRegex
location: class org.apache.ctakes.assertion.util.NegationDepRegex
[ERROR] <https://builds.apache.org/job/ctakes-trunk-package/ws/ctakes-assertion/src/main/java/org/apache/ctakes/assertion/util/NegationDepRegex.java>:[489,2]
cannot find symbol
symbol  : class DependencyRegex
location: class org.apache.ctakes.assertion.util.NegationDepRegex
[ERROR] <https://builds.apache.org/job/ctakes-trunk-package/ws/ctakes-assertion/src/main/java/org/apache/ctakes/assertion/util/NegationDepRegex.java>:[490,9]
cannot find symbol
symbol  : class DependencyRegex
location: class org.apache.ctakes.assertion.util.NegationDepRegex
[ERROR] <https://builds.apache.org/job/ctakes-trunk-package/ws/ctakes-assertion/src/main/java/org/apache/ctakes/assertion/util/NegationDepRegex.java>:[493,2]
cannot find symbol
symbol  : class DependencyRegex
location: class org.apache.ctakes.assertion.util.NegationDepRegex
[ERROR] <https://builds.apache.org/job/ctakes-trunk-package/ws/ctakes-assertion/src/main/java/org/apache/ctakes/assertion/util/NegationDepRegex.java>:[494,9]
cannot find symbol
symbol  : class DependencyRegex
location: class org.apache.ctakes.assertion.util.NegationDepRegex
[ERROR] <https://builds.apache.org/job/ctakes-trunk-package/ws/ctakes-assertion/src/main/java/org/apache/ctakes/assertion/util/NegationDepRegex.java>:[497,2]
cannot find symbol
symbol  : class DependencyRegex
location: class org.apache.ctakes.assertion.util.NegationDepRegex
[ERROR] <https://builds.apache.org/job/ctakes-trunk-package/ws/ctakes-assertion/src/main/java/org/apache/ctakes/assertion/util/NegationDepRegex.java>:[498,9]
cannot find symbol
symbol  : class DependencyRegex
location: class org.apache.ctakes.assertion.util.NegationDepRegex
[ERROR] <https://builds.apache.org/job/ctakes-trunk-package/ws/ctakes-assertion/src/main/java/org/apache/ctakes/assertion/util/NegationDepRegex.java>:[501,2]
cannot find symbol
symbol  : class DependencyRegex
location: class org.apache.ctakes.assertion.util.NegationDepRegex
[ERROR] <https://builds.apache.org/job/ctakes-trunk-package/ws/ctakes-assertion/src/main/java/org/apache/ctakes/assertion/util/NegationDepRegex.java>:[502,9]
cannot find symbol
symbol  : class DependencyRegex
location: class org.apache.ctakes.assertion.util.NegationDepRegex
[ERROR] <https://builds.apache.org/job/ctakes-trunk-package/ws/ctakes-assertion/src/main/java/org/apache/ctakes/assertion/util/NegationDepRegex.java>:[505,2]
cannot find symbol
symbol  : class DependencyRegex
location: class org.apache.ctakes.assertion.util.NegationDepRegex
[ERROR] <https://builds.apache.org/job/ctakes-trunk-package/ws/ctakes-assertion/src/main/java/org/apache/ctakes/assertion/util/NegationDepRegex.java>:[506,9]
cannot find symbol
symbol  : class DependencyRegex
location: class org.apache.ctakes.assertion.util.NegationDepRegex
[ERROR] <https://builds.apache.org/job/ctakes-trunk-package/ws/ctakes-assertion/src/main/java/org/apache/ctakes/assertion/util/NegationDepRegex.java>:[509,2]
cannot find symbol
symbol  : class DependencyRegex
location: class org.apache.ctakes.assertion.util.NegationDepRegex
[ERROR] <https://builds.apache.org/job/ctakes-trunk-package/ws/ctakes-assertion/src/main/java/org/apache/ctakes/assertion/util/NegationDepRegex.java>:[510,9]
cannot find symbol
symbol  : class DependencyRegex
location: class org.apache.ctakes.assertion.util.NegationDepRegex
[ERROR] <https://builds.apache.org/job/ctakes-trunk-package/ws/ctakes-assertion/src/main/java/org/apache/ctakes/assertion/util/NegationDepRegex.java>:[519,7]
cannot find symbol
symbol  : class DependencyRegex
location: class org.apache.ctakes.assertion.util.NegationDepRegex
[ERROR] <https://builds.apache.org/job/ctakes-trunk-package/ws/ctakes-assertion/src/main/java/org/apache/ctakes/assertion/medfacts/cleartk/SubjectCleartkAnalysisEngine.java>:[71,49]
[deprecation] org.cleartk.classifier.feature.extractor.ContextExtractor in org.cleartk.classifier.feature.extractor
has been deprecated
[ERROR] <https://builds.apache.org/job/ctakes-trunk-package/ws/ctakes-assertion/src/main/java/org/apache/ctakes/assertion/medfacts/cleartk/SubjectCleartkAnalysisEngine.java>:[74,8]
[deprecation] org.cleartk.classifier.feature.extractor.ContextExtractor in org.cleartk.classifier.feature.extractor
has been deprecated
[ERROR] <https://builds.apache.org/job/ctakes-trunk-package/ws/ctakes-assertion/src/main/java/org/apache/ctakes/assertion/eval/AssertionEvaluation.java>:[257,72]
[deprecation] org.cleartk.classifier.opennlp.DefaultMaxentDataWriterFactory in org.cleartk.classifier.opennlp
has been deprecated
[ERROR] <https://builds.apache.org/job/ctakes-trunk-package/ws/ctakes-assertion/src/main/java/org/apache/ctakes/assertion/eval/AssertionEvaluation.java>:[310,55]
[unchecked] unchecked call to addAll(org.cleartk.eval.AnnotationStatistics<OUTCOME_TYPE>)
as a member of the raw type org.cleartk.eval.AnnotationStatistics
[ERROR] <https://builds.apache.org/job/ctakes-trunk-package/ws/ctakes-assertion/src/main/java/org/apache/ctakes/assertion/eval/AssertionEvaluation.java>:[696,24]
[unchecked] unchecked call to <ANNOTATION_TYPE,SPAN_TYPE>add(java.util.Collection<?
extends ANNOTATION_TYPE>,java.util.Collection<? extends ANNOTATION_TYPE>,com.google.common.base.Function<ANNOTATION_TYPE,SPAN_TYPE>,com.google.common.base.Function<ANNOTATION_TYPE,OUTCOME_TYPE>)
as a member of the raw type org.cleartk.eval.AnnotationStatistics
[ERROR] <https://builds.apache.org/job/ctakes-trunk-package/ws/ctakes-assertion/src/main/java/org/apache/ctakes/assertion/eval/AssertionEvaluation.java>:[706,27]
[unchecked] unchecked call to <ANNOTATION_TYPE,SPAN_TYPE>add(java.util.Collection<?
extends ANNOTATION_TYPE>,java.util.Collection<? extends ANNOTATION_TYPE>,com.google.common.base.Function<ANNOTATION_TYPE,SPAN_TYPE>,com.google.common.base.Function<ANNOTATION_TYPE,OUTCOME_TYPE>)
as a member of the raw type org.cleartk.eval.AnnotationStatistics
[ERROR] <https://builds.apache.org/job/ctakes-trunk-package/ws/ctakes-assertion/src/main/java/org/apache/ctakes/assertion/eval/AssertionEvaluation.java>:[716,27]
[unchecked] unchecked call to <ANNOTATION_TYPE,SPAN_TYPE>add(java.util.Collection<?
extends ANNOTATION_TYPE>,java.util.Collection<? extends ANNOTATION_TYPE>,com.google.common.base.Function<ANNOTATION_TYPE,SPAN_TYPE>,com.google.common.base.Function<ANNOTATION_TYPE,OUTCOME_TYPE>)
as a member of the raw type org.cleartk.eval.AnnotationStatistics
[ERROR] <https://builds.apache.org/job/ctakes-trunk-package/ws/ctakes-assertion/src/main/java/org/apache/ctakes/assertion/eval/AssertionEvaluation.java>:[726,23]
[unchecked] unchecked call to <ANNOTATION_TYPE,SPAN_TYPE>add(java.util.Collection<?
extends ANNOTATION_TYPE>,java.util.Collection<? extends ANNOTATION_TYPE>,com.google.common.base.Function<ANNOTATION_TYPE,SPAN_TYPE>,com.google.common.base.Function<ANNOTATION_TYPE,OUTCOME_TYPE>)
as a member of the raw type org.cleartk.eval.AnnotationStatistics
[ERROR] <https://builds.apache.org/job/ctakes-trunk-package/ws/ctakes-assertion/src/main/java/org/apache/ctakes/assertion/eval/AssertionEvaluation.java>:[736,23]
[unchecked] unchecked call to <ANNOTATION_TYPE,SPAN_TYPE>add(java.util.Collection<?
extends ANNOTATION_TYPE>,java.util.Collection<? extends ANNOTATION_TYPE>,com.google.common.base.Function<ANNOTATION_TYPE,SPAN_TYPE>,com.google.common.base.Function<ANNOTATION_TYPE,OUTCOME_TYPE>)
as a member of the raw type org.cleartk.eval.AnnotationStatistics
[ERROR] <https://builds.apache.org/job/ctakes-trunk-package/ws/ctakes-assertion/src/main/java/org/apache/ctakes/assertion/eval/AssertionEvaluation.java>:[747,23]
[unchecked] unchecked call to <ANNOTATION_TYPE,SPAN_TYPE>add(java.util.Collection<?
extends ANNOTATION_TYPE>,java.util.Collection<? extends ANNOTATION_TYPE>,com.google.common.base.Function<ANNOTATION_TYPE,SPAN_TYPE>,com.google.common.base.Function<ANNOTATION_TYPE,OUTCOME_TYPE>)
as a member of the raw type org.cleartk.eval.AnnotationStatistics
[ERROR] <https://builds.apache.org/job/ctakes-trunk-package/ws/ctakes-assertion/src/main/java/org/apache/ctakes/assertion/medfacts/cleartk/CreateAssertionDescriptor.java>:[33,90]
[deprecation] org.cleartk.classifier.opennlp.DefaultMaxentDataWriterFactory in org.cleartk.classifier.opennlp
has been deprecated
[ERROR] <https://builds.apache.org/job/ctakes-trunk-package/ws/ctakes-assertion/src/main/java/org/apache/ctakes/assertion/medfacts/CasIndexer.java>:[74,21]
[unchecked] unchecked cast
found   : org.apache.uima.jcas.tcas.Annotation
required: T
[ERROR] <https://builds.apache.org/job/ctakes-trunk-package/ws/ctakes-assertion/src/main/java/org/apache/ctakes/assertion/medfacts/cleartk/HistoryCleartkAnalysisEngine.java>:[59,49]
[deprecation] org.cleartk.classifier.feature.extractor.ContextExtractor in org.cleartk.classifier.feature.extractor
has been deprecated
[ERROR] <https://builds.apache.org/job/ctakes-trunk-package/ws/ctakes-assertion/src/main/java/org/apache/ctakes/assertion/medfacts/cleartk/HistoryCleartkAnalysisEngine.java>:[62,8]
[deprecation] org.cleartk.classifier.feature.extractor.ContextExtractor in org.cleartk.classifier.feature.extractor
has been deprecated
[ERROR] <https://builds.apache.org/job/ctakes-trunk-package/ws/ctakes-assertion/src/main/java/org/apache/ctakes/assertion/pipelines/RunJudgeAttributeInstances.java>:[93,35]
[unchecked] unchecked conversion
found   : java.util.List
required: java.util.List<java.io.File>
[ERROR] <https://builds.apache.org/job/ctakes-trunk-package/ws/ctakes-assertion/src/main/java/org/apache/ctakes/assertion/cr/XmiCollectionReaderCtakes.java>:[81,18]
[unchecked] unchecked call to add(E) as a member of the raw type java.util.ArrayList
[ERROR] <https://builds.apache.org/job/ctakes-trunk-package/ws/ctakes-assertion/src/main/java/org/apache/ctakes/assertion/medfacts/cleartk/GenericCleartkAnalysisEngine.java>:[58,49]
[deprecation] org.cleartk.classifier.feature.extractor.ContextExtractor in org.cleartk.classifier.feature.extractor
has been deprecated
[ERROR] <https://builds.apache.org/job/ctakes-trunk-package/ws/ctakes-assertion/src/main/java/org/apache/ctakes/assertion/medfacts/cleartk/GenericCleartkAnalysisEngine.java>:[61,8]
[deprecation] org.cleartk.classifier.feature.extractor.ContextExtractor in org.cleartk.classifier.feature.extractor
has been deprecated
[ERROR] <https://builds.apache.org/job/ctakes-trunk-package/ws/ctakes-assertion/src/main/java/org/apache/ctakes/assertion/medfacts/cleartk/TrainAssertionModel.java>:[292,72]
[deprecation] org.cleartk.classifier.opennlp.DefaultMaxentDataWriterFactory in org.cleartk.classifier.opennlp
has been deprecated
[INFO] 131 errors 
[INFO] -------------------------------------------------------------
[INFO] ------------------------------------------------------------------------
[INFO] Reactor Summary:
[INFO] 
[INFO] Apache cTAKES ..................................... SUCCESS [26.475s]
[INFO] Apache cTAKES common type system .................. SUCCESS [11.234s]
[INFO] Apache cTAKES utils ............................... SUCCESS [3.668s]
[INFO] Apache cTAKES Resources core ...................... SUCCESS [5.605s]
[INFO] Apache cTAKES core ................................ SUCCESS [5.449s]
[INFO] Apache cTAKES Resources pos-tagger ................ SUCCESS [2.425s]
[INFO] Apache cTAKES part-of-speech tagger ............... SUCCESS [3.304s]
[INFO] Apache cTAKES Resources ctakes-chunker-res ........ SUCCESS [2.401s]
[INFO] Apache cTAKES chunker ............................. SUCCESS [3.106s]
[INFO] Apache cTAKES document preprocessor ............... SUCCESS [2.169s]
[INFO] Apache cTAKES Resources dictionary-lookup ......... SUCCESS [1.851s]
[INFO] Apache cTAKES dictionary lookup ................... SUCCESS [24.332s]
[INFO] Apache cTAKES context dependent tokenizer ......... SUCCESS [1.745s]
[INFO] Apache cTAKES Resources lvg ....................... SUCCESS [2.765s]
[INFO] Apache cTAKES LVG lexical tools ................... SUCCESS [2.780s]
[INFO] Apache cTAKES Resources ne-contexts ............... SUCCESS [2.304s]
[INFO] Apache cTAKES named entity contexts ............... SUCCESS [2.958s]
[INFO] Apache cTAKES Resources constituency-parser ....... SUCCESS [2.299s]
[INFO] Apache cTAKES Constituency Parser ................. SUCCESS [1.636s]
[INFO] Apache cTAKES Resources coreference ............... SUCCESS [2.881s]
[INFO] Apache cTAKES Resources relation-extractor ........ SUCCESS [1.394s]
[INFO] Apache cTAKES Resources dependency-parser ......... SUCCESS [6.077s]
[INFO] Apache cTAKES Dependency Parser ................... SUCCESS [7.569s]
[INFO] Apache cTAKES Relation Extractor .................. SUCCESS [5.270s]
[INFO] Apache cTAKES CoReference Resolver ................ SUCCESS [3.761s]
[INFO] Apache cTAKES Resources drug-ner .................. SUCCESS [1.875s]
[INFO] Apache cTAKES Drug NER ............................ SUCCESS [6.949s]
[INFO] Apache cTAKES Resources side-effect ............... SUCCESS [3.125s]
[INFO] Apache cTAKES Side Effects ........................ SUCCESS [4.980s]
[INFO] Apache cTAKES Resources smoking-status ............ SUCCESS [3.476s]
[INFO] Apache cTAKES Smoking Status ...................... SUCCESS [7.661s]
[INFO] Apache cTAKES Resources pad-term-spotter-res ...... SUCCESS [5.055s]
[INFO] Apache cTAKES Pad Term Spotter .................... SUCCESS [3.965s]
[INFO] Apache cTAKES Resources assertion ................. SUCCESS [2.741s]
[INFO] Apache cTAKES Resources assertion-zoner ........... SUCCESS [1.869s]
[INFO] Apache cTAKES Assertion's zoner ................... SUCCESS [2.160s]
[INFO] Apache cTAKES Assertion ........................... FAILURE [8.234s]
[INFO] Apache cTAKES Resources temporal .................. SKIPPED
[INFO] Apache cTAKES Temporal Information Extraction ..... SKIPPED
[INFO] Apache cTAKES ctakes-clinical-pipeline ............ SKIPPED
[INFO] Apache cTAKES Distribution ........................ SKIPPED
[INFO] Apache cTAKES Regression-test ..................... SKIPPED
[INFO] ------------------------------------------------------------------------
[INFO] BUILD FAILURE
[INFO] ------------------------------------------------------------------------
[INFO] Total time: 3:15.132s
[INFO] Finished at: Fri Apr 19 08:28:46 UTC 2013
[INFO] Final Memory: 42M/144M
[INFO] ------------------------------------------------------------------------
[JENKINS] Archiving disabled
[JENKINS] Archiving disabled
[JENKINS] Archiving disabled
[JENKINS] Archiving disabled
[JENKINS] Archiving disabled
[JENKINS] Archiving disabled
[JENKINS] Archiving disabled
[JENKINS] Archiving disabled
[JENKINS] Archiving disabled
[JENKINS] Archiving disabled
[JENKINS] Archiving disabled
[JENKINS] Archiving disabled
[JENKINS] Archiving disabled
[JENKINS] Archiving disabled
[JENKINS] Archiving disabled
[JENKINS] Archiving disabled
[JENKINS] Archiving disabled
[JENKINS] Archiving disabled
[JENKINS] Archiving disabled
[JENKINS] Archiving disabled
[JENKINS] Archiving disabled
[JENKINS] Archiving disabled
[JENKINS] Archiving disabled
[JENKINS] Archiving disabled
[JENKINS] Archiving disabled
[JENKINS] Archiving disabled
[JENKINS] Archiving disabled
[JENKINS] Archiving disabled
[JENKINS] Archiving disabled
[JENKINS] Archiving disabled
[JENKINS] Archiving disabled
[JENKINS] Archiving disabled
[JENKINS] Archiving disabled
[JENKINS] Archiving disabled
[JENKINS] Archiving disabled
[JENKINS] Archiving disabled
[JENKINS] Archiving disabled
[JENKINS] Archiving disabled
[JENKINS] Archiving disabled
[JENKINS] Archiving disabled
[JENKINS] Archiving disabled
[JENKINS] Archiving disabled
Waiting for Jenkins to finish collecting data
mavenExecutionResult exceptions not empty
message : Failed to execute goal org.apache.maven.plugins:maven-compiler-plugin:2.4:compile
(default-compile) on project ctakes-assertion: Compilation failure
cause : Compilation failure
Stack trace : 
org.apache.maven.lifecycle.LifecycleExecutionException: Failed to execute goal org.apache.maven.plugins:maven-compiler-plugin:2.4:compile
(default-compile) on project ctakes-assertion: Compilation failure
	at org.apache.maven.lifecycle.internal.MojoExecutor.execute(MojoExecutor.java:213)
	at org.apache.maven.lifecycle.internal.MojoExecutor.execute(MojoExecutor.java:153)
	at org.apache.maven.lifecycle.internal.MojoExecutor.execute(MojoExecutor.java:145)
	at org.apache.maven.lifecycle.internal.LifecycleModuleBuilder.buildProject(LifecycleModuleBuilder.java:84)
	at org.apache.maven.lifecycle.internal.LifecycleModuleBuilder.buildProject(LifecycleModuleBuilder.java:59)
	at org.apache.maven.lifecycle.internal.LifecycleStarter.singleThreadedBuild(LifecycleStarter.java:183)
	at org.apache.maven.lifecycle.internal.LifecycleStarter.execute(LifecycleStarter.java:161)
	at org.apache.maven.DefaultMaven.doExecute(DefaultMaven.java:320)
	at org.apache.maven.DefaultMaven.execute(DefaultMaven.java:156)
	at org.jvnet.hudson.maven3.launcher.Maven3Launcher.main(Maven3Launcher.java:79)
	at sun.reflect.NativeMethodAccessorImpl.invoke0(Native Method)
	at sun.reflect.NativeMethodAccessorImpl.invoke(NativeMethodAccessorImpl.java:39)
	at sun.reflect.DelegatingMethodAccessorImpl.invoke(DelegatingMethodAccessorImpl.java:25)
	at java.lang.reflect.Method.invoke(Method.java:597)
	at org.codehaus.plexus.classworlds.launcher.Launcher.launchStandard(Launcher.java:329)
	at org.codehaus.plexus.classworlds.launcher.Launcher.launch(Launcher.java:239)
	at org.jvnet.hudson.maven3.agent.Maven3Main.launch(Maven3Main.java:158)
	at hudson.maven.Maven3Builder.call(Maven3Builder.java:100)
	at hudson.maven.Maven3Builder.call(Maven3Builder.java:66)
	at hudson.remoting.UserRequest.perform(UserRequest.java:118)
	at hudson.remoting.UserRequest.perform(UserRequest.java:48)
	at hudson.remoting.Request$2.run(Request.java:326)
	at hudson.remoting.InterceptingExecutorService$1.call(InterceptingExecutorService.java:72)
	at java.util.concurrent.FutureTask$Sync.innerRun(FutureTask.java:303)
	at java.util.concurrent.FutureTask.run(FutureTask.java:138)
	at java.util.concurrent.ThreadPoolExecutor$Worker.runTask(ThreadPoolExecutor.java:886)
	at java.util.concurrent.ThreadPoolExecutor$Worker.run(ThreadPoolExecutor.java:908)
	at java.lang.Thread.run(Thread.java:662)
Caused by: org.apache.maven.plugin.CompilationFailureException: Compilation failure
	at org.apache.maven.plugin.AbstractCompilerMojo.execute(AbstractCompilerMojo.java:678)
	at org.apache.maven.plugin.CompilerMojo.execute(CompilerMojo.java:128)
	at org.apache.maven.plugin.DefaultBuildPluginManager.executeMojo(DefaultBuildPluginManager.java:101)
	at org.apache.maven.lifecycle.internal.MojoExecutor.execute(MojoExecutor.java:209)
	... 27 more
Sending e-mails to: ctakes-notifications@incubator.apache.org timothy.miller@childrens.harvard.edu
wu.stephen@mayo.edu
channel stopped

Mime
View raw message