ctakes-notifications mailing list archives

Site index · List index
Message view « Date » · « Thread »
Top « Date » · « Thread »
From Apache Jenkins Server <jenk...@builds.apache.org>
Subject Build failed in Jenkins: ctakes-trunk-compiletest #178
Date Thu, 14 Feb 2013 20:40:52 GMT
See <https://builds.apache.org/job/ctakes-trunk-compiletest/178/changes>

Changes:

[swu] type system changes adding historyOf

------------------------------------------
[...truncated 741 lines...]

[INFO] 
[INFO] --- maven-resources-plugin:2.5:resources (default-resources) @ ctakes-utils ---
mojoSucceeded org.apache.maven.plugins:maven-resources-plugin:2.5(default-resources)
mojoStarted org.apache.maven.plugins:maven-compiler-plugin:2.4(default-compile)[INFO] Nothing
to compile - all classes are up to date

[INFO] 
[INFO] --- maven-compiler-plugin:2.4:compile (default-compile) @ ctakes-utils ---
mojoSucceeded org.apache.maven.plugins:maven-compiler-plugin:2.4(default-compile)
mojoStarted org.apache.maven.plugins:maven-resources-plugin:2.5(default-testResources)[debug]
execute contextualize
[INFO] Using 'UTF-8' encoding to copy filtered resources.
[INFO] skip non existing resourceDirectory <https://builds.apache.org/job/ctakes-trunk-compiletest/ws/ctakes-utils/src/test/resources>
[INFO] Copying 3 resources
[INFO] Copying 3 resources

[INFO] 
[INFO] --- maven-resources-plugin:2.5:testResources (default-testResources) @ ctakes-utils
---
mojoSucceeded org.apache.maven.plugins:maven-resources-plugin:2.5(default-testResources)
mojoStarted org.apache.maven.plugins:maven-compiler-plugin:2.4(default-testCompile)[INFO]
No sources to compile

[INFO] 
[INFO] --- maven-compiler-plugin:2.4:testCompile (default-testCompile) @ ctakes-utils ---
mojoSucceeded org.apache.maven.plugins:maven-compiler-plugin:2.4(default-testCompile)
mojoStarted org.apache.maven.plugins:maven-surefire-plugin:2.12(default-test)[INFO] Surefire
report directory: <https://builds.apache.org/job/ctakes-trunk-compiletest/ws/ctakes-utils/target/surefire-reports>

-------------------------------------------------------
 T E S T S
-------------------------------------------------------

[INFO] 
[INFO] --- maven-surefire-plugin:2.12:test (default-test) @ ctakes-utils ---

Results :

Tests run: 0, Failures: 0, Errors: 0, Skipped: 0

mojoSucceeded org.apache.maven.plugins:maven-surefire-plugin:2.12(default-test)
[JENKINS] Recording test results
projectSucceeded org.apache.ctakes:ctakes-utils:3.1.0-incubating-SNAPSHOT
projectStarted org.apache.ctakes:ctakes-core:3.1.0-incubating-SNAPSHOT
[INFO]                                                                         
[INFO] ------------------------------------------------------------------------
[INFO] Building Apache cTAKES core 3.1.0-incubating-SNAPSHOT
[INFO] ------------------------------------------------------------------------
Downloading: http://repo.maven.apache.org/maven2/edu/mit/findstruct/findstructapi/0.0.1/findstructapi-0.0.1.pom
Downloaded: http://repo.maven.apache.org/maven2/edu/mit/findstruct/findstructapi/0.0.1/findstructapi-0.0.1.pom
(990 B at 2.1 KB/sec)
Downloading: http://repo.maven.apache.org/maven2/com/googlecode/armbrust-file-utils/sqlwrapper/0.0.1/sqlwrapper-0.0.1.pom
Downloaded: http://repo.maven.apache.org/maven2/com/googlecode/armbrust-file-utils/sqlwrapper/0.0.1/sqlwrapper-0.0.1.pom
(855 B at 1.7 KB/sec)
Downloading: http://repo.maven.apache.org/maven2/net/sourceforge/openai/openaifsm/0.0.1/openaifsm-0.0.1.pom
Downloaded: http://repo.maven.apache.org/maven2/net/sourceforge/openai/openaifsm/0.0.1/openaifsm-0.0.1.pom
(892 B at 2.0 KB/sec)
Downloading: http://repo.maven.apache.org/maven2/edu/mit/findstruct/findstructapi/0.0.1/findstructapi-0.0.1.jar
Downloading: http://repo.maven.apache.org/maven2/com/googlecode/armbrust-file-utils/sqlwrapper/0.0.1/sqlwrapper-0.0.1.jar
Downloading: http://repo.maven.apache.org/maven2/net/sourceforge/openai/openaifsm/0.0.1/openaifsm-0.0.1.jar
Downloaded: http://repo.maven.apache.org/maven2/edu/mit/findstruct/findstructapi/0.0.1/findstructapi-0.0.1.jar
(14 KB at 40.2 KB/sec)
Downloaded: http://repo.maven.apache.org/maven2/com/googlecode/armbrust-file-utils/sqlwrapper/0.0.1/sqlwrapper-0.0.1.jar
(17 KB at 46.6 KB/sec)
Downloaded: http://repo.maven.apache.org/maven2/net/sourceforge/openai/openaifsm/0.0.1/openaifsm-0.0.1.jar
(13 KB at 32.8 KB/sec)
mojoStarted org.apache.maven.plugins:maven-clean-plugin:2.4.1(default-clean)[INFO] Deleting
<https://builds.apache.org/job/ctakes-trunk-compiletest/ws/ctakes-core/target>

[INFO] 
[INFO] --- maven-clean-plugin:2.4.1:clean (default-clean) @ ctakes-core ---
mojoSucceeded org.apache.maven.plugins:maven-clean-plugin:2.4.1(default-clean)
mojoStarted org.apache.maven.plugins:maven-remote-resources-plugin:1.3(default)[INFO] artifact
junit:junit: checking for updates from central

[INFO] 
[INFO] --- maven-remote-resources-plugin:1.3:process (default) @ ctakes-core ---
Downloading: http://repo.maven.apache.org/maven2/jwnl/jwnl/1.3.3/jwnl-1.3.3.pom
mojoSucceeded org.apache.maven.plugins:maven-remote-resources-plugin:1.3(default)
mojoStarted org.apache.maven.plugins:maven-resources-plugin:2.5(default-resources)[debug]
execute contextualize
[INFO] Using 'UTF-8' encoding to copy filtered resources.

[INFO] 
[INFO] --- maven-resources-plugin:2.5:resources (default-resources) @ ctakes-core ---
[INFO] Copying 15 resources
[INFO] Copying 3 resources
mojoSucceeded org.apache.maven.plugins:maven-resources-plugin:2.5(default-resources)
mojoStarted org.apache.maven.plugins:maven-compiler-plugin:2.4(default-compile)
[INFO] 
[INFO] --- maven-compiler-plugin:2.4:compile (default-compile) @ ctakes-core ---
[INFO] Compiling 140 source files to <https://builds.apache.org/job/ctakes-trunk-compiletest/ws/ctakes-core/target/classes>
[INFO] -------------------------------------------------------------
[ERROR] COMPILATION ERROR : 
[INFO] -------------------------------------------------------------
[ERROR] <https://builds.apache.org/job/ctakes-trunk-compiletest/ws/ctakes-core/src/main/java/org/apache/ctakes/core/sentence/SentenceDetectorCtakes.java>:[42,25]
[deprecation] opennlp.tools.util.HashSumEventStream in opennlp.tools.util has been deprecated
[ERROR] <https://builds.apache.org/job/ctakes-trunk-compiletest/ws/ctakes-core/src/main/java/org/apache/ctakes/core/ae/SHARPKnowtatorXMLReader.java>:[38,47]
cannot find symbol
symbol  : class AnatomicalSiteMention
location: package org.apache.ctakes.typesystem.type.refsem
[ERROR] <https://builds.apache.org/job/ctakes-trunk-compiletest/ws/ctakes-core/src/main/java/org/apache/ctakes/core/ae/SHARPKnowtatorXMLReader.java>:[43,47]
cannot find symbol
symbol  : class DiseaseDisorderMention
location: package org.apache.ctakes.typesystem.type.refsem
[ERROR] <https://builds.apache.org/job/ctakes-trunk-compiletest/ws/ctakes-core/src/main/java/org/apache/ctakes/core/ae/SHARPKnowtatorXMLReader.java>:[56,47]
cannot find symbol
symbol  : class ProcedureMention
location: package org.apache.ctakes.typesystem.type.refsem
[ERROR] <https://builds.apache.org/job/ctakes-trunk-compiletest/ws/ctakes-core/src/main/java/org/apache/ctakes/core/ae/SHARPKnowtatorXMLReader.java>:[59,47]
cannot find symbol
symbol  : class SignSymptomMention
location: package org.apache.ctakes.typesystem.type.refsem
[ERROR] <https://builds.apache.org/job/ctakes-trunk-compiletest/ws/ctakes-core/src/main/java/org/apache/ctakes/core/ae/SHARPKnowtatorXMLReader.java>:[1299,77]
cannot find symbol
symbol  : class DiseaseDisorderMention
mojoFailed org.apache.maven.plugins:maven-compiler-plugin:2.4(default-compile)location: class
org.apache.ctakes.core.ae.SHARPKnowtatorXMLReader
[ERROR] <https://builds.apache.org/job/ctakes-trunk-compiletest/ws/ctakes-core/src/main/java/org/apache/ctakes/core/ae/SHARPKnowtatorXMLReader.java>:[1300,42]
cannot find symbol
symbol  : class DiseaseDisorderMention
location: class org.apache.ctakes.core.ae.SHARPKnowtatorXMLReader.AssociatedSignOrSymptomFeature
[ERROR] <https://builds.apache.org/job/ctakes-trunk-compiletest/ws/ctakes-core/src/main/java/org/apache/ctakes/core/cr/FilesInDirectoryCollectionReader.java>:[224,7]
[deprecation] getCasInitializer() in org.apache.uima.collection.CollectionReader_ImplBase
has been deprecated
[ERROR] <https://builds.apache.org/job/ctakes-trunk-compiletest/ws/ctakes-core/src/main/java/org/apache/ctakes/core/cr/FilesInDirectoryCollectionReader.java>:[226,4]
[deprecation] getCasInitializer() in org.apache.uima.collection.CollectionReader_ImplBase
has been deprecated
[ERROR] <https://builds.apache.org/job/ctakes-trunk-compiletest/ws/ctakes-core/src/main/java/org/apache/ctakes/core/ae/TokenizerAnnotatorPTB.java>:[165,74]
[unchecked] unchecked cast
found   : java.util.List<capture#614 of ?>
required: java.util.List<org.apache.ctakes.typesystem.type.syntax.BaseToken>
[ERROR] <https://builds.apache.org/job/ctakes-trunk-compiletest/ws/ctakes-core/src/main/java/org/apache/ctakes/core/ae/SHARPKnowtatorXMLReader.java>:[284,8]
cannot find symbol
symbol  : class AnatomicalSiteMention
location: class org.apache.ctakes.core.ae.SHARPKnowtatorXMLReader
[ERROR] <https://builds.apache.org/job/ctakes-trunk-compiletest/ws/ctakes-core/src/main/java/org/apache/ctakes/core/ae/SHARPKnowtatorXMLReader.java>:[284,50]
cannot find symbol
symbol  : class AnatomicalSiteMention
location: class org.apache.ctakes.core.ae.SHARPKnowtatorXMLReader
[ERROR] <https://builds.apache.org/job/ctakes-trunk-compiletest/ws/ctakes-core/src/main/java/org/apache/ctakes/core/ae/SHARPKnowtatorXMLReader.java>:[329,8]
cannot find symbol
symbol  : class DiseaseDisorderMention
location: class org.apache.ctakes.core.ae.SHARPKnowtatorXMLReader
[ERROR] <https://builds.apache.org/job/ctakes-trunk-compiletest/ws/ctakes-core/src/main/java/org/apache/ctakes/core/ae/SHARPKnowtatorXMLReader.java>:[329,60]
cannot find symbol
symbol  : class DiseaseDisorderMention
location: class org.apache.ctakes.core.ae.SHARPKnowtatorXMLReader
[ERROR] <https://builds.apache.org/job/ctakes-trunk-compiletest/ws/ctakes-core/src/main/java/org/apache/ctakes/core/ae/SHARPKnowtatorXMLReader.java>:[421,8]
cannot find symbol
symbol  : class ProcedureMention
location: class org.apache.ctakes.core.ae.SHARPKnowtatorXMLReader
[ERROR] <https://builds.apache.org/job/ctakes-trunk-compiletest/ws/ctakes-core/src/main/java/org/apache/ctakes/core/ae/SHARPKnowtatorXMLReader.java>:[421,48]
cannot find symbol
symbol  : class ProcedureMention
location: class org.apache.ctakes.core.ae.SHARPKnowtatorXMLReader
[ERROR] <https://builds.apache.org/job/ctakes-trunk-compiletest/ws/ctakes-core/src/main/java/org/apache/ctakes/core/ae/SHARPKnowtatorXMLReader.java>:[444,8]
cannot find symbol
symbol  : class SignSymptomMention
location: class org.apache.ctakes.core.ae.SHARPKnowtatorXMLReader
[ERROR] <https://builds.apache.org/job/ctakes-trunk-compiletest/ws/ctakes-core/src/main/java/org/apache/ctakes/core/ae/SHARPKnowtatorXMLReader.java>:[444,52]
cannot find symbol
symbol  : class SignSymptomMention
location: class org.apache.ctakes.core.ae.SHARPKnowtatorXMLReader
[ERROR] <https://builds.apache.org/job/ctakes-trunk-compiletest/ws/ctakes-core/src/main/java/org/apache/ctakes/core/resource/LuceneIndexReaderResourceImpl.java>:[70,44]
[deprecation] open(org.apache.lucene.store.Directory) in org.apache.lucene.index.IndexReader
has been deprecated
[ERROR] <https://builds.apache.org/job/ctakes-trunk-compiletest/ws/ctakes-core/src/main/java/org/apache/ctakes/core/resource/LuceneIndexReaderResourceImpl.java>:[75,44]
[deprecation] open(org.apache.lucene.store.Directory) in org.apache.lucene.index.IndexReader
has been deprecated
[ERROR] <https://builds.apache.org/job/ctakes-trunk-compiletest/ws/ctakes-core/src/main/java/org/apache/ctakes/core/resource/StringIntegerMapResourceImpl.java>:[101,15]
getMap() in org.apache.ctakes.core.resource.StringIntegerMapResourceImpl implements getMap()
in org.apache.ctakes.core.resource.StringIntegerMapResource; return type requires unchecked
conversion
found   : java.util.Map
required: java.util.Map<java.lang.String,java.lang.Integer>
[ERROR] <https://builds.apache.org/job/ctakes-trunk-compiletest/ws/ctakes-core/src/main/java/org/apache/ctakes/core/cr/JdbcCollectionReader.java>:[179,25]
[unchecked] unchecked conversion
found   : java.util.List[]
required: java.util.List<java.lang.String>[]
[ERROR] <https://builds.apache.org/job/ctakes-trunk-compiletest/ws/ctakes-core/src/main/java/org/apache/ctakes/core/cr/JdbcCollectionReader.java>:[276,20]
[deprecation] getCasInitializer() in org.apache.uima.collection.CollectionReader_ImplBase
has been deprecated
[ERROR] <https://builds.apache.org/job/ctakes-trunk-compiletest/ws/ctakes-core/src/main/java/org/apache/ctakes/core/cr/JdbcCollectionReader.java>:[279,20]
[deprecation] getCasInitializer() in org.apache.uima.collection.CollectionReader_ImplBase
has been deprecated
[ERROR] <https://builds.apache.org/job/ctakes-trunk-compiletest/ws/ctakes-core/src/main/java/org/apache/ctakes/core/cr/XmiCollectionReaderCtakes.java>:[81,18]
[unchecked] unchecked call to add(E) as a member of the raw type java.util.ArrayList
[ERROR] <https://builds.apache.org/job/ctakes-trunk-compiletest/ws/ctakes-core/src/main/java/org/apache/ctakes/core/cr/LinesFromFileCollectionReader.java>:[175,7]
[deprecation] getCasInitializer() in org.apache.uima.collection.CollectionReader_ImplBase
has been deprecated
[ERROR] <https://builds.apache.org/job/ctakes-trunk-compiletest/ws/ctakes-core/src/main/java/org/apache/ctakes/core/cr/LinesFromFileCollectionReader.java>:[178,4]
[deprecation] getCasInitializer() in org.apache.uima.collection.CollectionReader_ImplBase
has been deprecated
[INFO] 27 errors 
[INFO] -------------------------------------------------------------

projectFailed org.apache.ctakes:ctakes-core:3.1.0-incubating-SNAPSHOT
sessionEnded
[INFO] ------------------------------------------------------------------------
[INFO] Reactor Summary:
[INFO] 
[INFO] Apache cTAKES ..................................... SUCCESS [22.794s]
[INFO] Apache cTAKES common type system .................. SUCCESS [12.723s]
[INFO] Apache cTAKES utils ............................... SUCCESS [4.535s]
[INFO] Apache cTAKES core ................................ FAILURE [6.762s]
[INFO] Apache cTAKES part-of-speech tagger ............... SKIPPED
[INFO] Apache cTAKES chunker ............................. SKIPPED
[INFO] Apache cTAKES document preprocessor ............... SKIPPED
[INFO] Apache cTAKES dictionary lookup ................... SKIPPED
[INFO] Apache cTAKES context dependent tokenizer ......... SKIPPED
[INFO] Apache cTAKES LVG lexical tools ................... SKIPPED
[INFO] Apache cTAKES named entity contexts ............... SKIPPED
[INFO] Apache cTAKES Constituency Parser ................. SKIPPED
[INFO] Apache cTAKES Dependency Parser ................... SKIPPED
[INFO] Apache cTAKES Assertion's zoner ................... SKIPPED
[INFO] Apache cTAKES Assertion ........................... SKIPPED
[INFO] Apache cTAKES ctakes-clinical-pipeline ............ SKIPPED
[INFO] Apache cTAKES Relation Extractor .................. SKIPPED
[INFO] Apache cTAKES CoReference Resolver ................ SKIPPED
[INFO] Apache cTAKES Drug NER ............................ SKIPPED
[INFO] Apache cTAKES Side Effects ........................ SKIPPED
[INFO] Apache cTAKES Smoking Status ...................... SKIPPED
[INFO] Apache cTAKES Pad Term Spotter .................... SKIPPED
[INFO] Apache cTAKES Temporal Information Extraction ..... SKIPPED
[INFO] Apache cTAKES Distribution ........................ SKIPPED
[INFO] ------------------------------------------------------------------------
[INFO] BUILD FAILURE
[INFO] ------------------------------------------------------------------------
[INFO] Total time: 49.797s
[INFO] Finished at: Thu Feb 14 20:39:53 UTC 2013
[INFO] Final Memory: 21M/79M
[INFO] ------------------------------------------------------------------------
Projects to build: [MavenProject: org.apache.ctakes:ctakes:3.1.0-incubating-SNAPSHOT @ <https://builds.apache.org/job/ctakes-trunk-compiletest/ws/pom.xml,>
MavenProject: org.apache.ctakes:ctakes-type-system:3.1.0-incubating-SNAPSHOT @ <https://builds.apache.org/job/ctakes-trunk-compiletest/ws/ctakes-type-system/pom.xml,>
MavenProject: org.apache.ctakes:ctakes-utils:3.1.0-incubating-SNAPSHOT @ <https://builds.apache.org/job/ctakes-trunk-compiletest/ws/ctakes-utils/pom.xml,>
MavenProject: org.apache.ctakes:ctakes-core:3.1.0-incubating-SNAPSHOT @ <https://builds.apache.org/job/ctakes-trunk-compiletest/ws/ctakes-core/pom.xml,>
MavenProject: org.apache.ctakes:ctakes-pos-tagger:3.1.0-incubating-SNAPSHOT @ <https://builds.apache.org/job/ctakes-trunk-compiletest/ws/ctakes-pos-tagger/pom.xml,>
MavenProject: org.apache.ctakes:ctakes-chunker:3.1.0-incubating-SNAPSHOT @ <https://builds.apache.org/job/ctakes-trunk-compiletest/ws/ctakes-chunker/pom.xml,>
MavenProject: org.apache.ctakes:ctakes-preprocessor:3.1.0-incubating-SNAPSHOT @ <https://builds.apache.org/job/ctakes-trunk-compiletest/ws/ctakes-preprocessor/pom.xml,>
MavenProject: org.apache.ctakes:ctakes-dictionary-lookup:3.1.0-incubating-SNAPSHOT @ <https://builds.apache.org/job/ctakes-trunk-compiletest/ws/ctakes-dictionary-lookup/pom.xml,>
MavenProject: org.apache.ctakes:ctakes-context-tokenizer:3.1.0-incubating-SNAPSHOT @ <https://builds.apache.org/job/ctakes-trunk-compiletest/ws/ctakes-context-tokenizer/pom.xml,>
MavenProject: org.apache.ctakes:ctakes-lvg:3.1.0-incubating-SNAPSHOT @ <https://builds.apache.org/job/ctakes-trunk-compiletest/ws/ctakes-lvg/pom.xml,>
MavenProject: org.apache.ctakes:ctakes-ne-contexts:3.1.0-incubating-SNAPSHOT @ <https://builds.apache.org/job/ctakes-trunk-compiletest/ws/ctakes-ne-contexts/pom.xml,>
MavenProject: org.apache.ctakes:ctakes-constituency-parser:3.1.0-incubating-SNAPSHOT @ <https://builds.apache.org/job/ctakes-trunk-compiletest/ws/ctakes-constituency-parser/pom.xml,>
MavenProject: org.apache.ctakes:ctakes-dependency-parser:3.1.0-incubating-SNAPSHOT @ <https://builds.apache.org/job/ctakes-trunk-compiletest/ws/ctakes-dependency-parser/pom.xml,>
MavenProject: org.apache.ctakes:ctakes-assertion-zoner:3.1.0-incubating-SNAPSHOT @ <https://builds.apache.org/job/ctakes-trunk-compiletest/ws/ctakes-assertion-zoner/pom.xml,>
MavenProject: org.apache.ctakes:ctakes-assertion:3.1.0-incubating-SNAPSHOT @ <https://builds.apache.org/job/ctakes-trunk-compiletest/ws/ctakes-assertion/pom.xml,>
MavenProject: org.apache.ctakes:ctakes-clinical-pipeline:3.1.0-incubating-SNAPSHOT @ <https://builds.apache.org/job/ctakes-trunk-compiletest/ws/ctakes-clinical-pipeline/pom.xml,>
MavenProject: org.apache.ctakes:ctakes-relation-extractor:3.1.0-incubating-SNAPSHOT @ <https://builds.apache.org/job/ctakes-trunk-compiletest/ws/ctakes-relation-extractor/pom.xml,>
MavenProject: org.apache.ctakes:ctakes-coreference:3.1.0-incubating-SNAPSHOT @ <https://builds.apache.org/job/ctakes-trunk-compiletest/ws/ctakes-coreference/pom.xml,>
MavenProject: org.apache.ctakes:ctakes-drug-ner:3.1.0-incubating-SNAPSHOT @ <https://builds.apache.org/job/ctakes-trunk-compiletest/ws/ctakes-drug-ner/pom.xml,>
MavenProject: org.apache.ctakes:ctakes-side-effect:3.1.0-incubating-SNAPSHOT @ <https://builds.apache.org/job/ctakes-trunk-compiletest/ws/ctakes-side-effect/pom.xml,>
MavenProject: org.apache.ctakes:ctakes-smoking-status:3.1.0-incubating-SNAPSHOT @ <https://builds.apache.org/job/ctakes-trunk-compiletest/ws/ctakes-smoking-status/pom.xml,>
MavenProject: org.apache.ctakes:ctakes-pad-term-spotter:3.1.0-incubating-SNAPSHOT @ <https://builds.apache.org/job/ctakes-trunk-compiletest/ws/ctakes-pad-term-spotter/pom.xml,>
MavenProject: org.apache.ctakes:ctakes-temporal:3.1.0-incubating-SNAPSHOT @ <https://builds.apache.org/job/ctakes-trunk-compiletest/ws/ctakes-temporal/pom.xml,>
MavenProject: org.apache.ctakes:ctakes-distribution:3.1.0-incubating-SNAPSHOT @ <https://builds.apache.org/job/ctakes-trunk-compiletest/ws/ctakes-distribution/pom.xml]>
[JENKINS] Archiving disabled
[JENKINS] Archiving disabled
[JENKINS] Archiving disabled
[JENKINS] Archiving disabled
[JENKINS] Archiving disabled
[JENKINS] Archiving disabled
[JENKINS] Archiving disabled
[JENKINS] Archiving disabled
[JENKINS] Archiving disabled
[JENKINS] Archiving disabled
[JENKINS] Archiving disabled
[JENKINS] Archiving disabled
[JENKINS] Archiving disabled
[JENKINS] Archiving disabled
[JENKINS] Archiving disabled
[JENKINS] Archiving disabled
[JENKINS] Archiving disabled
[JENKINS] Archiving disabled
[JENKINS] Archiving disabled
[JENKINS] Archiving disabled
[JENKINS] Archiving disabled
[JENKINS] Archiving disabled
[JENKINS] Archiving disabled
[JENKINS] Archiving disabled
Waiting for Jenkins to finish collecting data
mavenExecutionResult exceptions not empty
message : Failed to execute goal org.apache.maven.plugins:maven-compiler-plugin:2.4:compile
(default-compile) on project ctakes-core: Compilation failure
cause : Compilation failure
Stack trace : 
org.apache.maven.lifecycle.LifecycleExecutionException: Failed to execute goal org.apache.maven.plugins:maven-compiler-plugin:2.4:compile
(default-compile) on project ctakes-core: Compilation failure
	at org.apache.maven.lifecycle.internal.MojoExecutor.execute(MojoExecutor.java:213)
	at org.apache.maven.lifecycle.internal.MojoExecutor.execute(MojoExecutor.java:153)
	at org.apache.maven.lifecycle.internal.MojoExecutor.execute(MojoExecutor.java:145)
	at org.apache.maven.lifecycle.internal.LifecycleModuleBuilder.buildProject(LifecycleModuleBuilder.java:84)
	at org.apache.maven.lifecycle.internal.LifecycleModuleBuilder.buildProject(LifecycleModuleBuilder.java:59)
	at org.apache.maven.lifecycle.internal.LifecycleStarter.singleThreadedBuild(LifecycleStarter.java:183)
	at org.apache.maven.lifecycle.internal.LifecycleStarter.execute(LifecycleStarter.java:161)
	at org.apache.maven.DefaultMaven.doExecute(DefaultMaven.java:320)
	at org.apache.maven.DefaultMaven.execute(DefaultMaven.java:156)
	at org.jvnet.hudson.maven3.launcher.Maven3Launcher.main(Maven3Launcher.java:79)
	at sun.reflect.NativeMethodAccessorImpl.invoke0(Native Method)
	at sun.reflect.NativeMethodAccessorImpl.invoke(NativeMethodAccessorImpl.java:39)
	at sun.reflect.DelegatingMethodAccessorImpl.invoke(DelegatingMethodAccessorImpl.java:25)
	at java.lang.reflect.Method.invoke(Method.java:597)
	at org.codehaus.plexus.classworlds.launcher.Launcher.launchStandard(Launcher.java:329)
	at org.codehaus.plexus.classworlds.launcher.Launcher.launch(Launcher.java:239)
	at org.jvnet.hudson.maven3.agent.Maven3Main.launch(Maven3Main.java:158)
	at hudson.maven.Maven3Builder.call(Maven3Builder.java:100)
	at hudson.maven.Maven3Builder.call(Maven3Builder.java:66)
	at hudson.remoting.UserRequest.perform(UserRequest.java:118)
	at hudson.remoting.UserRequest.perform(UserRequest.java:48)
	at hudson.remoting.Request$2.run(Request.java:326)
	at hudson.remoting.InterceptingExecutorService$1.call(InterceptingExecutorService.java:72)
	at java.util.concurrent.FutureTask$Sync.innerRun(FutureTask.java:303)
	at java.util.concurrent.FutureTask.run(FutureTask.java:138)
	at java.util.concurrent.ThreadPoolExecutor$Worker.runTask(ThreadPoolExecutor.java:886)
	at java.util.concurrent.ThreadPoolExecutor$Worker.run(ThreadPoolExecutor.java:908)
	at java.lang.Thread.run(Thread.java:662)
Caused by: org.apache.maven.plugin.CompilationFailureException: Compilation failure
	at org.apache.maven.plugin.AbstractCompilerMojo.execute(AbstractCompilerMojo.java:678)
	at org.apache.maven.plugin.CompilerMojo.execute(CompilerMojo.java:128)
	at org.apache.maven.plugin.DefaultBuildPluginManager.executeMojo(DefaultBuildPluginManager.java:101)
	at org.apache.maven.lifecycle.internal.MojoExecutor.execute(MojoExecutor.java:209)
	... 27 more
Sending e-mails to: ctakes-notifications@incubator.apache.org
channel stopped

Mime
View raw message