ctakes-notifications mailing list archives

Site index · List index
Message view « Date » · « Thread »
Top « Date » · « Thread »
From Apache Jenkins Server <jenk...@builds.apache.org>
Subject Build failed in Jenkins: ctakes-trunk-package #35
Date Fri, 11 Jan 2013 00:37:15 GMT
See <https://builds.apache.org/job/ctakes-trunk-package/35/changes>

Changes:

[dligach] bug fixes

[dligach] bug fixes

[chenpei] CTAKES-75 - Removed unnecessary items in NOTICE (uima, opennlp, lucene, jvinci since
they are covered by the second paragraph already.)
Removed items not included- svg icons, junit. added newline to disclaimer.

[stevenbethard] Removes warning from DegreeOfRelationExtractorAnnotator.

------------------------------------------
[...truncated 1300 lines...]
[INFO] artifact junit:junit: checking for updates from cleartk-googlecode
mojoSucceeded org.apache.maven.plugins:maven-remote-resources-plugin:1.3(default)
mojoStarted org.apache.maven.plugins:maven-resources-plugin:2.5(default-resources)
[debug] execute contextualize
[INFO] 
[INFO] Using 'UTF-8' encoding to copy filtered resources.
[INFO] --- maven-resources-plugin:2.5:resources (default-resources) @ ctakes-dependency-parser
---
[INFO] Copying 11 resources
[INFO] Copying 3 resources
mojoSucceeded org.apache.maven.plugins:maven-resources-plugin:2.5(default-resources)
mojoStarted org.apache.maven.plugins:maven-compiler-plugin:2.4(default-compile)
[INFO] 
[INFO] --- maven-compiler-plugin:2.4:compile (default-compile) @ ctakes-dependency-parser
---
[INFO] Nothing to compile - all classes are up to date
mojoSucceeded org.apache.maven.plugins:maven-compiler-plugin:2.4(default-compile)
mojoStarted org.apache.maven.plugins:maven-resources-plugin:2.5(default-testResources)
[INFO] 
[debug] execute contextualize
[INFO] Using 'UTF-8' encoding to copy filtered resources.
[INFO] skip non existing resourceDirectory <https://builds.apache.org/job/ctakes-trunk-package/ws/ctakes-dependency-parser/src/test/resources>
[INFO] Copying 3 resources
[INFO] --- maven-resources-plugin:2.5:testResources (default-testResources) @ ctakes-dependency-parser
---
mojoSucceeded org.apache.maven.plugins:maven-resources-plugin:2.5(default-testResources)
mojoStarted org.apache.maven.plugins:maven-compiler-plugin:2.4(default-testCompile)
[INFO] 
[INFO] No sources to compile
[INFO] --- maven-compiler-plugin:2.4:testCompile (default-testCompile) @ ctakes-dependency-parser
---
mojoSucceeded org.apache.maven.plugins:maven-compiler-plugin:2.4(default-testCompile)
mojoStarted org.apache.maven.plugins:maven-surefire-plugin:2.12(default-test)
[INFO] 
[INFO] Surefire report directory: <https://builds.apache.org/job/ctakes-trunk-package/ws/ctakes-dependency-parser/target/surefire-reports>

-------------------------------------------------------
 T E S T S
-------------------------------------------------------
[INFO] --- maven-surefire-plugin:2.12:test (default-test) @ ctakes-dependency-parser ---

Results :

Tests run: 0, Failures: 0, Errors: 0, Skipped: 0

mojoSucceeded org.apache.maven.plugins:maven-surefire-plugin:2.12(default-test)
[JENKINS] Recording test results
mojoStarted org.apache.maven.plugins:maven-jar-plugin:2.4(default-jar)
[INFO] 
[INFO] --- maven-jar-plugin:2.4:jar (default-jar) @ ctakes-dependency-parser ---
[INFO] Building jar: <https://builds.apache.org/job/ctakes-trunk-package/ws/ctakes-dependency-parser/target/ctakes-dependency-parser-3.1.0-incubating-SNAPSHOT.jar>
mojoSucceeded org.apache.maven.plugins:maven-jar-plugin:2.4(default-jar)
mojoStarted org.apache.maven.plugins:maven-site-plugin:3.1(attach-descriptor)
[INFO] 
[INFO] --- maven-site-plugin:3.1:attach-descriptor (attach-descriptor) @ ctakes-dependency-parser
---
mojoSucceeded org.apache.maven.plugins:maven-site-plugin:3.1(attach-descriptor)
mojoStarted org.apache.maven.plugins:maven-install-plugin:2.3.1(default-install)
[INFO] 
[INFO] Installing <https://builds.apache.org/job/ctakes-trunk-package/ws/ctakes-dependency-parser/target/ctakes-dependency-parser-3.1.0-incubating-SNAPSHOT.jar>
to /export/home/hudson/hudson-slave/maven-repositories/0/org/apache/ctakes/ctakes-dependency-parser/3.1.0-incubating-SNAPSHOT/ctakes-dependency-parser-3.1.0-incubating-SNAPSHOT.jar
[INFO] --- maven-install-plugin:2.3.1:install (default-install) @ ctakes-dependency-parser
---
[INFO] Installing <https://builds.apache.org/job/ctakes-trunk-package/ws/ctakes-dependency-parser/pom.xml>
to /export/home/hudson/hudson-slave/maven-repositories/0/org/apache/ctakes/ctakes-dependency-parser/3.1.0-incubating-SNAPSHOT/ctakes-dependency-parser-3.1.0-incubating-SNAPSHOT.pom
mojoSucceeded org.apache.maven.plugins:maven-install-plugin:2.3.1(default-install)
projectSucceeded org.apache.ctakes:ctakes-dependency-parser:3.1.0-incubating-SNAPSHOT
projectStarted org.apache.ctakes:ctakes-assertion-zoner:3.1.0-incubating-SNAPSHOT
[INFO]                                                                         
[INFO] ------------------------------------------------------------------------
[INFO] Building Apache cTAKES Assertion's zoner 3.1.0-incubating-SNAPSHOT
[INFO] ------------------------------------------------------------------------
mojoStarted org.apache.maven.plugins:maven-remote-resources-plugin:1.3(default)
[INFO] 
[INFO] --- maven-remote-resources-plugin:1.3:process (default) @ ctakes-assertion-zoner ---
mojoSucceeded org.apache.maven.plugins:maven-remote-resources-plugin:1.3(default)
mojoStarted org.apache.maven.plugins:maven-resources-plugin:2.5(default-resources)
[debug] execute contextualize
[INFO] [INFO] Using 'UTF-8' encoding to copy filtered resources.

[INFO] --- maven-resources-plugin:2.5:resources (default-resources) @ ctakes-assertion-zoner
---
[INFO] Copying 8 resources
[INFO] Copying 3 resources
mojoSucceeded org.apache.maven.plugins:maven-resources-plugin:2.5(default-resources)
mojoStarted org.cleartk:jcasgen-maven-plugin:0.9.3(default)
[INFO] 
[INFO] JCasGen: Output going to '<https://builds.apache.org/job/ctakes-trunk-package/ws/ctakes-assertion-zoner/target/generated-sources/jcasgen'>
[INFO] JCasGen: Reading the XML TAE descriptor, and creating types, for xml input file '<https://builds.apache.org/job/ctakes-trunk-package/ws/ctakes-assertion-zoner/src/main/resources/org/apache/ctakes/assertion/zoner/types/TypeSystem.xml'.>
[INFO] --- jcasgen-maven-plugin:0.9.3:generate (default) @ ctakes-assertion-zoner ---
[INFO] JCasGen: Replacing: 'org.apache.ctakes.assertion.zoner.types.Heading'.
[INFO] JCasGen: Replacing: 'org.apache.ctakes.assertion.zoner.types.Heading_Type'.
[INFO] JCasGen: Replacing: 'org.apache.ctakes.assertion.zoner.types.Subzone'.
[INFO] JCasGen: Replacing: 'org.apache.ctakes.assertion.zoner.types.Subzone_Type'.
[INFO] JCasGen: Replacing: 'org.apache.ctakes.assertion.zoner.types.Zone'.
[INFO] JCasGen: Replacing: 'org.apache.ctakes.assertion.zoner.types.Zone_Type'.
mojoSucceeded org.cleartk:jcasgen-maven-plugin:0.9.3(default)
mojoStarted org.apache.maven.plugins:maven-compiler-plugin:2.4(default-compile)
[INFO] 
[INFO] --- maven-compiler-plugin:2.4:compile (default-compile) @ ctakes-assertion-zoner ---
[INFO] Compiling 6 source files to <https://builds.apache.org/job/ctakes-trunk-package/ws/ctakes-assertion-zoner/target/classes>
mojoSucceeded org.apache.maven.plugins:maven-compiler-plugin:2.4(default-compile)
mojoStarted org.apache.maven.plugins:maven-resources-plugin:2.5(default-testResources)
[INFO] 
[INFO] --- maven-resources-plugin:2.5:testResources (default-testResources) @ ctakes-assertion-zoner
---[debug] execute contextualize
[INFO] Using 'UTF-8' encoding to copy filtered resources.
[INFO] skip non existing resourceDirectory <https://builds.apache.org/job/ctakes-trunk-package/ws/ctakes-assertion-zoner/src/test/resources>

[INFO] Copying 3 resources
mojoSucceeded org.apache.maven.plugins:maven-resources-plugin:2.5(default-testResources)
mojoStarted org.apache.maven.plugins:maven-compiler-plugin:2.4(default-testCompile)[INFO]
No sources to compile

[INFO] 
[INFO] --- maven-compiler-plugin:2.4:testCompile (default-testCompile) @ ctakes-assertion-zoner
---
mojoSucceeded org.apache.maven.plugins:maven-compiler-plugin:2.4(default-testCompile)
mojoStarted org.apache.maven.plugins:maven-surefire-plugin:2.12(default-test)
[INFO] 
[INFO] Surefire report directory: <https://builds.apache.org/job/ctakes-trunk-package/ws/ctakes-assertion-zoner/target/surefire-reports>
[INFO] --- maven-surefire-plugin:2.12:test (default-test) @ ctakes-assertion-zoner ---

-------------------------------------------------------
 T E S T S
-------------------------------------------------------

Results :

Tests run: 0, Failures: 0, Errors: 0, Skipped: 0

mojoFailed org.apache.maven.plugins:maven-surefire-plugin:2.12(default-test)
[JENKINS] Recording test results
projectFailed org.apache.ctakes:ctakes-assertion-zoner:3.1.0-incubating-SNAPSHOT
sessionEnded
[INFO] ------------------------------------------------------------------------
[INFO] Reactor Summary:
[INFO] 
[INFO] Apache cTAKES ..................................... SUCCESS [2:05.713s]
[INFO] Apache cTAKES common type system .................. SUCCESS [1:18.231s]
[INFO] Apache cTAKES utils ............................... SUCCESS [18.524s]
[INFO] Apache cTAKES core ................................ SUCCESS [4:00.629s]
[INFO] Apache cTAKES part-of-speech tagger ............... SUCCESS [41.920s]
[INFO] Apache cTAKES chunker ............................. SUCCESS [34.795s]
[INFO] Apache cTAKES document preprocessor ............... SUCCESS [16.646s]
[INFO] Apache cTAKES dictionary lookup ................... SUCCESS [42.142s]
[INFO] Apache cTAKES context dependent tokenizer ......... SUCCESS [21.410s]
[INFO] Apache cTAKES LVG lexical tools ................... SUCCESS [14.322s]
[INFO] Apache cTAKES named entity contexts ............... SUCCESS [57.037s]
[INFO] Apache cTAKES Constituency Parser ................. SUCCESS [1:26.840s]
[INFO] Apache cTAKES Dependency Parser ................... SUCCESS [1:26.564s]
[INFO] Apache cTAKES Assertion's zoner ................... FAILURE [1:07.051s]
[INFO] Apache cTAKES Assertion ........................... SKIPPED
[INFO] Apache cTAKES ctakes-clinical-pipeline ............ SKIPPED
[INFO] Apache cTAKES Relation Extractor .................. SKIPPED
[INFO] Apache cTAKES CoReference Resolver ................ SKIPPED
[INFO] Apache cTAKES Drug NER ............................ SKIPPED
[INFO] Apache cTAKES Side Effects ........................ SKIPPED
[INFO] Apache cTAKES Smoking Status ...................... SKIPPED
[INFO] Apache cTAKES Pad Term Spotter .................... SKIPPED
[INFO] Apache cTAKES Temporal Information Extraction ..... SKIPPED
[INFO] Apache cTAKES Distribution ........................ SKIPPED
[INFO] ------------------------------------------------------------------------
[INFO] BUILD FAILURE
[INFO] ------------------------------------------------------------------------
[INFO] Total time: 16:15.288s
[INFO] Finished at: Fri Jan 11 00:37:32 GMT+00:00 2013
[INFO] Final Memory: 28M/188M
[INFO] ------------------------------------------------------------------------
Projects to build: [MavenProject: org.apache.ctakes:ctakes:3.1.0-incubating-SNAPSHOT @ <https://builds.apache.org/job/ctakes-trunk-package/ws/pom.xml,>
MavenProject: org.apache.ctakes:ctakes-type-system:3.1.0-incubating-SNAPSHOT @ <https://builds.apache.org/job/ctakes-trunk-package/ws/ctakes-type-system/pom.xml,>
MavenProject: org.apache.ctakes:ctakes-utils:3.1.0-incubating-SNAPSHOT @ <https://builds.apache.org/job/ctakes-trunk-package/ws/ctakes-utils/pom.xml,>
MavenProject: org.apache.ctakes:ctakes-core:3.1.0-incubating-SNAPSHOT @ <https://builds.apache.org/job/ctakes-trunk-package/ws/ctakes-core/pom.xml,>
MavenProject: org.apache.ctakes:ctakes-pos-tagger:3.1.0-incubating-SNAPSHOT @ <https://builds.apache.org/job/ctakes-trunk-package/ws/ctakes-pos-tagger/pom.xml,>
MavenProject: org.apache.ctakes:ctakes-chunker:3.1.0-incubating-SNAPSHOT @ <https://builds.apache.org/job/ctakes-trunk-package/ws/ctakes-chunker/pom.xml,>
MavenProject: org.apache.ctakes:ctakes-preprocessor:3.1.0-incubating-SNAPSHOT @ <https://builds.apache.org/job/ctakes-trunk-package/ws/ctakes-preprocessor/pom.xml,>
MavenProject: org.apache.ctakes:ctakes-dictionary-lookup:3.1.0-incubating-SNAPSHOT @ <https://builds.apache.org/job/ctakes-trunk-package/ws/ctakes-dictionary-lookup/pom.xml,>
MavenProject: org.apache.ctakes:ctakes-context-tokenizer:3.1.0-incubating-SNAPSHOT @ <https://builds.apache.org/job/ctakes-trunk-package/ws/ctakes-context-tokenizer/pom.xml,>
MavenProject: org.apache.ctakes:ctakes-lvg:3.1.0-incubating-SNAPSHOT @ <https://builds.apache.org/job/ctakes-trunk-package/ws/ctakes-lvg/pom.xml,>
MavenProject: org.apache.ctakes:ctakes-ne-contexts:3.1.0-incubating-SNAPSHOT @ <https://builds.apache.org/job/ctakes-trunk-package/ws/ctakes-ne-contexts/pom.xml,>
MavenProject: org.apache.ctakes:ctakes-constituency-parser:3.1.0-incubating-SNAPSHOT @ <https://builds.apache.org/job/ctakes-trunk-package/ws/ctakes-constituency-parser/pom.xml,>
MavenProject: org.apache.ctakes:ctakes-dependency-parser:3.1.0-incubating-SNAPSHOT @ <https://builds.apache.org/job/ctakes-trunk-package/ws/ctakes-dependency-parser/pom.xml,>
MavenProject: org.apache.ctakes:ctakes-assertion-zoner:3.1.0-incubating-SNAPSHOT @ <https://builds.apache.org/job/ctakes-trunk-package/ws/ctakes-assertion-zoner/pom.xml,>
MavenProject: org.apache.ctakes:ctakes-assertion:3.1.0-incubating-SNAPSHOT @ <https://builds.apache.org/job/ctakes-trunk-package/ws/ctakes-assertion/pom.xml,>
MavenProject: org.apache.ctakes:ctakes-clinical-pipeline:3.1.0-incubating-SNAPSHOT @ <https://builds.apache.org/job/ctakes-trunk-package/ws/ctakes-clinical-pipeline/pom.xml,>
MavenProject: org.apache.ctakes:ctakes-relation-extractor:3.1.0-incubating-SNAPSHOT @ <https://builds.apache.org/job/ctakes-trunk-package/ws/ctakes-relation-extractor/pom.xml,>
MavenProject: org.apache.ctakes:ctakes-coreference:3.1.0-incubating-SNAPSHOT @ <https://builds.apache.org/job/ctakes-trunk-package/ws/ctakes-coreference/pom.xml,>
MavenProject: org.apache.ctakes:ctakes-drug-ner:3.1.0-incubating-SNAPSHOT @ <https://builds.apache.org/job/ctakes-trunk-package/ws/ctakes-drug-ner/pom.xml,>
MavenProject: org.apache.ctakes:ctakes-side-effect:3.1.0-incubating-SNAPSHOT @ <https://builds.apache.org/job/ctakes-trunk-package/ws/ctakes-side-effect/pom.xml,>
MavenProject: org.apache.ctakes:ctakes-smoking-status:3.1.0-incubating-SNAPSHOT @ <https://builds.apache.org/job/ctakes-trunk-package/ws/ctakes-smoking-status/pom.xml,>
MavenProject: org.apache.ctakes:ctakes-pad-term-spotter:3.1.0-incubating-SNAPSHOT @ <https://builds.apache.org/job/ctakes-trunk-package/ws/ctakes-pad-term-spotter/pom.xml,>
MavenProject: org.apache.ctakes:ctakes-temporal:3.1.0-incubating-SNAPSHOT @ <https://builds.apache.org/job/ctakes-trunk-package/ws/ctakes-temporal/pom.xml,>
MavenProject: org.apache.ctakes:ctakes-distribution:3.1.0-incubating-SNAPSHOT @ <https://builds.apache.org/job/ctakes-trunk-package/ws/ctakes-distribution/pom.xml]>
[JENKINS] Archiving disabled
[JENKINS] Archiving disabled
[JENKINS] Archiving disabled
[JENKINS] Archiving disabled
[JENKINS] Archiving disabled
[JENKINS] Archiving disabled
[JENKINS] Archiving disabled
[JENKINS] Archiving disabled
[JENKINS] Archiving disabled
[JENKINS] Archiving disabled
[JENKINS] Archiving disabled
[JENKINS] Archiving disabled
[JENKINS] Archiving disabled
[JENKINS] Archiving disabled
[JENKINS] Archiving disabled
[JENKINS] Archiving disabled
[JENKINS] Archiving disabled
[JENKINS] Archiving disabled
[JENKINS] Archiving disabled
[JENKINS] Archiving disabled
[JENKINS] Archiving disabled
[JENKINS] Archiving disabled
[JENKINS] Archiving disabled
[JENKINS] Archiving disabled
Waiting for Jenkins to finish collecting data
mavenExecutionResult exceptions not empty
message : Failed to execute goal org.apache.maven.plugins:maven-surefire-plugin:2.12:test
(default-test) on project ctakes-assertion-zoner: Error while executing forked tests.; nested
exception is java.io.IOException: Cannot run program "/bin/sh" (in directory "<https://builds.apache.org/job/ctakes-trunk-package/ws/ctakes-assertion-zoner")>:
error=12, Not enough space
cause : Error while executing forked tests.; nested exception is java.io.IOException: Cannot
run program "/bin/sh" (in directory "<https://builds.apache.org/job/ctakes-trunk-package/ws/ctakes-assertion-zoner")>:
error=12, Not enough space
Stack trace : 
org.apache.maven.lifecycle.LifecycleExecutionException: Failed to execute goal org.apache.maven.plugins:maven-surefire-plugin:2.12:test
(default-test) on project ctakes-assertion-zoner: Error while executing forked tests.; nested
exception is java.io.IOException: Cannot run program "/bin/sh" (in directory "<https://builds.apache.org/job/ctakes-trunk-package/ws/ctakes-assertion-zoner")>:
error=12, Not enough space
	at org.apache.maven.lifecycle.internal.MojoExecutor.execute(MojoExecutor.java:217)
	at org.apache.maven.lifecycle.internal.MojoExecutor.execute(MojoExecutor.java:153)
	at org.apache.maven.lifecycle.internal.MojoExecutor.execute(MojoExecutor.java:145)
	at org.apache.maven.lifecycle.internal.LifecycleModuleBuilder.buildProject(LifecycleModuleBuilder.java:84)
	at org.apache.maven.lifecycle.internal.LifecycleModuleBuilder.buildProject(LifecycleModuleBuilder.java:59)
	at org.apache.maven.lifecycle.internal.LifecycleStarter.singleThreadedBuild(LifecycleStarter.java:183)
	at org.apache.maven.lifecycle.internal.LifecycleStarter.execute(LifecycleStarter.java:161)
	at org.apache.maven.DefaultMaven.doExecute(DefaultMaven.java:319)
	at org.apache.maven.DefaultMaven.execute(DefaultMaven.java:156)
	at org.jvnet.hudson.maven3.launcher.Maven3Launcher.main(Maven3Launcher.java:79)
	at sun.reflect.NativeMethodAccessorImpl.invoke0(Native Method)
	at sun.reflect.NativeMethodAccessorImpl.invoke(NativeMethodAccessorImpl.java:39)
	at sun.reflect.DelegatingMethodAccessorImpl.invoke(DelegatingMethodAccessorImpl.java:25)
	at java.lang.reflect.Method.invoke(Method.java:597)
	at org.codehaus.plexus.classworlds.launcher.Launcher.launchStandard(Launcher.java:329)
	at org.codehaus.plexus.classworlds.launcher.Launcher.launch(Launcher.java:239)
	at org.jvnet.hudson.maven3.agent.Maven3Main.launch(Maven3Main.java:158)
	at hudson.maven.Maven3Builder.call(Maven3Builder.java:100)
	at hudson.maven.Maven3Builder.call(Maven3Builder.java:66)
	at hudson.remoting.UserRequest.perform(UserRequest.java:118)
	at hudson.remoting.UserRequest.perform(UserRequest.java:48)
	at hudson.remoting.Request$2.run(Request.java:326)
	at hudson.remoting.InterceptingExecutorService$1.call(InterceptingExecutorService.java:72)
	at java.util.concurrent.FutureTask$Sync.innerRun(FutureTask.java:303)
	at java.util.concurrent.FutureTask.run(FutureTask.java:138)
	at java.util.concurrent.ThreadPoolExecutor$Worker.runTask(ThreadPoolExecutor.java:886)
	at java.util.concurrent.ThreadPoolExecutor$Worker.run(ThreadPoolExecutor.java:908)
	at java.lang.Thread.run(Thread.java:662)
Caused by: org.apache.maven.plugin.MojoExecutionException: Error while executing forked tests.;
nested exception is java.io.IOException: Cannot run program "/bin/sh" (in directory "<https://builds.apache.org/job/ctakes-trunk-package/ws/ctakes-assertion-zoner")>:
error=12, Not enough space
	at org.apache.maven.plugin.surefire.SurefirePlugin.assertNoException(SurefirePlugin.java:656)
	at org.apache.maven.plugin.surefire.SurefirePlugin.handleSummary(SurefirePlugin.java:645)
	at org.apache.maven.plugin.surefire.AbstractSurefireMojo.executeAfterPreconditionsChecked(AbstractSurefireMojo.java:137)
	at org.apache.maven.plugin.surefire.AbstractSurefireMojo.execute(AbstractSurefireMojo.java:98)
	at org.apache.maven.plugin.DefaultBuildPluginManager.executeMojo(DefaultBuildPluginManager.java:101)
	at org.apache.maven.lifecycle.internal.MojoExecutor.execute(MojoExecutor.java:209)
	... 27 more
Caused by: org.apache.maven.surefire.booter.SurefireBooterForkException: Error while executing
forked tests.; nested exception is java.io.IOException: Cannot run program "/bin/sh" (in directory
"<https://builds.apache.org/job/ctakes-trunk-package/ws/ctakes-assertion-zoner")>: error=12,
Not enough space
	at org.apache.maven.plugin.surefire.booterclient.ForkStarter.fork(ForkStarter.java:294)
	at org.apache.maven.plugin.surefire.booterclient.ForkStarter.run(ForkStarter.java:113)
	at org.apache.maven.plugin.surefire.AbstractSurefireMojo.executeProvider(AbstractSurefireMojo.java:199)
	at org.apache.maven.plugin.surefire.AbstractSurefireMojo.executeAllProviders(AbstractSurefireMojo.java:176)
	at org.apache.maven.plugin.surefire.AbstractSurefireMojo.executeAfterPreconditionsChecked(AbstractSurefireMojo.java:135)
	... 30 more
Caused by: java.io.IOException: Cannot run program "/bin/sh" (in directory "<https://builds.apache.org/job/ctakes-trunk-package/ws/ctakes-assertion-zoner")>:
error=12, Not enough space
	at java.lang.ProcessBuilder.start(ProcessBuilder.java:460)
	at java.lang.Runtime.exec(Runtime.java:593)
	at org.codehaus.plexus.util.cli.Commandline.execute(Commandline.java:651)
	at org.codehaus.plexus.util.cli.CommandLineUtils.executeCommandLineAsCallable(CommandLineUtils.java:140)
	at org.codehaus.plexus.util.cli.CommandLineUtils.executeCommandLine(CommandLineUtils.java:111)
	at org.codehaus.plexus.util.cli.CommandLineUtils.executeCommandLine(CommandLineUtils.java:86)
	at org.apache.maven.plugin.surefire.booterclient.ForkStarter.fork(ForkStarter.java:276)
	... 34 more
Caused by: java.io.IOException: error=12, Not enough space
	at java.lang.UNIXProcess.forkAndExec(Native Method)
	at java.lang.UNIXProcess.<init>(UNIXProcess.java:53)
	at java.lang.ProcessImpl.start(ProcessImpl.java:65)
	at java.lang.ProcessBuilder.start(ProcessBuilder.java:453)
	... 40 more
Sending e-mails to: ctakes-notifications@incubator.apache.org
Sending e-mails to: ctakes-notifications@incubator.apache.org
channel stopped

Mime
View raw message