ctakes-notifications mailing list archives

Site index · List index
Message view « Date » · « Thread »
Top « Date » · « Thread »
From Apache Jenkins Server <jenk...@builds.apache.org>
Subject Build failed in Jenkins: ctakes-trunk-package #34
Date Thu, 10 Jan 2013 00:36:57 GMT
See <https://builds.apache.org/job/ctakes-trunk-package/34/changes>

Changes:

[stevenbethard] Adds UMLS entity chunk features back to the EventAnnotator evalution

[dligach] Initial commit of the second baseline (closest entities of correct type)

[seanfinan] CTAKES-127 : Removed path prefix in the <Name> of the module/analysis engine

[seanfinan] CTAKES-120 : Moving CPEs from directory cpe/ to collection_processing_engine/
to conform with new structure

[seanfinan] CTAKES-118 : updating urls to fit new directory structure

[seanfinan] CTAKES-120 : Adding placeholder desc directories to match user guide

[dligach] added a baseline annotator

[seanfinan] CTAKES-126 :Added SETLOCAL for environment variable CTAKES_HOME

[chenpei] CTAKES-125 - Move DISCLAIMER to root in SVN.  Updated 2013 copyright ASF in Notice.

[james-masanz] add subject as part of: CTAKES-69 Add the code for reading Knowtator XML annotations
into the UIMA type system.

[stevenbethard] Adds options for evaluating relation extraction using cTAKES mentions and
various ways of mapping them to gold mentions

------------------------------------------
[...truncated 334 lines...]
[INFO] JCasGen: Replacing: 'org.apache.ctakes.typesystem.type.textsem.HistoryOfModifier_Type'.
[INFO] JCasGen: Replacing: 'org.apache.ctakes.typesystem.type.textsem.IdentifiedAnnotation'.
[INFO] JCasGen: Replacing: 'org.apache.ctakes.typesystem.type.textsem.IdentifiedAnnotation_Type'.
[INFO] JCasGen: Replacing: 'org.apache.ctakes.typesystem.type.textsem.LabDeltaFlagModifier'.
[INFO] JCasGen: Replacing: 'org.apache.ctakes.typesystem.type.textsem.LabDeltaFlagModifier_Type'.
[INFO] JCasGen: Replacing: 'org.apache.ctakes.typesystem.type.textsem.LabEstimatedModifier'.
[INFO] JCasGen: Replacing: 'org.apache.ctakes.typesystem.type.textsem.LabEstimatedModifier_Type'.
[INFO] JCasGen: Replacing: 'org.apache.ctakes.typesystem.type.textsem.LabInterpretationModifier'.
[INFO] JCasGen: Replacing: 'org.apache.ctakes.typesystem.type.textsem.LabInterpretationModifier_Type'.
[INFO] JCasGen: Replacing: 'org.apache.ctakes.typesystem.type.textsem.LabReferenceRangeModifier'.
[INFO] JCasGen: Replacing: 'org.apache.ctakes.typesystem.type.textsem.LabReferenceRangeModifier_Type'.
[INFO] JCasGen: Replacing: 'org.apache.ctakes.typesystem.type.textsem.LabValueModifier'.
[INFO] JCasGen: Replacing: 'org.apache.ctakes.typesystem.type.textsem.LabValueModifier_Type'.
[INFO] JCasGen: Replacing: 'org.apache.ctakes.typesystem.type.textsem.MeasurementAnnotation'.
[INFO] JCasGen: Replacing: 'org.apache.ctakes.typesystem.type.textsem.MeasurementAnnotation_Type'.
[INFO] JCasGen: Replacing: 'org.apache.ctakes.typesystem.type.textsem.MedicationAllergyModifier'.
[INFO] JCasGen: Replacing: 'org.apache.ctakes.typesystem.type.textsem.MedicationAllergyModifier_Type'.
[INFO] JCasGen: Replacing: 'org.apache.ctakes.typesystem.type.textsem.MedicationDosageModifier'.
[INFO] JCasGen: Replacing: 'org.apache.ctakes.typesystem.type.textsem.MedicationDosageModifier_Type'.
[INFO] JCasGen: Replacing: 'org.apache.ctakes.typesystem.type.textsem.MedicationDurationModifier'.
[INFO] JCasGen: Replacing: 'org.apache.ctakes.typesystem.type.textsem.MedicationDurationModifier_Type'.
[INFO] JCasGen: Replacing: 'org.apache.ctakes.typesystem.type.textsem.MedicationEventMention'.
[INFO] JCasGen: Replacing: 'org.apache.ctakes.typesystem.type.textsem.MedicationEventMention_Type'.
[INFO] JCasGen: Replacing: 'org.apache.ctakes.typesystem.type.textsem.MedicationFormModifier'.
[INFO] JCasGen: Replacing: 'org.apache.ctakes.typesystem.type.textsem.MedicationFormModifier_Type'.
[INFO] JCasGen: Replacing: 'org.apache.ctakes.typesystem.type.textsem.MedicationFrequencyModifier'.
[INFO] JCasGen: Replacing: 'org.apache.ctakes.typesystem.type.textsem.MedicationFrequencyModifier_Type'.
[INFO] JCasGen: Replacing: 'org.apache.ctakes.typesystem.type.textsem.MedicationRouteModifier'.
[INFO] JCasGen: Replacing: 'org.apache.ctakes.typesystem.type.textsem.MedicationRouteModifier_Type'.
[INFO] JCasGen: Replacing: 'org.apache.ctakes.typesystem.type.textsem.MedicationStatusChangeModifier'.
[INFO] JCasGen: Replacing: 'org.apache.ctakes.typesystem.type.textsem.MedicationStatusChangeModifier_Type'.
[INFO] JCasGen: Replacing: 'org.apache.ctakes.typesystem.type.textsem.MedicationStrengthModifier'.
[INFO] JCasGen: Replacing: 'org.apache.ctakes.typesystem.type.textsem.MedicationStrengthModifier_Type'.
[INFO] JCasGen: Replacing: 'org.apache.ctakes.typesystem.type.textsem.Modifier'.
[INFO] JCasGen: Replacing: 'org.apache.ctakes.typesystem.type.textsem.Modifier_Type'.
[INFO] JCasGen: Replacing: 'org.apache.ctakes.typesystem.type.textsem.PersonTitleAnnotation'.
[INFO] JCasGen: Replacing: 'org.apache.ctakes.typesystem.type.textsem.PersonTitleAnnotation_Type'.
[INFO] JCasGen: Replacing: 'org.apache.ctakes.typesystem.type.textsem.PolarityModifier'.
[INFO] JCasGen: Replacing: 'org.apache.ctakes.typesystem.type.textsem.PolarityModifier_Type'.
[INFO] JCasGen: Replacing: 'org.apache.ctakes.typesystem.type.textsem.Predicate'.
[INFO] JCasGen: Replacing: 'org.apache.ctakes.typesystem.type.textsem.Predicate_Type'.
[INFO] JCasGen: Replacing: 'org.apache.ctakes.typesystem.type.textsem.ProcedureDeviceModifier'.
[INFO] JCasGen: Replacing: 'org.apache.ctakes.typesystem.type.textsem.ProcedureDeviceModifier_Type'.
[INFO] JCasGen: Replacing: 'org.apache.ctakes.typesystem.type.textsem.ProcedureMethodModifier'.
[INFO] JCasGen: Replacing: 'org.apache.ctakes.typesystem.type.textsem.ProcedureMethodModifier_Type'.
[INFO] JCasGen: Replacing: 'org.apache.ctakes.typesystem.type.textsem.RangeAnnotation'.
[INFO] JCasGen: Replacing: 'org.apache.ctakes.typesystem.type.textsem.RangeAnnotation_Type'.
[INFO] JCasGen: Replacing: 'org.apache.ctakes.typesystem.type.textsem.RomanNumeralAnnotation'.
[INFO] JCasGen: Replacing: 'org.apache.ctakes.typesystem.type.textsem.RomanNumeralAnnotation_Type'.
[INFO] JCasGen: Replacing: 'org.apache.ctakes.typesystem.type.textsem.SemanticArgument'.
[INFO] JCasGen: Replacing: 'org.apache.ctakes.typesystem.type.textsem.SemanticArgument_Type'.
[INFO] JCasGen: Replacing: 'org.apache.ctakes.typesystem.type.textsem.SemanticRoleRelation'.
[INFO] JCasGen: Replacing: 'org.apache.ctakes.typesystem.type.textsem.SemanticRoleRelation_Type'.
[INFO] JCasGen: Replacing: 'org.apache.ctakes.typesystem.type.textsem.SeverityModifier'.
[INFO] JCasGen: Replacing: 'org.apache.ctakes.typesystem.type.textsem.SeverityModifier_Type'.
[INFO] JCasGen: Replacing: 'org.apache.ctakes.typesystem.type.textsem.SubjectModifier'.
[INFO] JCasGen: Replacing: 'org.apache.ctakes.typesystem.type.textsem.SubjectModifier_Type'.
[INFO] JCasGen: Replacing: 'org.apache.ctakes.typesystem.type.textsem.TimeAnnotation'.
[INFO] JCasGen: Replacing: 'org.apache.ctakes.typesystem.type.textsem.TimeAnnotation_Type'.
[INFO] JCasGen: Replacing: 'org.apache.ctakes.typesystem.type.textsem.TimeMention'.
[INFO] JCasGen: Replacing: 'org.apache.ctakes.typesystem.type.textsem.TimeMention_Type'.
[INFO] JCasGen: Replacing: 'org.apache.ctakes.typesystem.type.textsem.UncertaintyModifier'.
[INFO] JCasGen: Replacing: 'org.apache.ctakes.typesystem.type.textsem.UncertaintyModifier_Type'.
[INFO] JCasGen: Replacing: 'org.apache.ctakes.typesystem.type.textspan.List'.
[INFO] JCasGen: Replacing: 'org.apache.ctakes.typesystem.type.textspan.List_Type'.
[INFO] JCasGen: Replacing: 'org.apache.ctakes.typesystem.type.textspan.LookupWindowAnnotation'.
[INFO] JCasGen: Replacing: 'org.apache.ctakes.typesystem.type.textspan.LookupWindowAnnotation_Type'.
[INFO] JCasGen: Replacing: 'org.apache.ctakes.typesystem.type.textspan.Paragraph'.
[INFO] JCasGen: Replacing: 'org.apache.ctakes.typesystem.type.textspan.Paragraph_Type'.
[INFO] JCasGen: Replacing: 'org.apache.ctakes.typesystem.type.textspan.Segment'.
[INFO] JCasGen: Replacing: 'org.apache.ctakes.typesystem.type.textspan.Segment_Type'.
[INFO] JCasGen: Replacing: 'org.apache.ctakes.typesystem.type.textspan.Sentence'.
[INFO] JCasGen: Replacing: 'org.apache.ctakes.typesystem.type.textspan.Sentence_Type'.
[INFO] JCasGen: Replacing: 'org.apache.ctakes.typesystem.type.util.Pair'.
[INFO] JCasGen: Replacing: 'org.apache.ctakes.typesystem.type.util.Pair_Type'.
[INFO] JCasGen: Replacing: 'org.apache.ctakes.typesystem.type.util.Pairs'.
[INFO] JCasGen: Replacing: 'org.apache.ctakes.typesystem.type.util.Pairs_Type'.
[INFO] JCasGen: Replacing: 'org.apache.ctakes.typesystem.type.util.ProbabilityDistribution'.
[INFO] JCasGen: Replacing: 'org.apache.ctakes.typesystem.type.util.ProbabilityDistribution_Type'.
mojoSucceeded org.cleartk:jcasgen-maven-plugin:0.9.3(default)
mojoStarted org.apache.maven.plugins:maven-compiler-plugin:2.4(default-compile)
[INFO] 
[INFO] --- maven-compiler-plugin:2.4:compile (default-compile) @ ctakes-type-system ---
[INFO] Compiling 264 source files to <https://builds.apache.org/job/ctakes-trunk-package/ws/ctakes-type-system/target/classes>
mojoSucceeded org.apache.maven.plugins:maven-compiler-plugin:2.4(default-compile)
mojoStarted org.apache.maven.plugins:maven-resources-plugin:2.5(default-testResources)
[INFO] 
[debug] execute contextualize
[INFO] Using 'UTF-8' encoding to copy filtered resources.
[INFO] skip non existing resourceDirectory <https://builds.apache.org/job/ctakes-trunk-package/ws/ctakes-type-system/src/test/resources>
[INFO] Copying 3 resources
[INFO] --- maven-resources-plugin:2.5:testResources (default-testResources) @ ctakes-type-system
---
mojoSucceeded org.apache.maven.plugins:maven-resources-plugin:2.5(default-testResources)
mojoStarted org.apache.maven.plugins:maven-compiler-plugin:2.4(default-testCompile)
[INFO] 
[INFO] No sources to compile
[INFO] --- maven-compiler-plugin:2.4:testCompile (default-testCompile) @ ctakes-type-system
---
mojoSucceeded org.apache.maven.plugins:maven-compiler-plugin:2.4(default-testCompile)
mojoStarted org.apache.maven.plugins:maven-surefire-plugin:2.12(default-test)
[INFO] 
[INFO] --- maven-surefire-plugin:2.12:test (default-test) @ ctakes-type-system ---
[INFO] Surefire report directory: <https://builds.apache.org/job/ctakes-trunk-package/ws/ctakes-type-system/target/surefire-reports>

-------------------------------------------------------
 T E S T S
-------------------------------------------------------

Results :

Tests run: 0, Failures: 0, Errors: 0, Skipped: 0

mojoSucceeded org.apache.maven.plugins:maven-surefire-plugin:2.12(default-test)
[JENKINS] Recording test results
mojoStarted org.apache.maven.plugins:maven-jar-plugin:2.4(default-jar)
[INFO] 
[INFO] --- maven-jar-plugin:2.4:jar (default-jar) @ ctakes-type-system ---
mojoFailed org.apache.maven.plugins:maven-jar-plugin:2.4(default-jar)
projectFailed org.apache.ctakes:ctakes-type-system:3.1.0-incubating-SNAPSHOT
sessionEnded
[INFO] ------------------------------------------------------------------------
[INFO] Reactor Summary:
[INFO] 
[INFO] Apache cTAKES ..................................... SUCCESS [2:21.251s]
[INFO] Apache cTAKES common type system .................. FAILURE [1:07.942s]
[INFO] Apache cTAKES utils ............................... SKIPPED
[INFO] Apache cTAKES core ................................ SKIPPED
[INFO] Apache cTAKES part-of-speech tagger ............... SKIPPED
[INFO] Apache cTAKES chunker ............................. SKIPPED
[INFO] Apache cTAKES document preprocessor ............... SKIPPED
[INFO] Apache cTAKES dictionary lookup ................... SKIPPED
[INFO] Apache cTAKES context dependent tokenizer ......... SKIPPED
[INFO] Apache cTAKES LVG lexical tools ................... SKIPPED
[INFO] Apache cTAKES named entity contexts ............... SKIPPED
[INFO] Apache cTAKES Constituency Parser ................. SKIPPED
[INFO] Apache cTAKES Dependency Parser ................... SKIPPED
[INFO] Apache cTAKES Assertion's zoner ................... SKIPPED
[INFO] Apache cTAKES Assertion ........................... SKIPPED
[INFO] Apache cTAKES ctakes-clinical-pipeline ............ SKIPPED
[INFO] Apache cTAKES Relation Extractor .................. SKIPPED
[INFO] Apache cTAKES CoReference Resolver ................ SKIPPED
[INFO] Apache cTAKES Drug NER ............................ SKIPPED
[INFO] Apache cTAKES Side Effects ........................ SKIPPED
[INFO] Apache cTAKES Smoking Status ...................... SKIPPED
[INFO] Apache cTAKES Pad Term Spotter .................... SKIPPED
[INFO] Apache cTAKES Temporal Information Extraction ..... SKIPPED
[INFO] Apache cTAKES Distribution ........................ SKIPPED
[INFO] ------------------------------------------------------------------------
[INFO] BUILD FAILURE
[INFO] ------------------------------------------------------------------------
[INFO] Total time: 4:02.180s
[INFO] Finished at: Thu Jan 10 00:37:20 GMT+00:00 2013
[INFO] Final Memory: 21M/130M
[INFO] ------------------------------------------------------------------------
Projects to build: [MavenProject: org.apache.ctakes:ctakes:3.1.0-incubating-SNAPSHOT @ <https://builds.apache.org/job/ctakes-trunk-package/ws/pom.xml,>
MavenProject: org.apache.ctakes:ctakes-type-system:3.1.0-incubating-SNAPSHOT @ <https://builds.apache.org/job/ctakes-trunk-package/ws/ctakes-type-system/pom.xml,>
MavenProject: org.apache.ctakes:ctakes-utils:3.1.0-incubating-SNAPSHOT @ <https://builds.apache.org/job/ctakes-trunk-package/ws/ctakes-utils/pom.xml,>
MavenProject: org.apache.ctakes:ctakes-core:3.1.0-incubating-SNAPSHOT @ <https://builds.apache.org/job/ctakes-trunk-package/ws/ctakes-core/pom.xml,>
MavenProject: org.apache.ctakes:ctakes-pos-tagger:3.1.0-incubating-SNAPSHOT @ <https://builds.apache.org/job/ctakes-trunk-package/ws/ctakes-pos-tagger/pom.xml,>
MavenProject: org.apache.ctakes:ctakes-chunker:3.1.0-incubating-SNAPSHOT @ <https://builds.apache.org/job/ctakes-trunk-package/ws/ctakes-chunker/pom.xml,>
MavenProject: org.apache.ctakes:ctakes-preprocessor:3.1.0-incubating-SNAPSHOT @ <https://builds.apache.org/job/ctakes-trunk-package/ws/ctakes-preprocessor/pom.xml,>
MavenProject: org.apache.ctakes:ctakes-dictionary-lookup:3.1.0-incubating-SNAPSHOT @ <https://builds.apache.org/job/ctakes-trunk-package/ws/ctakes-dictionary-lookup/pom.xml,>
MavenProject: org.apache.ctakes:ctakes-context-tokenizer:3.1.0-incubating-SNAPSHOT @ <https://builds.apache.org/job/ctakes-trunk-package/ws/ctakes-context-tokenizer/pom.xml,>
MavenProject: org.apache.ctakes:ctakes-lvg:3.1.0-incubating-SNAPSHOT @ <https://builds.apache.org/job/ctakes-trunk-package/ws/ctakes-lvg/pom.xml,>
MavenProject: org.apache.ctakes:ctakes-ne-contexts:3.1.0-incubating-SNAPSHOT @ <https://builds.apache.org/job/ctakes-trunk-package/ws/ctakes-ne-contexts/pom.xml,>
MavenProject: org.apache.ctakes:ctakes-constituency-parser:3.1.0-incubating-SNAPSHOT @ <https://builds.apache.org/job/ctakes-trunk-package/ws/ctakes-constituency-parser/pom.xml,>
MavenProject: org.apache.ctakes:ctakes-dependency-parser:3.1.0-incubating-SNAPSHOT @ <https://builds.apache.org/job/ctakes-trunk-package/ws/ctakes-dependency-parser/pom.xml,>
MavenProject: org.apache.ctakes:ctakes-assertion-zoner:3.1.0-incubating-SNAPSHOT @ <https://builds.apache.org/job/ctakes-trunk-package/ws/ctakes-assertion-zoner/pom.xml,>
MavenProject: org.apache.ctakes:ctakes-assertion:3.1.0-incubating-SNAPSHOT @ <https://builds.apache.org/job/ctakes-trunk-package/ws/ctakes-assertion/pom.xml,>
MavenProject: org.apache.ctakes:ctakes-clinical-pipeline:3.1.0-incubating-SNAPSHOT @ <https://builds.apache.org/job/ctakes-trunk-package/ws/ctakes-clinical-pipeline/pom.xml,>
MavenProject: org.apache.ctakes:ctakes-relation-extractor:3.1.0-incubating-SNAPSHOT @ <https://builds.apache.org/job/ctakes-trunk-package/ws/ctakes-relation-extractor/pom.xml,>
MavenProject: org.apache.ctakes:ctakes-coreference:3.1.0-incubating-SNAPSHOT @ <https://builds.apache.org/job/ctakes-trunk-package/ws/ctakes-coreference/pom.xml,>
MavenProject: org.apache.ctakes:ctakes-drug-ner:3.1.0-incubating-SNAPSHOT @ <https://builds.apache.org/job/ctakes-trunk-package/ws/ctakes-drug-ner/pom.xml,>
MavenProject: org.apache.ctakes:ctakes-side-effect:3.1.0-incubating-SNAPSHOT @ <https://builds.apache.org/job/ctakes-trunk-package/ws/ctakes-side-effect/pom.xml,>
MavenProject: org.apache.ctakes:ctakes-smoking-status:3.1.0-incubating-SNAPSHOT @ <https://builds.apache.org/job/ctakes-trunk-package/ws/ctakes-smoking-status/pom.xml,>
MavenProject: org.apache.ctakes:ctakes-pad-term-spotter:3.1.0-incubating-SNAPSHOT @ <https://builds.apache.org/job/ctakes-trunk-package/ws/ctakes-pad-term-spotter/pom.xml,>
MavenProject: org.apache.ctakes:ctakes-temporal:3.1.0-incubating-SNAPSHOT @ <https://builds.apache.org/job/ctakes-trunk-package/ws/ctakes-temporal/pom.xml,>
MavenProject: org.apache.ctakes:ctakes-distribution:3.1.0-incubating-SNAPSHOT @ <https://builds.apache.org/job/ctakes-trunk-package/ws/ctakes-distribution/pom.xml]>
[JENKINS] Archiving disabled
[JENKINS] Archiving disabled
[JENKINS] Archiving disabled
[JENKINS] Archiving disabled
[JENKINS] Archiving disabled
[JENKINS] Archiving disabled
[JENKINS] Archiving disabled
[JENKINS] Archiving disabled
[JENKINS] Archiving disabled
[JENKINS] Archiving disabled
[JENKINS] Archiving disabled
[JENKINS] Archiving disabled
[JENKINS] Archiving disabled
[JENKINS] Archiving disabled
[JENKINS] Archiving disabled
[JENKINS] Archiving disabled
[JENKINS] Archiving disabled
[JENKINS] Archiving disabled
[JENKINS] Archiving disabled
[JENKINS] Archiving disabled
[JENKINS] Archiving disabled
[JENKINS] Archiving disabled
[JENKINS] Archiving disabled
[JENKINS] Archiving disabled
Waiting for Jenkins to finish collecting data
mavenExecutionResult exceptions not empty
message : Failed to execute goal org.apache.maven.plugins:maven-jar-plugin:2.4:jar (default-jar)
on project ctakes-type-system: Error assembling JAR
cause : Error assembling JAR
Stack trace : 
org.apache.maven.lifecycle.LifecycleExecutionException: Failed to execute goal org.apache.maven.plugins:maven-jar-plugin:2.4:jar
(default-jar) on project ctakes-type-system: Error assembling JAR
	at org.apache.maven.lifecycle.internal.MojoExecutor.execute(MojoExecutor.java:217)
	at org.apache.maven.lifecycle.internal.MojoExecutor.execute(MojoExecutor.java:153)
	at org.apache.maven.lifecycle.internal.MojoExecutor.execute(MojoExecutor.java:145)
	at org.apache.maven.lifecycle.internal.LifecycleModuleBuilder.buildProject(LifecycleModuleBuilder.java:84)
	at org.apache.maven.lifecycle.internal.LifecycleModuleBuilder.buildProject(LifecycleModuleBuilder.java:59)
	at org.apache.maven.lifecycle.internal.LifecycleStarter.singleThreadedBuild(LifecycleStarter.java:183)
	at org.apache.maven.lifecycle.internal.LifecycleStarter.execute(LifecycleStarter.java:161)
	at org.apache.maven.DefaultMaven.doExecute(DefaultMaven.java:319)
	at org.apache.maven.DefaultMaven.execute(DefaultMaven.java:156)
	at org.jvnet.hudson.maven3.launcher.Maven3Launcher.main(Maven3Launcher.java:79)
	at sun.reflect.NativeMethodAccessorImpl.invoke0(Native Method)
	at sun.reflect.NativeMethodAccessorImpl.invoke(NativeMethodAccessorImpl.java:39)
	at sun.reflect.DelegatingMethodAccessorImpl.invoke(DelegatingMethodAccessorImpl.java:25)
	at java.lang.reflect.Method.invoke(Method.java:597)
	at org.codehaus.plexus.classworlds.launcher.Launcher.launchStandard(Launcher.java:329)
	at org.codehaus.plexus.classworlds.launcher.Launcher.launch(Launcher.java:239)
	at org.jvnet.hudson.maven3.agent.Maven3Main.launch(Maven3Main.java:158)
	at hudson.maven.Maven3Builder.call(Maven3Builder.java:100)
	at hudson.maven.Maven3Builder.call(Maven3Builder.java:66)
	at hudson.remoting.UserRequest.perform(UserRequest.java:118)
	at hudson.remoting.UserRequest.perform(UserRequest.java:48)
	at hudson.remoting.Request$2.run(Request.java:326)
	at hudson.remoting.InterceptingExecutorService$1.call(InterceptingExecutorService.java:72)
	at java.util.concurrent.FutureTask$Sync.innerRun(FutureTask.java:303)
	at java.util.concurrent.FutureTask.run(FutureTask.java:138)
	at java.util.concurrent.ThreadPoolExecutor$Worker.runTask(ThreadPoolExecutor.java:886)
	at java.util.concurrent.ThreadPoolExecutor$Worker.run(ThreadPoolExecutor.java:908)
	at java.lang.Thread.run(Thread.java:662)
Caused by: org.apache.maven.plugin.MojoExecutionException: Error assembling JAR
	at org.apache.maven.plugin.jar.AbstractJarMojo.createArchive(AbstractJarMojo.java:237)
	at org.apache.maven.plugin.jar.AbstractJarMojo.execute(AbstractJarMojo.java:255)
	at org.apache.maven.plugin.DefaultBuildPluginManager.executeMojo(DefaultBuildPluginManager.java:101)
	at org.apache.maven.lifecycle.internal.MojoExecutor.execute(MojoExecutor.java:209)
	... 27 more
Caused by: org.codehaus.plexus.archiver.ArchiverException: Failed to read filesystem attributes
for: <https://builds.apache.org/job/ctakes-trunk-package/ws/ctakes-type-system/pom.xml>
	at org.codehaus.plexus.archiver.ArchiveEntry.createFileEntry(ArchiveEntry.java:163)
	at org.codehaus.plexus.archiver.AbstractArchiver.addFile(AbstractArchiver.java:404)
	at org.codehaus.plexus.archiver.AbstractArchiver.addFile(AbstractArchiver.java:316)
	at org.apache.maven.archiver.MavenArchiver.createArchive(MavenArchiver.java:526)
	at org.apache.maven.plugin.jar.AbstractJarMojo.createArchive(AbstractJarMojo.java:230)
	... 30 more
Caused by: java.io.IOException: Failed to quote directory: '<https://builds.apache.org/job/ctakes-trunk-package/ws/ctakes-type-system/pom.xml'>
	at org.codehaus.plexus.components.io.attributes.PlexusIoResourceAttributeUtils.getFileAttributesByPath(PlexusIoResourceAttributeUtils.java:256)
	at org.codehaus.plexus.components.io.attributes.PlexusIoResourceAttributeUtils.getFileAttributes(PlexusIoResourceAttributeUtils.java:172)
	at org.codehaus.plexus.archiver.ArchiveEntry.createFileEntry(ArchiveEntry.java:159)
	... 34 more
Caused by: org.codehaus.plexus.util.cli.CommandLineException: Error while executing process.
	at org.codehaus.plexus.util.cli.Commandline.execute(Commandline.java:656)
	at org.codehaus.plexus.util.cli.CommandLineUtils.executeCommandLineAsCallable(CommandLineUtils.java:140)
	at org.codehaus.plexus.components.io.attributes.PlexusIoResourceAttributeUtils.getFileAttributesByPath(PlexusIoResourceAttributeUtils.java:247)
	... 36 more
Caused by: java.io.IOException: Cannot run program "/bin/sh": error=12, Not enough space
	at java.lang.ProcessBuilder.start(ProcessBuilder.java:460)
	at java.lang.Runtime.exec(Runtime.java:593)
	at java.lang.Runtime.exec(Runtime.java:509)
	at org.codehaus.plexus.util.cli.Commandline.execute(Commandline.java:636)
	... 38 more
Caused by: java.io.IOException: error=12, Not enough space
	at java.lang.UNIXProcess.forkAndExec(Native Method)
	at java.lang.UNIXProcess.<init>(UNIXProcess.java:53)
	at java.lang.ProcessImpl.start(ProcessImpl.java:65)
	at java.lang.ProcessBuilder.start(ProcessBuilder.java:453)
	... 41 more
Sending e-mails to: ctakes-notifications@incubator.apache.org
channel stopped

Mime
View raw message