ctakes-notifications mailing list archives

Site index · List index
Message view « Date » · « Thread »
Top « Date » · « Thread »
From Apache Jenkins Server <jenk...@builds.apache.org>
Subject Build failed in Jenkins: cTAKES-trunk #14
Date Sat, 20 Oct 2012 07:41:45 GMT
See <https://builds.apache.org/job/cTAKES-trunk/14/changes>

Changes:

[james-masanz] CTAKES-86
ConvertandCompare.java and Compare.java have bug in an error message

[james-masanz] CTAKES-14	 and  CTAKES-85
Add arg1 and arg2 to AttributeRelation and ElementRelation
Add feature to TimeMention to correspond to what is being manually annotated as "class"

[chenpei] https://issues.apache.org/jira/browse/CTAKES-73
When assembling, the files doesn't need to go thru the variable substitution
filtered=false

[chenpei] Added default log4j configuration.

[chenpei] https://issues.apache.org/jira/browse/CTAKES-73
Temporarily not inheriting apache's pom as parent.  appears that it will expect things in
the snapshots repo.

[chenpei] https://issues.apache.org/jira/browse/CTAKES-54
Fixed the paths to the toy/dummy dictionaries

[chenpei] https://issues.apache.org/jira/browse/CTAKES-73
Fixed typo in ciManagement URL

------------------------------------------
[...truncated 3090 lines...]
[INFO] 
[INFO] --- build-helper-maven-plugin:1.7:add-source (add-jcasgen-sources-ctakes-pad-term-spotter)
@ ctakes-pad-term-spotter ---
mojoSucceeded org.codehaus.mojo:build-helper-maven-plugin:1.7(add-jcasgen-sources-ctakes-pad-term-spotter)
mojoStarted org.apache.maven.plugins:maven-compiler-plugin:2.4(default-compile)
[INFO] 
[INFO] --- maven-compiler-plugin:2.4:compile (default-compile) @ ctakes-pad-term-spotter ---
[INFO] Compiling 208 source files to <https://builds.apache.org/job/cTAKES-trunk/ws/ctakes-pad-term-spotter/target/classes>
mojoSucceeded org.apache.maven.plugins:maven-compiler-plugin:2.4(default-compile)
mojoStarted org.apache.maven.plugins:maven-resources-plugin:2.5(default-testResources)[debug]
execute contextualize
[INFO] Using 'UTF-8' encoding to copy filtered resources.
[INFO] skip non existing resourceDirectory <https://builds.apache.org/job/cTAKES-trunk/ws/ctakes-pad-term-spotter/src/test/resources>

[INFO] 
[INFO] --- maven-resources-plugin:2.5:testResources (default-testResources) @ ctakes-pad-term-spotter
---
mojoSucceeded org.apache.maven.plugins:maven-resources-plugin:2.5(default-testResources)
mojoStarted org.apache.maven.plugins:maven-compiler-plugin:2.4(default-testCompile)[INFO]
No sources to compile

[INFO] 
[INFO] --- maven-compiler-plugin:2.4:testCompile (default-testCompile) @ ctakes-pad-term-spotter
---
mojoSucceeded org.apache.maven.plugins:maven-compiler-plugin:2.4(default-testCompile)
mojoStarted org.apache.maven.plugins:maven-surefire-plugin:2.12(default-test)[INFO] Surefire
report directory: <https://builds.apache.org/job/cTAKES-trunk/ws/ctakes-pad-term-spotter/target/surefire-reports>


-------------------------------------------------------
 T E S T S
-------------------------------------------------------
[INFO] 
[INFO] --- maven-surefire-plugin:2.12:test (default-test) @ ctakes-pad-term-spotter ---

Results :

Tests run: 0, Failures: 0, Errors: 0, Skipped: 0

mojoSucceeded org.apache.maven.plugins:maven-surefire-plugin:2.12(default-test)
[JENKINS] Recording test results
mojoStarted org.apache.maven.plugins:maven-jar-plugin:2.4(default-jar)
[INFO] 
[INFO] --- maven-jar-plugin:2.4:jar (default-jar) @ ctakes-pad-term-spotter ---
[INFO] Building jar: <https://builds.apache.org/job/cTAKES-trunk/ws/ctakes-pad-term-spotter/target/ctakes-pad-term-spotter-3.0.0-incubating-SNAPSHOT.jar>
mojoSucceeded org.apache.maven.plugins:maven-jar-plugin:2.4(default-jar)
mojoStarted org.apache.maven.plugins:maven-install-plugin:2.3.1(default-install)[INFO] Installing
<https://builds.apache.org/job/cTAKES-trunk/ws/ctakes-pad-term-spotter/target/ctakes-pad-term-spotter-3.0.0-incubating-SNAPSHOT.jar>
to /home/jenkins/jenkins-slave/maven-repositories/0/org/apache/ctakes/ctakes-pad-term-spotter/3.0.0-incubating-SNAPSHOT/ctakes-pad-term-spotter-3.0.0-incubating-SNAPSHOT.jar

[INFO] 
[INFO] --- maven-install-plugin:2.3.1:install (default-install) @ ctakes-pad-term-spotter
---
[INFO] Installing <https://builds.apache.org/job/cTAKES-trunk/ws/ctakes-pad-term-spotter/pom.xml>
to /home/jenkins/jenkins-slave/maven-repositories/0/org/apache/ctakes/ctakes-pad-term-spotter/3.0.0-incubating-SNAPSHOT/ctakes-pad-term-spotter-3.0.0-incubating-SNAPSHOT.pom
mojoSucceeded org.apache.maven.plugins:maven-install-plugin:2.3.1(default-install)
projectSucceeded org.apache.ctakes:ctakes-pad-term-spotter:3.0.0-incubating-SNAPSHOT
projectStarted org.apache.ctakes:ctakes-temporal:3.0.0-incubating-SNAPSHOT
[INFO]                                                                         
[INFO] ------------------------------------------------------------------------
[INFO] Building Apache cTAKES Temporal Information Extraction 3.0.0-incubating-SNAPSHOT
[INFO] ------------------------------------------------------------------------
mojoStarted org.apache.maven.plugins:maven-resources-plugin:2.5(default-resources)[debug]
execute contextualize
[INFO] Using 'UTF-8' encoding to copy filtered resources.
[INFO] skip non existing resourceDirectory <https://builds.apache.org/job/cTAKES-trunk/ws/ctakes-temporal/src/main/resources>

[INFO] 
[INFO] --- maven-resources-plugin:2.5:resources (default-resources) @ ctakes-temporal ---
mojoSucceeded org.apache.maven.plugins:maven-resources-plugin:2.5(default-resources)
mojoStarted org.apache.maven.plugins:maven-compiler-plugin:2.4(default-compile)
[INFO] 
[INFO] --- maven-compiler-plugin:2.4:compile (default-compile) @ ctakes-temporal ---
[INFO] Nothing to compile - all classes are up to date
mojoSucceeded org.apache.maven.plugins:maven-compiler-plugin:2.4(default-compile)
[debug] execute contextualize
mojoStarted org.apache.maven.plugins:maven-resources-plugin:2.5(default-testResources)[INFO]
Using 'UTF-8' encoding to copy filtered resources.

[INFO] [INFO] skip non existing resourceDirectory <https://builds.apache.org/job/cTAKES-trunk/ws/ctakes-temporal/src/test/resources>

[INFO] --- maven-resources-plugin:2.5:testResources (default-testResources) @ ctakes-temporal
---
mojoSucceeded org.apache.maven.plugins:maven-resources-plugin:2.5(default-testResources)
mojoStarted org.apache.maven.plugins:maven-compiler-plugin:2.4(default-testCompile)[INFO]
No sources to compile

[INFO] 
[INFO] --- maven-compiler-plugin:2.4:testCompile (default-testCompile) @ ctakes-temporal ---
mojoSucceeded org.apache.maven.plugins:maven-compiler-plugin:2.4(default-testCompile)
mojoStarted org.apache.maven.plugins:maven-surefire-plugin:2.12(default-test)[INFO] Surefire
report directory: <https://builds.apache.org/job/cTAKES-trunk/ws/ctakes-temporal/target/surefire-reports>

[INFO] 
-------------------------------------------------------
 T E S T S
-------------------------------------------------------

[INFO] --- maven-surefire-plugin:2.12:test (default-test) @ ctakes-temporal ---

Results :

Tests run: 0, Failures: 0, Errors: 0, Skipped: 0

mojoSucceeded org.apache.maven.plugins:maven-surefire-plugin:2.12(default-test)
[JENKINS] Recording test results
mojoStarted org.apache.maven.plugins:maven-jar-plugin:2.4(default-jar)
[INFO] 
[INFO] --- maven-jar-plugin:2.4:jar (default-jar) @ ctakes-temporal ---
mojoSucceeded org.apache.maven.plugins:maven-jar-plugin:2.4(default-jar)
mojoStarted org.apache.maven.plugins:maven-install-plugin:2.3.1(default-install)[INFO] Installing
<https://builds.apache.org/job/cTAKES-trunk/ws/ctakes-temporal/target/ctakes-temporal-3.0.0-incubating-SNAPSHOT.jar>
to /home/jenkins/jenkins-slave/maven-repositories/0/org/apache/ctakes/ctakes-temporal/3.0.0-incubating-SNAPSHOT/ctakes-temporal-3.0.0-incubating-SNAPSHOT.jar

[INFO] 
[INFO] --- maven-install-plugin:2.3.1:install (default-install) @ ctakes-temporal ---
[INFO] Installing <https://builds.apache.org/job/cTAKES-trunk/ws/ctakes-temporal/pom.xml>
to /home/jenkins/jenkins-slave/maven-repositories/0/org/apache/ctakes/ctakes-temporal/3.0.0-incubating-SNAPSHOT/ctakes-temporal-3.0.0-incubating-SNAPSHOT.pom
mojoSucceeded org.apache.maven.plugins:maven-install-plugin:2.3.1(default-install)
projectSucceeded org.apache.ctakes:ctakes-temporal:3.0.0-incubating-SNAPSHOT
projectStarted org.apache.ctakes:ctakes-distribution:3.0.0-incubating-SNAPSHOT
[INFO]                                                                         
[INFO] ------------------------------------------------------------------------
[INFO] Building Apache cTAKES Distribution 3.0.0-incubating-SNAPSHOT
[INFO] ------------------------------------------------------------------------
mojoStarted org.apache.maven.plugins:maven-assembly-plugin:2.3(bundle-project-sources)
[INFO] 
[INFO] --- maven-assembly-plugin:2.3:single (bundle-project-sources) @ ctakes-distribution
---
[INFO] Reading assembly descriptor: src/main/assembly/bin.xml
mojoFailed org.apache.maven.plugins:maven-assembly-plugin:2.3(bundle-project-sources)
projectFailed org.apache.ctakes:ctakes-distribution:3.0.0-incubating-SNAPSHOT
sessionEnded
[INFO] ------------------------------------------------------------------------
[INFO] Reactor Summary:
[INFO] 
[INFO] Apache cTAKES ..................................... SUCCESS [3.812s]
[INFO] Apache cTAKES common type system .................. SUCCESS [7.287s]
[INFO] Apache cTAKES utils ............................... SUCCESS [1.096s]
[INFO] Apache cTAKES core ................................ SUCCESS [5.580s]
[INFO] Apache cTAKES part-of-speech tagger ............... SUCCESS [2.974s]
[INFO] Apache cTAKES chunker ............................. SUCCESS [1.419s]
[INFO] Apache cTAKES document preprocessor ............... SUCCESS [1.302s]
[INFO] Apache cTAKES dictionary lookup ................... SUCCESS [4.298s]
[INFO] Apache cTAKES context dependent tokenizer ......... SUCCESS [0.842s]
[INFO] Apache cTAKES LVG lexical tools ................... SUCCESS [1.034s]
[INFO] Apache cTAKES named entity contexts ............... SUCCESS [1.894s]
[INFO] Apache cTAKES Constituency Parser ................. SUCCESS [6.678s]
[INFO] Apache cTAKES CoReference Resolver ................ SUCCESS [2.020s]
[INFO] Apache cTAKES Drug NER ............................ SUCCESS [4.840s]
[INFO] Apache cTAKES Side Effects ........................ SUCCESS [3.428s]
[INFO] Apache cTAKES Smoking Status ...................... SUCCESS [3.752s]
[INFO] Apache cTAKES Dependency Parser ................... SUCCESS [6.398s]
[INFO] Apache cTAKES Assertion ........................... SUCCESS [8.207s]
[INFO] Apache cTAKES ctakes-clinical-pipeline ............ SUCCESS [4.082s]
[INFO] Apache cTAKES Relation Extractor .................. SUCCESS [4.342s]
[INFO] Apache cTAKES Pad Term Spotter .................... SUCCESS [3.270s]
[INFO] Apache cTAKES Temporal Information Extraction ..... SUCCESS [4.563s]
[INFO] Apache cTAKES Distribution ........................ FAILURE [0.547s]
[INFO] ------------------------------------------------------------------------
[INFO] BUILD FAILURE
[INFO] ------------------------------------------------------------------------
[INFO] Total time: 1:25.758s
[INFO] Finished at: Sat Oct 20 07:34:53 UTC 2012
[INFO] Final Memory: 25M/86M
[INFO] ------------------------------------------------------------------------
Projects to build: [MavenProject: org.apache.ctakes:ctakes:3.0.0-incubating-SNAPSHOT @ <https://builds.apache.org/job/cTAKES-trunk/ws/pom.xml,>
MavenProject: org.apache.ctakes:ctakes-type-system:3.0.0-incubating-SNAPSHOT @ <https://builds.apache.org/job/cTAKES-trunk/ws/ctakes-type-system/pom.xml,>
MavenProject: org.apache.ctakes:ctakes-utils:3.0.0-incubating-SNAPSHOT @ <https://builds.apache.org/job/cTAKES-trunk/ws/ctakes-utils/pom.xml,>
MavenProject: org.apache.ctakes:ctakes-core:3.0.0-incubating-SNAPSHOT @ <https://builds.apache.org/job/cTAKES-trunk/ws/ctakes-core/pom.xml,>
MavenProject: org.apache.ctakes:ctakes-pos-tagger:3.0.0-incubating-SNAPSHOT @ <https://builds.apache.org/job/cTAKES-trunk/ws/ctakes-pos-tagger/pom.xml,>
MavenProject: org.apache.ctakes:ctakes-chunker:3.0.0-incubating-SNAPSHOT @ <https://builds.apache.org/job/cTAKES-trunk/ws/ctakes-chunker/pom.xml,>
MavenProject: org.apache.ctakes:ctakes-preprocessor:3.0.0-incubating-SNAPSHOT @ <https://builds.apache.org/job/cTAKES-trunk/ws/ctakes-preprocessor/pom.xml,>
MavenProject: org.apache.ctakes:ctakes-dictionary-lookup:3.0.0-incubating-SNAPSHOT @ <https://builds.apache.org/job/cTAKES-trunk/ws/ctakes-dictionary-lookup/pom.xml,>
MavenProject: org.apache.ctakes:ctakes-context-tokenizer:3.0.0-incubating-SNAPSHOT @ <https://builds.apache.org/job/cTAKES-trunk/ws/ctakes-context-tokenizer/pom.xml,>
MavenProject: org.apache.ctakes:ctakes-lvg:3.0.0-incubating-SNAPSHOT @ <https://builds.apache.org/job/cTAKES-trunk/ws/ctakes-lvg/pom.xml,>
MavenProject: org.apache.ctakes:ctakes-ne-contexts:3.0.0-incubating-SNAPSHOT @ <https://builds.apache.org/job/cTAKES-trunk/ws/ctakes-ne-contexts/pom.xml,>
MavenProject: org.apache.ctakes:ctakes-constituency-parser:3.0.0-incubating-SNAPSHOT @ <https://builds.apache.org/job/cTAKES-trunk/ws/ctakes-constituency-parser/pom.xml,>
MavenProject: org.apache.ctakes:ctakes-coreference:3.0.0-incubating-SNAPSHOT @ <https://builds.apache.org/job/cTAKES-trunk/ws/ctakes-coreference/pom.xml,>
MavenProject: org.apache.ctakes:ctakes-drug-ner:3.0.0-incubating-SNAPSHOT @ <https://builds.apache.org/job/cTAKES-trunk/ws/ctakes-drug-ner/pom.xml,>
MavenProject: org.apache.ctakes:ctakes-side-effect:3.0.0-incubating-SNAPSHOT @ <https://builds.apache.org/job/cTAKES-trunk/ws/ctakes-side-effect/pom.xml,>
MavenProject: org.apache.ctakes:ctakes-smoking-status:3.0.0-incubating-SNAPSHOT @ <https://builds.apache.org/job/cTAKES-trunk/ws/ctakes-smoking-status/pom.xml,>
MavenProject: org.apache.ctakes:ctakes-dependency-parser:3.0.0-incubating-SNAPSHOT @ <https://builds.apache.org/job/cTAKES-trunk/ws/ctakes-dependency-parser/pom.xml,>
MavenProject: org.apache.ctakes:ctakes-assertion:3.0.0-incubating-SNAPSHOT @ <https://builds.apache.org/job/cTAKES-trunk/ws/ctakes-assertion/pom.xml,>
MavenProject: org.apache.ctakes:ctakes-clinical-pipeline:3.0.0-incubating-SNAPSHOT @ <https://builds.apache.org/job/cTAKES-trunk/ws/ctakes-clinical-pipeline/pom.xml,>
MavenProject: org.apache.ctakes:ctakes-relation-extractor:3.0.0-incubating-SNAPSHOT @ <https://builds.apache.org/job/cTAKES-trunk/ws/ctakes-relation-extractor/pom.xml,>
MavenProject: org.apache.ctakes:ctakes-pad-term-spotter:3.0.0-incubating-SNAPSHOT @ <https://builds.apache.org/job/cTAKES-trunk/ws/ctakes-pad-term-spotter/pom.xml,>
MavenProject: org.apache.ctakes:ctakes-temporal:3.0.0-incubating-SNAPSHOT @ <https://builds.apache.org/job/cTAKES-trunk/ws/ctakes-temporal/pom.xml,>
MavenProject: org.apache.ctakes:ctakes-distribution:3.0.0-incubating-SNAPSHOT @ <https://builds.apache.org/job/cTAKES-trunk/ws/ctakes-distribution/pom.xml]>
[JENKINS] Archiving <https://builds.apache.org/job/cTAKES-trunk/ws/ctakes-context-tokenizer/pom.xml>
to /home/hudson/hudson/jobs/cTAKES-trunk/modules/org.apache.ctakes$ctakes-context-tokenizer/builds/2012-10-20_07-33-22/archive/org.apache.ctakes/ctakes-context-tokenizer/3.0.0-incubating-SNAPSHOT/ctakes-context-tokenizer-3.0.0-incubating-SNAPSHOT.pom
[JENKINS] Archiving <https://builds.apache.org/job/cTAKES-trunk/ws/ctakes-context-tokenizer/target/ctakes-context-tokenizer-3.0.0-incubating-SNAPSHOT.jar>
to /home/hudson/hudson/jobs/cTAKES-trunk/modules/org.apache.ctakes$ctakes-context-tokenizer/builds/2012-10-20_07-33-22/archive/org.apache.ctakes/ctakes-context-tokenizer/3.0.0-incubating-SNAPSHOT/ctakes-context-tokenizer-3.0.0-incubating-SNAPSHOT.jar
[JENKINS] Archiving <https://builds.apache.org/job/cTAKES-trunk/ws/ctakes-drug-ner/pom.xml>
to /home/hudson/hudson/jobs/cTAKES-trunk/modules/org.apache.ctakes$ctakes-drug-ner/builds/2012-10-20_07-33-22/archive/org.apache.ctakes/ctakes-drug-ner/3.0.0-incubating-SNAPSHOT/ctakes-drug-ner-3.0.0-incubating-SNAPSHOT.pom
[JENKINS] Archiving <https://builds.apache.org/job/cTAKES-trunk/ws/ctakes-drug-ner/target/ctakes-drug-ner-3.0.0-incubating-SNAPSHOT.jar>
to /home/hudson/hudson/jobs/cTAKES-trunk/modules/org.apache.ctakes$ctakes-drug-ner/builds/2012-10-20_07-33-22/archive/org.apache.ctakes/ctakes-drug-ner/3.0.0-incubating-SNAPSHOT/ctakes-drug-ner-3.0.0-incubating-SNAPSHOT.jar
[JENKINS] Archiving <https://builds.apache.org/job/cTAKES-trunk/ws/ctakes-type-system/pom.xml>
to /home/hudson/hudson/jobs/cTAKES-trunk/modules/org.apache.ctakes$ctakes-type-system/builds/2012-10-20_07-33-22/archive/org.apache.ctakes/ctakes-type-system/3.0.0-incubating-SNAPSHOT/ctakes-type-system-3.0.0-incubating-SNAPSHOT.pom
[JENKINS] Archiving <https://builds.apache.org/job/cTAKES-trunk/ws/ctakes-type-system/target/ctakes-type-system-3.0.0-incubating-SNAPSHOT.jar>
to /home/hudson/hudson/jobs/cTAKES-trunk/modules/org.apache.ctakes$ctakes-type-system/builds/2012-10-20_07-33-22/archive/org.apache.ctakes/ctakes-type-system/3.0.0-incubating-SNAPSHOT/ctakes-type-system-3.0.0-incubating-SNAPSHOT.jar
[JENKINS] Archiving <https://builds.apache.org/job/cTAKES-trunk/ws/ctakes-constituency-parser/pom.xml>
to /home/hudson/hudson/jobs/cTAKES-trunk/modules/org.apache.ctakes$ctakes-constituency-parser/builds/2012-10-20_07-33-22/archive/org.apache.ctakes/ctakes-constituency-parser/3.0.0-incubating-SNAPSHOT/ctakes-constituency-parser-3.0.0-incubating-SNAPSHOT.pom
[JENKINS] Archiving <https://builds.apache.org/job/cTAKES-trunk/ws/ctakes-constituency-parser/target/ctakes-constituency-parser-3.0.0-incubating-SNAPSHOT.jar>
to /home/hudson/hudson/jobs/cTAKES-trunk/modules/org.apache.ctakes$ctakes-constituency-parser/builds/2012-10-20_07-33-22/archive/org.apache.ctakes/ctakes-constituency-parser/3.0.0-incubating-SNAPSHOT/ctakes-constituency-parser-3.0.0-incubating-SNAPSHOT.jar
[JENKINS] Archiving <https://builds.apache.org/job/cTAKES-trunk/ws/ctakes-chunker/pom.xml>
to /home/hudson/hudson/jobs/cTAKES-trunk/modules/org.apache.ctakes$ctakes-chunker/builds/2012-10-20_07-33-22/archive/org.apache.ctakes/ctakes-chunker/3.0.0-incubating-SNAPSHOT/ctakes-chunker-3.0.0-incubating-SNAPSHOT.pom
[JENKINS] Archiving <https://builds.apache.org/job/cTAKES-trunk/ws/ctakes-chunker/target/ctakes-chunker-3.0.0-incubating-SNAPSHOT.jar>
to /home/hudson/hudson/jobs/cTAKES-trunk/modules/org.apache.ctakes$ctakes-chunker/builds/2012-10-20_07-33-22/archive/org.apache.ctakes/ctakes-chunker/3.0.0-incubating-SNAPSHOT/ctakes-chunker-3.0.0-incubating-SNAPSHOT.jar
[JENKINS] Archiving <https://builds.apache.org/job/cTAKES-trunk/ws/ctakes-dictionary-lookup/pom.xml>
to /home/hudson/hudson/jobs/cTAKES-trunk/modules/org.apache.ctakes$ctakes-dictionary-lookup/builds/2012-10-20_07-33-22/archive/org.apache.ctakes/ctakes-dictionary-lookup/3.0.0-incubating-SNAPSHOT/ctakes-dictionary-lookup-3.0.0-incubating-SNAPSHOT.pom
[JENKINS] Archiving <https://builds.apache.org/job/cTAKES-trunk/ws/ctakes-dictionary-lookup/target/ctakes-dictionary-lookup-3.0.0-incubating-SNAPSHOT.jar>
to /home/hudson/hudson/jobs/cTAKES-trunk/modules/org.apache.ctakes$ctakes-dictionary-lookup/builds/2012-10-20_07-33-22/archive/org.apache.ctakes/ctakes-dictionary-lookup/3.0.0-incubating-SNAPSHOT/ctakes-dictionary-lookup-3.0.0-incubating-SNAPSHOT.jar
[JENKINS] Archiving <https://builds.apache.org/job/cTAKES-trunk/ws/ctakes-ne-contexts/pom.xml>
to /home/hudson/hudson/jobs/cTAKES-trunk/modules/org.apache.ctakes$ctakes-ne-contexts/builds/2012-10-20_07-33-22/archive/org.apache.ctakes/ctakes-ne-contexts/3.0.0-incubating-SNAPSHOT/ctakes-ne-contexts-3.0.0-incubating-SNAPSHOT.pom
[JENKINS] Archiving <https://builds.apache.org/job/cTAKES-trunk/ws/ctakes-ne-contexts/target/ctakes-ne-contexts-3.0.0-incubating-SNAPSHOT.jar>
to /home/hudson/hudson/jobs/cTAKES-trunk/modules/org.apache.ctakes$ctakes-ne-contexts/builds/2012-10-20_07-33-22/archive/org.apache.ctakes/ctakes-ne-contexts/3.0.0-incubating-SNAPSHOT/ctakes-ne-contexts-3.0.0-incubating-SNAPSHOT.jar
[JENKINS] Archiving <https://builds.apache.org/job/cTAKES-trunk/ws/ctakes-lvg/pom.xml>
to /home/hudson/hudson/jobs/cTAKES-trunk/modules/org.apache.ctakes$ctakes-lvg/builds/2012-10-20_07-33-22/archive/org.apache.ctakes/ctakes-lvg/3.0.0-incubating-SNAPSHOT/ctakes-lvg-3.0.0-incubating-SNAPSHOT.pom
[JENKINS] Archiving <https://builds.apache.org/job/cTAKES-trunk/ws/ctakes-lvg/target/ctakes-lvg-3.0.0-incubating-SNAPSHOT.jar>
to /home/hudson/hudson/jobs/cTAKES-trunk/modules/org.apache.ctakes$ctakes-lvg/builds/2012-10-20_07-33-22/archive/org.apache.ctakes/ctakes-lvg/3.0.0-incubating-SNAPSHOT/ctakes-lvg-3.0.0-incubating-SNAPSHOT.jar
[JENKINS] Archiving <https://builds.apache.org/job/cTAKES-trunk/ws/ctakes-core/pom.xml>
to /home/hudson/hudson/jobs/cTAKES-trunk/modules/org.apache.ctakes$ctakes-core/builds/2012-10-20_07-33-22/archive/org.apache.ctakes/ctakes-core/3.0.0-incubating-SNAPSHOT/ctakes-core-3.0.0-incubating-SNAPSHOT.pom
[JENKINS] Archiving <https://builds.apache.org/job/cTAKES-trunk/ws/ctakes-core/target/ctakes-core-3.0.0-incubating-SNAPSHOT.jar>
to /home/hudson/hudson/jobs/cTAKES-trunk/modules/org.apache.ctakes$ctakes-core/builds/2012-10-20_07-33-22/archive/org.apache.ctakes/ctakes-core/3.0.0-incubating-SNAPSHOT/ctakes-core-3.0.0-incubating-SNAPSHOT.jar
[JENKINS] Archiving <https://builds.apache.org/job/cTAKES-trunk/ws/ctakes-core/target/ctakes-core-3.0.0-incubating-SNAPSHOT-tests.jar>
to /home/hudson/hudson/jobs/cTAKES-trunk/modules/org.apache.ctakes$ctakes-core/builds/2012-10-20_07-33-22/archive/org.apache.ctakes/ctakes-core/3.0.0-incubating-SNAPSHOT/ctakes-core-3.0.0-incubating-SNAPSHOT-tests.jar
[JENKINS] Archiving <https://builds.apache.org/job/cTAKES-trunk/ws/ctakes-pos-tagger/pom.xml>
to /home/hudson/hudson/jobs/cTAKES-trunk/modules/org.apache.ctakes$ctakes-pos-tagger/builds/2012-10-20_07-33-22/archive/org.apache.ctakes/ctakes-pos-tagger/3.0.0-incubating-SNAPSHOT/ctakes-pos-tagger-3.0.0-incubating-SNAPSHOT.pom
[JENKINS] Archiving <https://builds.apache.org/job/cTAKES-trunk/ws/ctakes-pos-tagger/target/ctakes-pos-tagger-3.0.0-incubating-SNAPSHOT.jar>
to /home/hudson/hudson/jobs/cTAKES-trunk/modules/org.apache.ctakes$ctakes-pos-tagger/builds/2012-10-20_07-33-22/archive/org.apache.ctakes/ctakes-pos-tagger/3.0.0-incubating-SNAPSHOT/ctakes-pos-tagger-3.0.0-incubating-SNAPSHOT.jar
[JENKINS] Archiving <https://builds.apache.org/job/cTAKES-trunk/ws/ctakes-pad-term-spotter/pom.xml>
to /home/hudson/hudson/jobs/cTAKES-trunk/modules/org.apache.ctakes$ctakes-pad-term-spotter/builds/2012-10-20_07-33-22/archive/org.apache.ctakes/ctakes-pad-term-spotter/3.0.0-incubating-SNAPSHOT/ctakes-pad-term-spotter-3.0.0-incubating-SNAPSHOT.pom
[JENKINS] Archiving <https://builds.apache.org/job/cTAKES-trunk/ws/ctakes-pad-term-spotter/target/ctakes-pad-term-spotter-3.0.0-incubating-SNAPSHOT.jar>
to /home/hudson/hudson/jobs/cTAKES-trunk/modules/org.apache.ctakes$ctakes-pad-term-spotter/builds/2012-10-20_07-33-22/archive/org.apache.ctakes/ctakes-pad-term-spotter/3.0.0-incubating-SNAPSHOT/ctakes-pad-term-spotter-3.0.0-incubating-SNAPSHOT.jar
[JENKINS] Archiving <https://builds.apache.org/job/cTAKES-trunk/ws/ctakes-distribution/pom.xml>
to /home/hudson/hudson/jobs/cTAKES-trunk/modules/org.apache.ctakes$ctakes-distribution/builds/2012-10-20_07-33-22/archive/org.apache.ctakes/ctakes-distribution/3.0.0-incubating-SNAPSHOT/ctakes-distribution-3.0.0-incubating-SNAPSHOT.pom
[JENKINS] Archiving <https://builds.apache.org/job/cTAKES-trunk/ws/ctakes-dependency-parser/pom.xml>
to /home/hudson/hudson/jobs/cTAKES-trunk/modules/org.apache.ctakes$ctakes-dependency-parser/builds/2012-10-20_07-33-22/archive/org.apache.ctakes/ctakes-dependency-parser/3.0.0-incubating-SNAPSHOT/ctakes-dependency-parser-3.0.0-incubating-SNAPSHOT.pom
[JENKINS] Archiving <https://builds.apache.org/job/cTAKES-trunk/ws/ctakes-dependency-parser/target/ctakes-dependency-parser-3.0.0-incubating-SNAPSHOT.jar>
to /home/hudson/hudson/jobs/cTAKES-trunk/modules/org.apache.ctakes$ctakes-dependency-parser/builds/2012-10-20_07-33-22/archive/org.apache.ctakes/ctakes-dependency-parser/3.0.0-incubating-SNAPSHOT/ctakes-dependency-parser-3.0.0-incubating-SNAPSHOT.jar
[JENKINS] Archiving <https://builds.apache.org/job/cTAKES-trunk/ws/ctakes-clinical-pipeline/pom.xml>
to /home/hudson/hudson/jobs/cTAKES-trunk/modules/org.apache.ctakes$ctakes-clinical-pipeline/builds/2012-10-20_07-33-22/archive/org.apache.ctakes/ctakes-clinical-pipeline/3.0.0-incubating-SNAPSHOT/ctakes-clinical-pipeline-3.0.0-incubating-SNAPSHOT.pom
[JENKINS] Archiving <https://builds.apache.org/job/cTAKES-trunk/ws/ctakes-clinical-pipeline/target/ctakes-clinical-pipeline-3.0.0-incubating-SNAPSHOT.jar>
to /home/hudson/hudson/jobs/cTAKES-trunk/modules/org.apache.ctakes$ctakes-clinical-pipeline/builds/2012-10-20_07-33-22/archive/org.apache.ctakes/ctakes-clinical-pipeline/3.0.0-incubating-SNAPSHOT/ctakes-clinical-pipeline-3.0.0-incubating-SNAPSHOT.jar
[JENKINS] Archiving <https://builds.apache.org/job/cTAKES-trunk/ws/ctakes-assertion/pom.xml>
to /home/hudson/hudson/jobs/cTAKES-trunk/modules/org.apache.ctakes$ctakes-assertion/builds/2012-10-20_07-33-22/archive/org.apache.ctakes/ctakes-assertion/3.0.0-incubating-SNAPSHOT/ctakes-assertion-3.0.0-incubating-SNAPSHOT.pom
[JENKINS] Archiving <https://builds.apache.org/job/cTAKES-trunk/ws/ctakes-assertion/target/ctakes-assertion-3.0.0-incubating-SNAPSHOT.jar>
to /home/hudson/hudson/jobs/cTAKES-trunk/modules/org.apache.ctakes$ctakes-assertion/builds/2012-10-20_07-33-22/archive/org.apache.ctakes/ctakes-assertion/3.0.0-incubating-SNAPSHOT/ctakes-assertion-3.0.0-incubating-SNAPSHOT.jar
[JENKINS] Archiving <https://builds.apache.org/job/cTAKES-trunk/ws/ctakes-coreference/pom.xml>
to /home/hudson/hudson/jobs/cTAKES-trunk/modules/org.apache.ctakes$ctakes-coreference/builds/2012-10-20_07-33-22/archive/org.apache.ctakes/ctakes-coreference/3.0.0-incubating-SNAPSHOT/ctakes-coreference-3.0.0-incubating-SNAPSHOT.pom
[JENKINS] Archiving <https://builds.apache.org/job/cTAKES-trunk/ws/ctakes-coreference/target/ctakes-coreference-3.0.0-incubating-SNAPSHOT.jar>
to /home/hudson/hudson/jobs/cTAKES-trunk/modules/org.apache.ctakes$ctakes-coreference/builds/2012-10-20_07-33-22/archive/org.apache.ctakes/ctakes-coreference/3.0.0-incubating-SNAPSHOT/ctakes-coreference-3.0.0-incubating-SNAPSHOT.jar
[JENKINS] Archiving <https://builds.apache.org/job/cTAKES-trunk/ws/pom.xml> to /home/hudson/hudson/jobs/cTAKES-trunk/modules/org.apache.ctakes$ctakes/builds/2012-10-20_07-33-22/archive/org.apache.ctakes/ctakes/3.0.0-incubating-SNAPSHOT/ctakes-3.0.0-incubating-SNAPSHOT.pom
[JENKINS] Archiving <https://builds.apache.org/job/cTAKES-trunk/ws/ctakes-relation-extractor/pom.xml>
to /home/hudson/hudson/jobs/cTAKES-trunk/modules/org.apache.ctakes$ctakes-relation-extractor/builds/2012-10-20_07-33-22/archive/org.apache.ctakes/ctakes-relation-extractor/3.0.0-incubating-SNAPSHOT/ctakes-relation-extractor-3.0.0-incubating-SNAPSHOT.pom
[JENKINS] Archiving <https://builds.apache.org/job/cTAKES-trunk/ws/ctakes-relation-extractor/target/ctakes-relation-extractor-3.0.0-incubating-SNAPSHOT.jar>
to /home/hudson/hudson/jobs/cTAKES-trunk/modules/org.apache.ctakes$ctakes-relation-extractor/builds/2012-10-20_07-33-22/archive/org.apache.ctakes/ctakes-relation-extractor/3.0.0-incubating-SNAPSHOT/ctakes-relation-extractor-3.0.0-incubating-SNAPSHOT.jar
[JENKINS] Archiving <https://builds.apache.org/job/cTAKES-trunk/ws/ctakes-preprocessor/pom.xml>
to /home/hudson/hudson/jobs/cTAKES-trunk/modules/org.apache.ctakes$ctakes-preprocessor/builds/2012-10-20_07-33-22/archive/org.apache.ctakes/ctakes-preprocessor/3.0.0-incubating-SNAPSHOT/ctakes-preprocessor-3.0.0-incubating-SNAPSHOT.pom
[JENKINS] Archiving <https://builds.apache.org/job/cTAKES-trunk/ws/ctakes-preprocessor/target/ctakes-preprocessor-3.0.0-incubating-SNAPSHOT.jar>
to /home/hudson/hudson/jobs/cTAKES-trunk/modules/org.apache.ctakes$ctakes-preprocessor/builds/2012-10-20_07-33-22/archive/org.apache.ctakes/ctakes-preprocessor/3.0.0-incubating-SNAPSHOT/ctakes-preprocessor-3.0.0-incubating-SNAPSHOT.jar
[JENKINS] Archiving <https://builds.apache.org/job/cTAKES-trunk/ws/ctakes-temporal/pom.xml>
to /home/hudson/hudson/jobs/cTAKES-trunk/modules/org.apache.ctakes$ctakes-temporal/builds/2012-10-20_07-33-22/archive/org.apache.ctakes/ctakes-temporal/3.0.0-incubating-SNAPSHOT/ctakes-temporal-3.0.0-incubating-SNAPSHOT.pom
[JENKINS] Archiving <https://builds.apache.org/job/cTAKES-trunk/ws/ctakes-temporal/target/ctakes-temporal-3.0.0-incubating-SNAPSHOT.jar>
to /home/hudson/hudson/jobs/cTAKES-trunk/modules/org.apache.ctakes$ctakes-temporal/builds/2012-10-20_07-33-22/archive/org.apache.ctakes/ctakes-temporal/3.0.0-incubating-SNAPSHOT/ctakes-temporal-3.0.0-incubating-SNAPSHOT.jar
[JENKINS] Archiving <https://builds.apache.org/job/cTAKES-trunk/ws/ctakes-utils/pom.xml>
to /home/hudson/hudson/jobs/cTAKES-trunk/modules/org.apache.ctakes$ctakes-utils/builds/2012-10-20_07-33-22/archive/org.apache.ctakes/ctakes-utils/3.0.0-incubating-SNAPSHOT/ctakes-utils-3.0.0-incubating-SNAPSHOT.pom
[JENKINS] Archiving <https://builds.apache.org/job/cTAKES-trunk/ws/ctakes-utils/target/ctakes-utils-3.0.0-incubating-SNAPSHOT.jar>
to /home/hudson/hudson/jobs/cTAKES-trunk/modules/org.apache.ctakes$ctakes-utils/builds/2012-10-20_07-33-22/archive/org.apache.ctakes/ctakes-utils/3.0.0-incubating-SNAPSHOT/ctakes-utils-3.0.0-incubating-SNAPSHOT.jar
[JENKINS] Archiving <https://builds.apache.org/job/cTAKES-trunk/ws/ctakes-side-effect/pom.xml>
to /home/hudson/hudson/jobs/cTAKES-trunk/modules/org.apache.ctakes$ctakes-side-effect/builds/2012-10-20_07-33-22/archive/org.apache.ctakes/ctakes-side-effect/3.0.0-incubating-SNAPSHOT/ctakes-side-effect-3.0.0-incubating-SNAPSHOT.pom
[JENKINS] Archiving <https://builds.apache.org/job/cTAKES-trunk/ws/ctakes-side-effect/target/ctakes-side-effect-3.0.0-incubating-SNAPSHOT.jar>
to /home/hudson/hudson/jobs/cTAKES-trunk/modules/org.apache.ctakes$ctakes-side-effect/builds/2012-10-20_07-33-22/archive/org.apache.ctakes/ctakes-side-effect/3.0.0-incubating-SNAPSHOT/ctakes-side-effect-3.0.0-incubating-SNAPSHOT.jar
[JENKINS] Archiving <https://builds.apache.org/job/cTAKES-trunk/ws/ctakes-smoking-status/pom.xml>
to /home/hudson/hudson/jobs/cTAKES-trunk/modules/org.apache.ctakes$ctakes-smoking-status/builds/2012-10-20_07-33-22/archive/org.apache.ctakes/ctakes-smoking-status/3.0.0-incubating-SNAPSHOT/ctakes-smoking-status-3.0.0-incubating-SNAPSHOT.pom
[JENKINS] Archiving <https://builds.apache.org/job/cTAKES-trunk/ws/ctakes-smoking-status/target/ctakes-smoking-status-3.0.0-incubating-SNAPSHOT.jar>
to /home/hudson/hudson/jobs/cTAKES-trunk/modules/org.apache.ctakes$ctakes-smoking-status/builds/2012-10-20_07-33-22/archive/org.apache.ctakes/ctakes-smoking-status/3.0.0-incubating-SNAPSHOT/ctakes-smoking-status-3.0.0-incubating-SNAPSHOT.jar
Waiting for Jenkins to finish collecting data
mavenExecutionResult exceptions not empty
message : Failed to execute goal org.apache.maven.plugins:maven-assembly-plugin:2.3:single
(bundle-project-sources) on project ctakes-distribution: Error reading assemblies: Error reading
descriptor: src/main/assembly/bin.xml: Unrecognised tag: 'include' (position: START_TAG seen
...</directoryMode>\r\n\t\t\t<include>... @142:13) 
cause : Error reading assemblies: Error reading descriptor: src/main/assembly/bin.xml: Unrecognised
tag: 'include' (position: START_TAG seen ...</directoryMode>\r\n\t\t\t<include>...
@142:13) 
Stack trace : 
org.apache.maven.lifecycle.LifecycleExecutionException: Failed to execute goal org.apache.maven.plugins:maven-assembly-plugin:2.3:single
(bundle-project-sources) on project ctakes-distribution: Error reading assemblies: Error reading
descriptor: src/main/assembly/bin.xml: Unrecognised tag: 'include' (position: START_TAG seen
...</directoryMode>\r\n\t\t\t<include>... @142:13) 
	at org.apache.maven.lifecycle.internal.MojoExecutor.execute(MojoExecutor.java:217)
	at org.apache.maven.lifecycle.internal.MojoExecutor.execute(MojoExecutor.java:153)
	at org.apache.maven.lifecycle.internal.MojoExecutor.execute(MojoExecutor.java:145)
	at org.apache.maven.lifecycle.internal.LifecycleModuleBuilder.buildProject(LifecycleModuleBuilder.java:84)
	at org.apache.maven.lifecycle.internal.LifecycleModuleBuilder.buildProject(LifecycleModuleBuilder.java:59)
	at org.apache.maven.lifecycle.internal.LifecycleStarter.singleThreadedBuild(LifecycleStarter.java:183)
	at org.apache.maven.lifecycle.internal.LifecycleStarter.execute(LifecycleStarter.java:161)
	at org.apache.maven.DefaultMaven.doExecute(DefaultMaven.java:319)
	at org.apache.maven.DefaultMaven.execute(DefaultMaven.java:156)
	at org.jvnet.hudson.maven3.launcher.Maven3Launcher.main(Maven3Launcher.java:79)
	at sun.reflect.NativeMethodAccessorImpl.invoke0(Native Method)
	at sun.reflect.NativeMethodAccessorImpl.invoke(NativeMethodAccessorImpl.java:39)
	at sun.reflect.DelegatingMethodAccessorImpl.invoke(DelegatingMethodAccessorImpl.java:25)
	at java.lang.reflect.Method.invoke(Method.java:597)
	at org.codehaus.plexus.classworlds.launcher.Launcher.launchStandard(Launcher.java:329)
	at org.codehaus.plexus.classworlds.launcher.Launcher.launch(Launcher.java:239)
	at org.jvnet.hudson.maven3.agent.Maven3Main.launch(Maven3Main.java:158)
	at hudson.maven.Maven3Builder.call(Maven3Builder.java:98)
	at hudson.maven.Maven3Builder.call(Maven3Builder.java:64)
	at hudson.remoting.UserRequest.perform(UserRequest.java:118)
	at hudson.remoting.UserRequest.perform(UserRequest.java:48)
	at hudson.remoting.Request$2.run(Request.java:326)
	at hudson.remoting.InterceptingExecutorService$1.call(InterceptingExecutorService.java:72)
	at java.util.concurrent.FutureTask$Sync.innerRun(FutureTask.java:303)
	at java.util.concurrent.FutureTask.run(FutureTask.java:138)
	at java.util.concurrent.ThreadPoolExecutor$Worker.runTask(ThreadPoolExecutor.java:886)
	at java.util.concurrent.ThreadPoolExecutor$Worker.run(ThreadPoolExecutor.java:908)
	at java.lang.Thread.run(Thread.java:662)
Caused by: org.apache.maven.plugin.MojoExecutionException: Error reading assemblies: Error
reading descriptor: src/main/assembly/bin.xml: Unrecognised tag: 'include' (position: START_TAG
seen ...</directoryMode>\r\n\t\t\t<include>... @142:13) 
	at org.apache.maven.plugin.assembly.mojos.AbstractAssemblyMojo.execute(AbstractAssemblyMojo.java:421)
	at org.apache.maven.plugin.DefaultBuildPluginManager.executeMojo(DefaultBuildPluginManager.java:101)
	at org.apache.maven.lifecycle.internal.MojoExecutor.execute(MojoExecutor.java:209)
	... 27 more
Caused by: org.apache.maven.plugin.assembly.io.AssemblyReadException: Error reading descriptor:
src/main/assembly/bin.xml: Unrecognised tag: 'include' (position: START_TAG seen ...</directoryMode>\r\n\t\t\t<include>...
@142:13) 
	at org.apache.maven.plugin.assembly.io.DefaultAssemblyReader.readAssembly(DefaultAssemblyReader.java:406)
	at org.apache.maven.plugin.assembly.io.DefaultAssemblyReader.addAssemblyFromDescriptor(DefaultAssemblyReader.java:328)
	at org.apache.maven.plugin.assembly.io.DefaultAssemblyReader.readAssemblies(DefaultAssemblyReader.java:120)
	at org.apache.maven.plugin.assembly.mojos.AbstractAssemblyMojo.execute(AbstractAssemblyMojo.java:417)
	... 29 more
Caused by: org.codehaus.plexus.util.xml.pull.XmlPullParserException: Unrecognised tag: 'include'
(position: START_TAG seen ...</directoryMode>\r\n\t\t\t<include>... @142:13) 
	at org.apache.maven.plugin.assembly.model.io.xpp3.AssemblyXpp3Reader.checkUnknownElement(AssemblyXpp3Reader.java:123)
	at org.apache.maven.plugin.assembly.model.io.xpp3.AssemblyXpp3Reader.parseFileSet(AssemblyXpp3Reader.java:1297)
	at org.apache.maven.plugin.assembly.model.io.xpp3.AssemblyXpp3Reader.parseAssembly(AssemblyXpp3Reader.java:895)
	at org.apache.maven.plugin.assembly.model.io.xpp3.AssemblyXpp3Reader.read(AssemblyXpp3Reader.java:1962)
	at org.apache.maven.plugin.assembly.model.io.xpp3.AssemblyXpp3Reader.read(AssemblyXpp3Reader.java:1895)
	at org.apache.maven.plugin.assembly.model.io.xpp3.AssemblyXpp3Reader.read(AssemblyXpp3Reader.java:1909)
	at org.apache.maven.plugin.assembly.io.DefaultAssemblyReader.readAssembly(DefaultAssemblyReader.java:388)
	... 32 more
Sending e-mails to: ctakes-notifications@incubator.apache.org pei@peistation.com
channel stopped

Mime
View raw message