ctakes-notifications mailing list archives

Site index · List index
Message view « Date » · « Thread »
Top « Date » · « Thread »
From Apache Jenkins Server <jenk...@builds.apache.org>
Subject Build failed in Jenkins: ctakes-trunk-package #6
Date Tue, 30 Oct 2012 00:55:10 GMT
See <https://builds.apache.org/job/ctakes-trunk-package/6/changes>

Changes:

[mattcoarr] beginnings of the assertion evaluation code

[chenpei] [maven-release-plugin] prepare for next development iteration

[chenpei] [maven-release-plugin] prepare release 3.0.0-incubating-rc1

[chenpei] CTAKES-73 - Preparing a 3.0 release candiate.
-Tempoarialy commenting out the temporal module from the pom
-Adding the release notes.html content

------------------------------------------
[...truncated 2214 lines...]
[ERROR] <https://builds.apache.org/job/ctakes-trunk-package/ws/ctakes-assertion/src/main/java/org/apache/ctakes/assertion/medfacts/cleartk/AssertionCleartkAnalysisEngine.java>:[135,4]
[deprecation] org.cleartk.classifier.feature.extractor.ContextExtractor in org.cleartk.classifier.feature.extractor
has been deprecated
[ERROR] <https://builds.apache.org/job/ctakes-trunk-package/ws/ctakes-assertion/src/main/java/org/apache/ctakes/assertion/medfacts/cleartk/AssertionCleartkAnalysisEngine.java>:[135,21]
cannot find symbol
symbol  : class BaseToken
location: class org.apache.ctakes.assertion.medfacts.cleartk.AssertionCleartkAnalysisEngine
[ERROR] <https://builds.apache.org/job/ctakes-trunk-package/ws/ctakes-assertion/src/main/java/org/apache/ctakes/assertion/medfacts/cleartk/AssertionCleartkAnalysisEngine.java>:[135,49]
[deprecation] org.cleartk.classifier.feature.extractor.ContextExtractor in org.cleartk.classifier.feature.extractor
has been deprecated
[ERROR] <https://builds.apache.org/job/ctakes-trunk-package/ws/ctakes-assertion/src/main/java/org/apache/ctakes/assertion/medfacts/cleartk/AssertionCleartkAnalysisEngine.java>:[135,66]
cannot find symbol
symbol  : class BaseToken
location: class org.apache.ctakes.assertion.medfacts.cleartk.AssertionCleartkAnalysisEngine
[ERROR] <https://builds.apache.org/job/ctakes-trunk-package/ws/ctakes-assertion/src/main/java/org/apache/ctakes/assertion/medfacts/cleartk/AssertionCleartkAnalysisEngine.java>:[136,8]
cannot find symbol
symbol  : class BaseToken
location: class org.apache.ctakes.assertion.medfacts.cleartk.AssertionCleartkAnalysisEngine
[ERROR] <https://builds.apache.org/job/ctakes-trunk-package/ws/ctakes-assertion/src/main/java/org/apache/ctakes/assertion/medfacts/cleartk/AssertionCleartkAnalysisEngine.java>:[138,12]
[deprecation] org.cleartk.classifier.feature.extractor.ContextExtractor in org.cleartk.classifier.feature.extractor
has been deprecated
[ERROR] <https://builds.apache.org/job/ctakes-trunk-package/ws/ctakes-assertion/src/main/java/org/apache/ctakes/assertion/medfacts/cleartk/AssertionCleartkAnalysisEngine.java>:[139,12]
[deprecation] org.cleartk.classifier.feature.extractor.ContextExtractor in org.cleartk.classifier.feature.extractor
has been deprecated
[ERROR] <https://builds.apache.org/job/ctakes-trunk-package/ws/ctakes-assertion/src/main/java/org/apache/ctakes/assertion/medfacts/cleartk/AssertionCleartkAnalysisEngine.java>:[140,12]
[deprecation] org.cleartk.classifier.feature.extractor.ContextExtractor in org.cleartk.classifier.feature.extractor
has been deprecated
[ERROR] <https://builds.apache.org/job/ctakes-trunk-package/ws/ctakes-assertion/src/main/java/org/apache/ctakes/assertion/medfacts/cleartk/AssertionCleartkAnalysisEngine.java>:[141,12]
[deprecation] org.cleartk.classifier.feature.extractor.ContextExtractor in org.cleartk.classifier.feature.extractor
has been deprecated
[ERROR] <https://builds.apache.org/job/ctakes-trunk-package/ws/ctakes-assertion/src/main/java/org/apache/ctakes/assertion/medfacts/cleartk/AssertionCleartkAnalysisEngine.java>:[142,12]
[deprecation] org.cleartk.classifier.feature.extractor.ContextExtractor in org.cleartk.classifier.feature.extractor
has been deprecated
[ERROR] <https://builds.apache.org/job/ctakes-trunk-package/ws/ctakes-assertion/src/main/java/org/apache/ctakes/assertion/medfacts/cleartk/AssertionCleartkAnalysisEngine.java>:[160,4]
cannot find symbol
symbol  : class DocumentID
location: class org.apache.ctakes.assertion.medfacts.cleartk.AssertionCleartkAnalysisEngine
[ERROR] <https://builds.apache.org/job/ctakes-trunk-package/ws/ctakes-assertion/src/main/java/org/apache/ctakes/assertion/medfacts/cleartk/AssertionCleartkAnalysisEngine.java>:[160,56]
cannot find symbol
symbol  : class DocumentID
location: class org.apache.ctakes.assertion.medfacts.cleartk.AssertionCleartkAnalysisEngine
[ERROR] <https://builds.apache.org/job/ctakes-trunk-package/ws/ctakes-assertion/src/main/java/org/apache/ctakes/assertion/medfacts/cleartk/AssertionCleartkAnalysisEngine.java>:[192,8]
cannot find symbol
symbol  : class IdentifiedAnnotation
location: class org.apache.ctakes.assertion.medfacts.cleartk.AssertionCleartkAnalysisEngine
[ERROR] <https://builds.apache.org/job/ctakes-trunk-package/ws/ctakes-assertion/src/main/java/org/apache/ctakes/assertion/medfacts/cleartk/AssertionCleartkAnalysisEngine.java>:[192,41]
cannot find symbol
symbol  : class Sentence
location: class org.apache.ctakes.assertion.medfacts.cleartk.AssertionCleartkAnalysisEngine
[ERROR] <https://builds.apache.org/job/ctakes-trunk-package/ws/ctakes-assertion/src/main/java/org/apache/ctakes/assertion/medfacts/cleartk/AssertionCleartkAnalysisEngine.java>:[192,123]
cannot find symbol
symbol  : class IdentifiedAnnotation
location: class org.apache.ctakes.assertion.medfacts.cleartk.AssertionCleartkAnalysisEngine
[ERROR] <https://builds.apache.org/job/ctakes-trunk-package/ws/ctakes-assertion/src/main/java/org/apache/ctakes/assertion/medfacts/cleartk/AssertionCleartkAnalysisEngine.java>:[192,151]
cannot find symbol
symbol  : class Sentence
location: class org.apache.ctakes.assertion.medfacts.cleartk.AssertionCleartkAnalysisEngine
[ERROR] <https://builds.apache.org/job/ctakes-trunk-package/ws/ctakes-assertion/src/main/java/org/apache/ctakes/assertion/medfacts/cleartk/AssertionCleartkAnalysisEngine.java>:[193,8]
cannot find symbol
symbol  : class Sentence
location: class org.apache.ctakes.assertion.medfacts.cleartk.AssertionCleartkAnalysisEngine
[ERROR] <https://builds.apache.org/job/ctakes-trunk-package/ws/ctakes-assertion/src/main/java/org/apache/ctakes/assertion/medfacts/cleartk/AssertionCleartkAnalysisEngine.java>:[193,29]
cannot find symbol
symbol  : class BaseToken
location: class org.apache.ctakes.assertion.medfacts.cleartk.AssertionCleartkAnalysisEngine
[ERROR] <https://builds.apache.org/job/ctakes-trunk-package/ws/ctakes-assertion/src/main/java/org/apache/ctakes/assertion/medfacts/cleartk/AssertionCleartkAnalysisEngine.java>:[193,118]
cannot find symbol
symbol  : class Sentence
location: class org.apache.ctakes.assertion.medfacts.cleartk.AssertionCleartkAnalysisEngine
[ERROR] <https://builds.apache.org/job/ctakes-trunk-package/ws/ctakes-assertion/src/main/java/org/apache/ctakes/assertion/medfacts/cleartk/AssertionCleartkAnalysisEngine.java>:[193,134]
cannot find symbol
symbol  : class BaseToken
location: class org.apache.ctakes.assertion.medfacts.cleartk.AssertionCleartkAnalysisEngine
[ERROR] <https://builds.apache.org/job/ctakes-trunk-package/ws/ctakes-assertion/src/main/java/org/apache/ctakes/assertion/medfacts/cleartk/AssertionCleartkAnalysisEngine.java>:[197,15]
cannot find symbol
symbol  : class IdentifiedAnnotation
location: class org.apache.ctakes.assertion.medfacts.cleartk.AssertionCleartkAnalysisEngine
[ERROR] <https://builds.apache.org/job/ctakes-trunk-package/ws/ctakes-assertion/src/main/java/org/apache/ctakes/assertion/medfacts/cleartk/AssertionCleartkAnalysisEngine.java>:[197,90]
cannot find symbol
symbol  : class IdentifiedAnnotation
location: class org.apache.ctakes.assertion.medfacts.cleartk.AssertionCleartkAnalysisEngine
[ERROR] <https://builds.apache.org/job/ctakes-trunk-package/ws/ctakes-assertion/src/main/java/org/apache/ctakes/assertion/medfacts/cleartk/AssertionCleartkAnalysisEngine.java>:[198,9]
cannot find symbol
symbol  : class IdentifiedAnnotation
location: class org.apache.ctakes.assertion.medfacts.cleartk.AssertionCleartkAnalysisEngine
[ERROR] <https://builds.apache.org/job/ctakes-trunk-package/ws/ctakes-assertion/src/main/java/org/apache/ctakes/assertion/medfacts/cleartk/AssertionCleartkAnalysisEngine.java>:[200,37]
cannot find symbol
symbol  : class EntityMention
location: class org.apache.ctakes.assertion.medfacts.cleartk.AssertionCleartkAnalysisEngine
[ERROR] <https://builds.apache.org/job/ctakes-trunk-package/ws/ctakes-assertion/src/main/java/org/apache/ctakes/assertion/medfacts/cleartk/AssertionCleartkAnalysisEngine.java>:[200,79]
cannot find symbol
symbol  : class EventMention
location: class org.apache.ctakes.assertion.medfacts.cleartk.AssertionCleartkAnalysisEngine
[ERROR] <https://builds.apache.org/job/ctakes-trunk-package/ws/ctakes-assertion/src/main/java/org/apache/ctakes/assertion/medfacts/cleartk/AssertionCleartkAnalysisEngine.java>:[218,17]
cannot find symbol
symbol  : class Sentence
location: class org.apache.ctakes.assertion.medfacts.cleartk.AssertionCleartkAnalysisEngine
[ERROR] <https://builds.apache.org/job/ctakes-trunk-package/ws/ctakes-assertion/src/main/java/org/apache/ctakes/assertion/medfacts/cleartk/AssertionCleartkAnalysisEngine.java>:[219,6]
cannot find symbol
symbol  : class Sentence
location: class org.apache.ctakes.assertion.medfacts.cleartk.AssertionCleartkAnalysisEngine
[ERROR] <https://builds.apache.org/job/ctakes-trunk-package/ws/ctakes-assertion/src/main/java/org/apache/ctakes/assertion/medfacts/cleartk/AssertionCleartkAnalysisEngine.java>:[240,13]
[deprecation] org.cleartk.classifier.feature.extractor.ContextExtractor in org.cleartk.classifier.feature.extractor
has been deprecated
[ERROR] <https://builds.apache.org/job/ctakes-trunk-package/ws/ctakes-assertion/src/main/java/org/apache/ctakes/assertion/medfacts/cleartk/AssertionCleartkAnalysisEngine.java>:[240,30]
cannot find symbol
symbol  : class IdentifiedAnnotation
location: class org.apache.ctakes.assertion.medfacts.cleartk.AssertionCleartkAnalysisEngine
[ERROR] <https://builds.apache.org/job/ctakes-trunk-package/ws/ctakes-assertion/src/main/java/org/apache/ctakes/assertion/medfacts/cleartk/AssertionCleartkAnalysisEngine.java>:[249,11]
[deprecation] org.cleartk.classifier.feature.extractor.ContextExtractor in org.cleartk.classifier.feature.extractor
has been deprecated
[ERROR] <https://builds.apache.org/job/ctakes-trunk-package/ws/ctakes-assertion/src/main/java/org/apache/ctakes/assertion/medfacts/cleartk/AssertionCleartkAnalysisEngine.java>:[249,28]
cannot find symbol
symbol  : class BaseToken
location: class org.apache.ctakes.assertion.medfacts.cleartk.AssertionCleartkAnalysisEngine
[ERROR] <https://builds.apache.org/job/ctakes-trunk-package/ws/ctakes-assertion/src/main/java/org/apache/ctakes/assertion/eval/AssertionEvalBasedOnModifier.java>:[131,72]
[deprecation] org.cleartk.classifier.opennlp.DefaultMaxentDataWriterFactory in org.cleartk.classifier.opennlp
has been deprecated
[ERROR] <https://builds.apache.org/job/ctakes-trunk-package/ws/ctakes-assertion/src/main/java/org/apache/ctakes/assertion/eval/AssertionEvalBasedOnModifier.java>:[173,11]
cannot find symbol
symbol  : class AnnotationStatistics
location: class org.apache.ctakes.assertion.eval.AssertionEvalBasedOnModifier
[ERROR] <https://builds.apache.org/job/ctakes-trunk-package/ws/ctakes-assertion/src/main/java/org/apache/ctakes/assertion/eval/AssertionEvalBasedOnModifier.java>:[173,55]
cannot find symbol
symbol  : method crossValidation(java.util.List<java.io.File>,int)
location: class org.apache.ctakes.assertion.eval.AssertionEvalBasedOnModifier
[ERROR] <https://builds.apache.org/job/ctakes-trunk-package/ws/ctakes-assertion/src/main/java/org/apache/ctakes/assertion/eval/AssertionEvalBasedOnModifier.java>:[175,6]
cannot find symbol
symbol  : class AnnotationStatistics
location: class org.apache.ctakes.assertion.eval.AssertionEvalBasedOnModifier
[ERROR] <https://builds.apache.org/job/ctakes-trunk-package/ws/ctakes-assertion/src/main/java/org/apache/ctakes/assertion/eval/AssertionEvalBasedOnModifier.java>:[175,46]
cannot find symbol
symbol  : class AnnotationStatistics
location: class org.apache.ctakes.assertion.eval.AssertionEvalBasedOnModifier
[ERROR] <https://builds.apache.org/job/ctakes-trunk-package/ws/ctakes-assertion/src/main/java/org/apache/ctakes/assertion/eval/AssertionEvalBasedOnModifier.java>:[176,11]
cannot find symbol
symbol  : class AnnotationStatistics
location: class org.apache.ctakes.assertion.eval.AssertionEvalBasedOnModifier
[ERROR] <https://builds.apache.org/job/ctakes-trunk-package/ws/ctakes-assertion/src/main/java/org/apache/ctakes/assertion/eval/AssertionEvalBasedOnModifier.java>:[194,6]
cannot find symbol
mojoFailed org.apache.maven.plugins:maven-compiler-plugin:2.4(default-compile)symbol  : class
AnnotationStatistics
location: class org.apache.ctakes.assertion.eval.AssertionEvalBasedOnModifier
[ERROR] <https://builds.apache.org/job/ctakes-trunk-package/ws/ctakes-assertion/src/main/java/org/apache/ctakes/assertion/eval/AssertionEvalBasedOnModifier.java>:[224,8]
cannot find symbol
symbol  : class XMIReader
location: class org.apache.ctakes.assertion.eval.AssertionEvalBasedOnModifier
[ERROR] <https://builds.apache.org/job/ctakes-trunk-package/ws/ctakes-assertion/src/main/java/org/apache/ctakes/assertion/eval/AssertionEvalBasedOnModifier.java>:[226,8]
cannot find symbol
symbol  : variable XMIReader
location: class org.apache.ctakes.assertion.eval.AssertionEvalBasedOnModifier
[ERROR] <https://builds.apache.org/job/ctakes-trunk-package/ws/ctakes-assertion/src/main/java/org/apache/ctakes/assertion/eval/AssertionEvalBasedOnModifier.java>:[216,2]
method does not override or implement a method from a supertype
[ERROR] <https://builds.apache.org/job/ctakes-trunk-package/ws/ctakes-assertion/src/main/java/org/apache/ctakes/assertion/eval/AssertionEvalBasedOnModifier.java>:[230,2]
method does not override or implement a method from a supertype
[ERROR] <https://builds.apache.org/job/ctakes-trunk-package/ws/ctakes-assertion/src/main/java/org/apache/ctakes/assertion/eval/AssertionEvalBasedOnModifier.java>:[316,4]
cannot find symbol
symbol  : class AnnotationStatistics
location: class org.apache.ctakes.assertion.eval.AssertionEvalBasedOnModifier
[ERROR] <https://builds.apache.org/job/ctakes-trunk-package/ws/ctakes-assertion/src/main/java/org/apache/ctakes/assertion/eval/AssertionEvalBasedOnModifier.java>:[316,37]
cannot find symbol
symbol  : class AnnotationStatistics
location: class org.apache.ctakes.assertion.eval.AssertionEvalBasedOnModifier
[ERROR] <https://builds.apache.org/job/ctakes-trunk-package/ws/ctakes-assertion/src/main/java/org/apache/ctakes/assertion/eval/AssertionEvalBasedOnModifier.java>:[333,4]
cannot find symbol
symbol  : variable AnnotationStatistics
location: class org.apache.ctakes.assertion.eval.AssertionEvalBasedOnModifier
[ERROR] <https://builds.apache.org/job/ctakes-trunk-package/ws/ctakes-assertion/src/main/java/org/apache/ctakes/assertion/eval/AssertionEvalBasedOnModifier.java>:[334,4]
cannot find symbol
symbol  : variable AnnotationStatistics
location: class org.apache.ctakes.assertion.eval.AssertionEvalBasedOnModifier
[ERROR] <https://builds.apache.org/job/ctakes-trunk-package/ws/ctakes-assertion/src/main/java/org/apache/ctakes/assertion/eval/AssertionEvalBasedOnModifier.java>:[287,2]
method does not override or implement a method from a supertype
[ERROR] <https://builds.apache.org/job/ctakes-trunk-package/ws/ctakes-assertion/src/main/java/org/apache/ctakes/assertion/medfacts/cleartk/TrainAssertionModel.java>:[101,8]
cannot find symbol
symbol  : variable AssertionComponents
location: class org.apache.ctakes.assertion.medfacts.cleartk.TrainAssertionModel
[ERROR] <https://builds.apache.org/job/ctakes-trunk-package/ws/ctakes-assertion/src/main/java/org/apache/ctakes/assertion/medfacts/cleartk/TrainAssertionModel.java>:[221,10]
cannot find symbol
symbol  : variable AssertionComponents
location: class org.apache.ctakes.assertion.medfacts.cleartk.TrainAssertionModel
[ERROR] <https://builds.apache.org/job/ctakes-trunk-package/ws/ctakes-assertion/src/main/java/org/apache/ctakes/assertion/medfacts/cleartk/TrainAssertionModel.java>:[274,72]
[deprecation] org.cleartk.classifier.opennlp.DefaultMaxentDataWriterFactory in org.cleartk.classifier.opennlp
has been deprecated
[ERROR] <https://builds.apache.org/job/ctakes-trunk-package/ws/ctakes-assertion/src/main/java/org/apache/ctakes/assertion/medfacts/cleartk/TrainAssertionModel.java>:[278,12]
cannot find symbol
symbol  : variable AssertionComponents
location: class org.apache.ctakes.assertion.medfacts.cleartk.TrainAssertionModel
[ERROR] <https://builds.apache.org/job/ctakes-trunk-package/ws/ctakes-assertion/src/main/java/org/apache/ctakes/assertion/medfacts/cleartk/TrainAssertionModel.java>:[337,8]
cannot find symbol
symbol  : variable AssertionComponents
location: class org.apache.ctakes.assertion.medfacts.cleartk.TrainAssertionModel
[ERROR] <https://builds.apache.org/job/ctakes-trunk-package/ws/ctakes-assertion/src/main/java/org/apache/ctakes/assertion/medfacts/cleartk/TrainAssertionModel.java>:[369,12]
cannot find symbol
symbol  : variable AssertionComponents
location: class org.apache.ctakes.assertion.medfacts.cleartk.TrainAssertionModel
[INFO] 123 errors 
[INFO] -------------------------------------------------------------

projectFailed org.apache.ctakes:ctakes-assertion:3.1.0-incubating-SNAPSHOT
sessionEnded
[INFO] ------------------------------------------------------------------------
[INFO] Reactor Summary:
[INFO] 
[INFO] Apache cTAKES ..................................... SUCCESS [2:52.670s]
[INFO] Apache cTAKES common type system .................. SUCCESS [1:02.597s]
[INFO] Apache cTAKES utils ............................... SUCCESS [27.046s]
[INFO] Apache cTAKES core ................................ SUCCESS [1:22.141s]
[INFO] Apache cTAKES part-of-speech tagger ............... SUCCESS [18.652s]
[INFO] Apache cTAKES chunker ............................. SUCCESS [28.249s]
[INFO] Apache cTAKES document preprocessor ............... SUCCESS [18.251s]
[INFO] Apache cTAKES dictionary lookup ................... SUCCESS [27.420s]
[INFO] Apache cTAKES context dependent tokenizer ......... SUCCESS [20.328s]
[INFO] Apache cTAKES LVG lexical tools ................... SUCCESS [20.098s]
[INFO] Apache cTAKES named entity contexts ............... SUCCESS [29.184s]
[INFO] Apache cTAKES Constituency Parser ................. SUCCESS [27.297s]
[INFO] Apache cTAKES CoReference Resolver ................ SUCCESS [26.418s]
[INFO] Apache cTAKES Drug NER ............................ SUCCESS [45.866s]
[INFO] Apache cTAKES Side Effects ........................ SUCCESS [31.604s]
[INFO] Apache cTAKES Smoking Status ...................... SUCCESS [36.742s]
[INFO] Apache cTAKES Dependency Parser ................... SUCCESS [46.240s]
[INFO] Apache cTAKES Assertion ........................... FAILURE [19.814s]
[INFO] Apache cTAKES ctakes-clinical-pipeline ............ SKIPPED
[INFO] Apache cTAKES Relation Extractor .................. SKIPPED
[INFO] Apache cTAKES Pad Term Spotter .................... SKIPPED
[INFO] Apache cTAKES Distribution ........................ SKIPPED
[INFO] ------------------------------------------------------------------------
[INFO] BUILD FAILURE
[INFO] ------------------------------------------------------------------------
[INFO] Total time: 13:15.675s
[INFO] Finished at: Tue Oct 30 00:51:01 GMT+00:00 2012
[INFO] Final Memory: 28M/175M
[INFO] ------------------------------------------------------------------------
Projects to build: [MavenProject: org.apache.ctakes:ctakes:3.1.0-incubating-SNAPSHOT @ <https://builds.apache.org/job/ctakes-trunk-package/ws/pom.xml,>
MavenProject: org.apache.ctakes:ctakes-type-system:3.1.0-incubating-SNAPSHOT @ <https://builds.apache.org/job/ctakes-trunk-package/ws/ctakes-type-system/pom.xml,>
MavenProject: org.apache.ctakes:ctakes-utils:3.1.0-incubating-SNAPSHOT @ <https://builds.apache.org/job/ctakes-trunk-package/ws/ctakes-utils/pom.xml,>
MavenProject: org.apache.ctakes:ctakes-core:3.1.0-incubating-SNAPSHOT @ <https://builds.apache.org/job/ctakes-trunk-package/ws/ctakes-core/pom.xml,>
MavenProject: org.apache.ctakes:ctakes-pos-tagger:3.1.0-incubating-SNAPSHOT @ <https://builds.apache.org/job/ctakes-trunk-package/ws/ctakes-pos-tagger/pom.xml,>
MavenProject: org.apache.ctakes:ctakes-chunker:3.1.0-incubating-SNAPSHOT @ <https://builds.apache.org/job/ctakes-trunk-package/ws/ctakes-chunker/pom.xml,>
MavenProject: org.apache.ctakes:ctakes-preprocessor:3.1.0-incubating-SNAPSHOT @ <https://builds.apache.org/job/ctakes-trunk-package/ws/ctakes-preprocessor/pom.xml,>
MavenProject: org.apache.ctakes:ctakes-dictionary-lookup:3.1.0-incubating-SNAPSHOT @ <https://builds.apache.org/job/ctakes-trunk-package/ws/ctakes-dictionary-lookup/pom.xml,>
MavenProject: org.apache.ctakes:ctakes-context-tokenizer:3.1.0-incubating-SNAPSHOT @ <https://builds.apache.org/job/ctakes-trunk-package/ws/ctakes-context-tokenizer/pom.xml,>
MavenProject: org.apache.ctakes:ctakes-lvg:3.1.0-incubating-SNAPSHOT @ <https://builds.apache.org/job/ctakes-trunk-package/ws/ctakes-lvg/pom.xml,>
MavenProject: org.apache.ctakes:ctakes-ne-contexts:3.1.0-incubating-SNAPSHOT @ <https://builds.apache.org/job/ctakes-trunk-package/ws/ctakes-ne-contexts/pom.xml,>
MavenProject: org.apache.ctakes:ctakes-constituency-parser:3.1.0-incubating-SNAPSHOT @ <https://builds.apache.org/job/ctakes-trunk-package/ws/ctakes-constituency-parser/pom.xml,>
MavenProject: org.apache.ctakes:ctakes-coreference:3.1.0-incubating-SNAPSHOT @ <https://builds.apache.org/job/ctakes-trunk-package/ws/ctakes-coreference/pom.xml,>
MavenProject: org.apache.ctakes:ctakes-drug-ner:3.1.0-incubating-SNAPSHOT @ <https://builds.apache.org/job/ctakes-trunk-package/ws/ctakes-drug-ner/pom.xml,>
MavenProject: org.apache.ctakes:ctakes-side-effect:3.1.0-incubating-SNAPSHOT @ <https://builds.apache.org/job/ctakes-trunk-package/ws/ctakes-side-effect/pom.xml,>
MavenProject: org.apache.ctakes:ctakes-smoking-status:3.1.0-incubating-SNAPSHOT @ <https://builds.apache.org/job/ctakes-trunk-package/ws/ctakes-smoking-status/pom.xml,>
MavenProject: org.apache.ctakes:ctakes-dependency-parser:3.1.0-incubating-SNAPSHOT @ <https://builds.apache.org/job/ctakes-trunk-package/ws/ctakes-dependency-parser/pom.xml,>
MavenProject: org.apache.ctakes:ctakes-assertion:3.1.0-incubating-SNAPSHOT @ <https://builds.apache.org/job/ctakes-trunk-package/ws/ctakes-assertion/pom.xml,>
MavenProject: org.apache.ctakes:ctakes-clinical-pipeline:3.1.0-incubating-SNAPSHOT @ <https://builds.apache.org/job/ctakes-trunk-package/ws/ctakes-clinical-pipeline/pom.xml,>
MavenProject: org.apache.ctakes:ctakes-relation-extractor:3.1.0-incubating-SNAPSHOT @ <https://builds.apache.org/job/ctakes-trunk-package/ws/ctakes-relation-extractor/pom.xml,>
MavenProject: org.apache.ctakes:ctakes-pad-term-spotter:3.1.0-incubating-SNAPSHOT @ <https://builds.apache.org/job/ctakes-trunk-package/ws/ctakes-pad-term-spotter/pom.xml,>
MavenProject: org.apache.ctakes:ctakes-distribution:3.1.0-incubating-SNAPSHOT @ <https://builds.apache.org/job/ctakes-trunk-package/ws/ctakes-distribution/pom.xml]>
[JENKINS] Archiving disabled - not archiving <https://builds.apache.org/job/ctakes-trunk-package/ws/ctakes-context-tokenizer/pom.xml>
[JENKINS] Archiving disabled - not archiving <https://builds.apache.org/job/ctakes-trunk-package/ws/ctakes-context-tokenizer/target/ctakes-context-tokenizer-3.1.0-incubating-SNAPSHOT.jar>
[JENKINS] Archiving disabled - not archiving <https://builds.apache.org/job/ctakes-trunk-package/ws/ctakes-drug-ner/pom.xml>
[JENKINS] Archiving disabled - not archiving <https://builds.apache.org/job/ctakes-trunk-package/ws/ctakes-drug-ner/target/ctakes-drug-ner-3.1.0-incubating-SNAPSHOT.jar>
[JENKINS] Archiving disabled - not archiving <https://builds.apache.org/job/ctakes-trunk-package/ws/ctakes-type-system/pom.xml>
[JENKINS] Archiving disabled - not archiving <https://builds.apache.org/job/ctakes-trunk-package/ws/ctakes-type-system/target/ctakes-type-system-3.1.0-incubating-SNAPSHOT.jar>
[JENKINS] Archiving disabled - not archiving <https://builds.apache.org/job/ctakes-trunk-package/ws/ctakes-constituency-parser/pom.xml>
[JENKINS] Archiving disabled - not archiving <https://builds.apache.org/job/ctakes-trunk-package/ws/ctakes-constituency-parser/target/ctakes-constituency-parser-3.1.0-incubating-SNAPSHOT.jar>
[JENKINS] Archiving disabled - not archiving <https://builds.apache.org/job/ctakes-trunk-package/ws/ctakes-chunker/pom.xml>
[JENKINS] Archiving disabled - not archiving <https://builds.apache.org/job/ctakes-trunk-package/ws/ctakes-chunker/target/ctakes-chunker-3.1.0-incubating-SNAPSHOT.jar>
[JENKINS] Archiving disabled - not archiving <https://builds.apache.org/job/ctakes-trunk-package/ws/ctakes-dictionary-lookup/pom.xml>
[JENKINS] Archiving disabled - not archiving <https://builds.apache.org/job/ctakes-trunk-package/ws/ctakes-dictionary-lookup/target/ctakes-dictionary-lookup-3.1.0-incubating-SNAPSHOT.jar>
[JENKINS] Archiving disabled - not archiving <https://builds.apache.org/job/ctakes-trunk-package/ws/ctakes-ne-contexts/pom.xml>
[JENKINS] Archiving disabled - not archiving <https://builds.apache.org/job/ctakes-trunk-package/ws/ctakes-ne-contexts/target/ctakes-ne-contexts-3.1.0-incubating-SNAPSHOT.jar>
[JENKINS] Archiving disabled - not archiving <https://builds.apache.org/job/ctakes-trunk-package/ws/ctakes-lvg/pom.xml>
[JENKINS] Archiving disabled - not archiving <https://builds.apache.org/job/ctakes-trunk-package/ws/ctakes-lvg/target/ctakes-lvg-3.1.0-incubating-SNAPSHOT.jar>
[JENKINS] Archiving disabled - not archiving <https://builds.apache.org/job/ctakes-trunk-package/ws/ctakes-core/pom.xml>
[JENKINS] Archiving disabled - not archiving <https://builds.apache.org/job/ctakes-trunk-package/ws/ctakes-core/target/ctakes-core-3.1.0-incubating-SNAPSHOT.jar>
[JENKINS] Archiving disabled - not archiving <https://builds.apache.org/job/ctakes-trunk-package/ws/ctakes-pos-tagger/pom.xml>
[JENKINS] Archiving disabled - not archiving <https://builds.apache.org/job/ctakes-trunk-package/ws/ctakes-pos-tagger/target/ctakes-pos-tagger-3.1.0-incubating-SNAPSHOT.jar>
[JENKINS] Archiving disabled - not archiving <https://builds.apache.org/job/ctakes-trunk-package/ws/ctakes-pad-term-spotter/pom.xml>
[JENKINS] Archiving disabled - not archiving <https://builds.apache.org/job/ctakes-trunk-package/ws/ctakes-distribution/pom.xml>
[JENKINS] Archiving disabled - not archiving <https://builds.apache.org/job/ctakes-trunk-package/ws/ctakes-dependency-parser/pom.xml>
[JENKINS] Archiving disabled - not archiving <https://builds.apache.org/job/ctakes-trunk-package/ws/ctakes-dependency-parser/target/ctakes-dependency-parser-3.1.0-incubating-SNAPSHOT.jar>
[JENKINS] Archiving disabled - not archiving <https://builds.apache.org/job/ctakes-trunk-package/ws/ctakes-clinical-pipeline/pom.xml>
[JENKINS] Archiving disabled - not archiving <https://builds.apache.org/job/ctakes-trunk-package/ws/ctakes-assertion/pom.xml>
[JENKINS] Archiving disabled - not archiving <https://builds.apache.org/job/ctakes-trunk-package/ws/ctakes-coreference/pom.xml>
[JENKINS] Archiving disabled - not archiving <https://builds.apache.org/job/ctakes-trunk-package/ws/ctakes-coreference/target/ctakes-coreference-3.1.0-incubating-SNAPSHOT.jar>
[JENKINS] Archiving disabled - not archiving <https://builds.apache.org/job/ctakes-trunk-package/ws/pom.xml>
[JENKINS] Archiving disabled - not archiving <https://builds.apache.org/job/ctakes-trunk-package/ws/ctakes-relation-extractor/pom.xml>
[JENKINS] Archiving disabled - not archiving <https://builds.apache.org/job/ctakes-trunk-package/ws/ctakes-preprocessor/pom.xml>
[JENKINS] Archiving disabled - not archiving <https://builds.apache.org/job/ctakes-trunk-package/ws/ctakes-preprocessor/target/ctakes-preprocessor-3.1.0-incubating-SNAPSHOT.jar>
[JENKINS] Archiving disabled - not archiving <https://builds.apache.org/job/ctakes-trunk-package/ws/ctakes-utils/pom.xml>
[JENKINS] Archiving disabled - not archiving <https://builds.apache.org/job/ctakes-trunk-package/ws/ctakes-utils/target/ctakes-utils-3.1.0-incubating-SNAPSHOT.jar>
[JENKINS] Archiving disabled - not archiving <https://builds.apache.org/job/ctakes-trunk-package/ws/ctakes-side-effect/pom.xml>
[JENKINS] Archiving disabled - not archiving <https://builds.apache.org/job/ctakes-trunk-package/ws/ctakes-side-effect/target/ctakes-side-effect-3.1.0-incubating-SNAPSHOT.jar>
[JENKINS] Archiving disabled - not archiving <https://builds.apache.org/job/ctakes-trunk-package/ws/ctakes-smoking-status/pom.xml>
[JENKINS] Archiving disabled - not archiving <https://builds.apache.org/job/ctakes-trunk-package/ws/ctakes-smoking-status/target/ctakes-smoking-status-3.1.0-incubating-SNAPSHOT.jar>
Waiting for Jenkins to finish collecting data
mavenExecutionResult exceptions not empty
message : Failed to execute goal org.apache.maven.plugins:maven-compiler-plugin:2.4:compile
(default-compile) on project ctakes-assertion: Compilation failure
cause : Compilation failure
Stack trace : 
org.apache.maven.lifecycle.LifecycleExecutionException: Failed to execute goal org.apache.maven.plugins:maven-compiler-plugin:2.4:compile
(default-compile) on project ctakes-assertion: Compilation failure
	at org.apache.maven.lifecycle.internal.MojoExecutor.execute(MojoExecutor.java:213)
	at org.apache.maven.lifecycle.internal.MojoExecutor.execute(MojoExecutor.java:153)
	at org.apache.maven.lifecycle.internal.MojoExecutor.execute(MojoExecutor.java:145)
	at org.apache.maven.lifecycle.internal.LifecycleModuleBuilder.buildProject(LifecycleModuleBuilder.java:84)
	at org.apache.maven.lifecycle.internal.LifecycleModuleBuilder.buildProject(LifecycleModuleBuilder.java:59)
	at org.apache.maven.lifecycle.internal.LifecycleStarter.singleThreadedBuild(LifecycleStarter.java:183)
	at org.apache.maven.lifecycle.internal.LifecycleStarter.execute(LifecycleStarter.java:161)
	at org.apache.maven.DefaultMaven.doExecute(DefaultMaven.java:319)
	at org.apache.maven.DefaultMaven.execute(DefaultMaven.java:156)
	at org.jvnet.hudson.maven3.launcher.Maven3Launcher.main(Maven3Launcher.java:79)
	at sun.reflect.NativeMethodAccessorImpl.invoke0(Native Method)
	at sun.reflect.NativeMethodAccessorImpl.invoke(NativeMethodAccessorImpl.java:39)
	at sun.reflect.DelegatingMethodAccessorImpl.invoke(DelegatingMethodAccessorImpl.java:25)
	at java.lang.reflect.Method.invoke(Method.java:597)
	at org.codehaus.plexus.classworlds.launcher.Launcher.launchStandard(Launcher.java:329)
	at org.codehaus.plexus.classworlds.launcher.Launcher.launch(Launcher.java:239)
	at org.jvnet.hudson.maven3.agent.Maven3Main.launch(Maven3Main.java:158)
	at hudson.maven.Maven3Builder.call(Maven3Builder.java:98)
	at hudson.maven.Maven3Builder.call(Maven3Builder.java:64)
	at hudson.remoting.UserRequest.perform(UserRequest.java:118)
	at hudson.remoting.UserRequest.perform(UserRequest.java:48)
	at hudson.remoting.Request$2.run(Request.java:326)
	at hudson.remoting.InterceptingExecutorService$1.call(InterceptingExecutorService.java:72)
	at java.util.concurrent.FutureTask$Sync.innerRun(FutureTask.java:303)
	at java.util.concurrent.FutureTask.run(FutureTask.java:138)
	at java.util.concurrent.ThreadPoolExecutor$Worker.runTask(ThreadPoolExecutor.java:886)
	at java.util.concurrent.ThreadPoolExecutor$Worker.run(ThreadPoolExecutor.java:908)
	at java.lang.Thread.run(Thread.java:662)
Caused by: org.apache.maven.plugin.CompilationFailureException: Compilation failure
	at org.apache.maven.plugin.AbstractCompilerMojo.execute(AbstractCompilerMojo.java:678)
	at org.apache.maven.plugin.CompilerMojo.execute(CompilerMojo.java:128)
	at org.apache.maven.plugin.DefaultBuildPluginManager.executeMojo(DefaultBuildPluginManager.java:101)
	at org.apache.maven.lifecycle.internal.MojoExecutor.execute(MojoExecutor.java:209)
	... 27 more
Sending e-mails to: ctakes-notifications@incubator.apache.org mattcoarr@gmail.com pei@peistation.com
channel stopped

Mime
View raw message