ctakes-notifications mailing list archives

Site index · List index
Message view « Date » · « Thread »
Top « Date » · « Thread »
From Apache Jenkins Server <jenk...@builds.apache.org>
Subject Build failed in Jenkins: cTAKES-trunk » Apache cTAKES Assertion #17
Date Mon, 22 Oct 2012 07:24:10 GMT
See <https://builds.apache.org/job/cTAKES-trunk/org.apache.ctakes$ctakes-assertion/17/changes>

Changes:

[james-masanz] CTAKES-87 - Merge in assertion code from SF.net SVN that was not captured in
the svndump

------------------------------------------
projectStarted org.apache.ctakes:ctakes-assertion:3.0.0-incubating-SNAPSHOT
[INFO]                                                                         
[INFO] ------------------------------------------------------------------------
[INFO] Building Apache cTAKES Assertion 3.0.0-incubating-SNAPSHOT
[INFO] ------------------------------------------------------------------------
Downloading: https://oss.sonatype.org/content/repositories/snapshots/junit/junit/maven-metadata.xml
Downloaded: https://oss.sonatype.org/content/repositories/snapshots/junit/junit/maven-metadata.xml
(369 B at 0.0 KB/sec)
mojoStarted org.apache.maven.plugins:maven-resources-plugin:2.5(default-resources)[debug]
execute contextualize
[INFO] Using 'UTF-8' encoding to copy filtered resources.

[INFO] 
[INFO] --- maven-resources-plugin:2.5:resources (default-resources) @ ctakes-assertion ---
[INFO] Copying 6 resources
mojoSucceeded org.apache.maven.plugins:maven-resources-plugin:2.5(default-resources)
Oct 22, 2012 7:18:00 AM hudson.maven.ExecutedMojo <init>
WARNING: Failed to getClass for org.codehaus.mojo.exec.ExecJavaMojo
mojoStarted org.codehaus.mojo:exec-maven-plugin:1.2.1(run-jcasgen-ctakes-assertion)
[INFO] 
[INFO] --- exec-maven-plugin:1.2.1:java (run-jcasgen-ctakes-assertion) @ ctakes-assertion
---
log4j: reset attribute= "false".
log4j: Threshold ="null".
log4j: Level value for root is  [DEBUG].
log4j: root level set to DEBUG
log4j: Class name: [org.apache.log4j.ConsoleAppender]
log4j: Parsing layout of class: "org.apache.log4j.PatternLayout"
log4j: Setting property [conversionPattern] to [%d{dd MMM yyyy HH:mm:ss} %5p %c{1} - %m%n].
log4j: Adding appender named [consoleAppender] to category [root].
Oct 22, 2012 7:18:00 AM org.apache.uima.tools.jcasgen.UimaLoggerProgressMonitor subTask(35)
INFO:  >>JCasGen Replacing: 'org.apache.ctakes.assertion.medfacts.types.Concept'.
Oct 22, 2012 7:18:00 AM org.apache.uima.tools.jcasgen.UimaLoggerProgressMonitor subTask(35)
INFO:  >>JCasGen Replacing: 'org.apache.ctakes.assertion.medfacts.types.Concept_Type'.
Oct 22, 2012 7:18:00 AM org.apache.uima.tools.jcasgen.UimaLoggerProgressMonitor subTask(35)
INFO:  >>JCasGen Replacing: 'org.apache.ctakes.assertion.medfacts.types.Assertion'.
Oct 22, 2012 7:18:00 AM org.apache.uima.tools.jcasgen.UimaLoggerProgressMonitor subTask(35)
INFO:  >>JCasGen Replacing: 'org.apache.ctakes.assertion.medfacts.types.Assertion_Type'.
mojoSucceeded org.codehaus.mojo:exec-maven-plugin:1.2.1(run-jcasgen-ctakes-assertion)
mojoStarted org.codehaus.mojo:build-helper-maven-plugin:1.7(add-jcasgen-sources-ctakes-assertion)[INFO]
Source directory: <https://builds.apache.org/job/cTAKES-trunk/org.apache.ctakes$ctakes-assertion/ws/target/generated-sources/jcasgen>
added.

[INFO] 
[INFO] --- build-helper-maven-plugin:1.7:add-source (add-jcasgen-sources-ctakes-assertion)
@ ctakes-assertion ---
mojoSucceeded org.codehaus.mojo:build-helper-maven-plugin:1.7(add-jcasgen-sources-ctakes-assertion)
mojoStarted org.apache.maven.plugins:maven-compiler-plugin:2.4(default-compile)
[INFO] 
[INFO] --- maven-compiler-plugin:2.4:compile (default-compile) @ ctakes-assertion ---
[INFO] Compiling 8 source files to <https://builds.apache.org/job/cTAKES-trunk/org.apache.ctakes$ctakes-assertion/ws/target/classes>
[INFO] -------------------------------------------------------------
[ERROR] COMPILATION ERROR : 
[INFO] -------------------------------------------------------------
[ERROR] <https://builds.apache.org/job/cTAKES-trunk/org.apache.ctakes$ctakes-assertion/ws/src/main/java/org/apache/ctakes/assertion/medfacts/cleartk/AssertionCleartkAnalysisEngine.java>:[34,29]
[deprecation] org.cleartk.classifier.CleartkAnnotatorDescriptionFactory in org.cleartk.classifier
has been deprecated
[ERROR] <https://builds.apache.org/job/cTAKES-trunk/org.apache.ctakes$ctakes-assertion/ws/src/main/java/org/apache/ctakes/assertion/medfacts/cleartk/AssertionCleartkAnalysisEngine.java>:[37,47]
[deprecation] org.cleartk.classifier.feature.extractor.ContextExtractor in org.cleartk.classifier.feature.extractor
has been deprecated
[ERROR] <https://builds.apache.org/job/cTAKES-trunk/org.apache.ctakes$ctakes-assertion/ws/src/main/java/org/apache/ctakes/assertion/medfacts/cleartk/AssertionCleartkAnalysisEngine.java>:[38,47]
[deprecation] org.cleartk.classifier.feature.extractor.ContextExtractor in org.cleartk.classifier.feature.extractor
has been deprecated
[ERROR] <https://builds.apache.org/job/cTAKES-trunk/org.apache.ctakes$ctakes-assertion/ws/src/main/java/org/apache/ctakes/assertion/medfacts/cleartk/AssertionCleartkAnalysisEngine.java>:[38,47]
[deprecation] org.cleartk.classifier.feature.extractor.ContextExtractor in org.cleartk.classifier.feature.extractor
has been deprecated
mojoFailed org.apache.maven.plugins:maven-compiler-plugin:2.4(default-compile)[ERROR] <https://builds.apache.org/job/cTAKES-trunk/org.apache.ctakes$ctakes-assertion/ws/src/main/java/org/apache/ctakes/assertion/medfacts/cleartk/AssertionCleartkAnalysisEngine.java>:[39,47]
[deprecation] org.cleartk.classifier.feature.extractor.ContextExtractor in org.cleartk.classifier.feature.extractor
has been deprecated
[ERROR] <https://builds.apache.org/job/cTAKES-trunk/org.apache.ctakes$ctakes-assertion/ws/src/main/java/org/apache/ctakes/assertion/medfacts/cleartk/AssertionCleartkAnalysisEngine.java>:[39,47]
[deprecation] org.cleartk.classifier.feature.extractor.ContextExtractor in org.cleartk.classifier.feature.extractor
has been deprecated

[ERROR] <https://builds.apache.org/job/cTAKES-trunk/org.apache.ctakes$ctakes-assertion/ws/src/main/java/org/apache/ctakes/assertion/medfacts/cleartk/AssertionCleartkAnalysisEngine.java>:[40,47]
[deprecation] org.cleartk.classifier.feature.extractor.ContextExtractor in org.cleartk.classifier.feature.extractor
has been deprecated
[ERROR] <https://builds.apache.org/job/cTAKES-trunk/org.apache.ctakes$ctakes-assertion/ws/src/main/java/org/apache/ctakes/assertion/medfacts/cleartk/AssertionCleartkAnalysisEngine.java>:[40,47]
[deprecation] org.cleartk.classifier.feature.extractor.ContextExtractor in org.cleartk.classifier.feature.extractor
has been deprecated
[ERROR] <https://builds.apache.org/job/cTAKES-trunk/org.apache.ctakes$ctakes-assertion/ws/src/main/java/org/apache/ctakes/assertion/medfacts/cleartk/AssertionCleartkAnalysisEngine.java>:[43,54]
[deprecation] org.cleartk.classifier.feature.extractor.simple.SpannedTextExtractor in org.cleartk.classifier.feature.extractor.simple
has been deprecated
[ERROR] <https://builds.apache.org/job/cTAKES-trunk/org.apache.ctakes$ctakes-assertion/ws/src/main/java/org/apache/ctakes/assertion/medfacts/cleartk/AssertionCleartkAnalysisEngine.java>:[45,49]
[deprecation] org.cleartk.classifier.feature.proliferate.CapitalTypeProliferator in org.cleartk.classifier.feature.proliferate
has been deprecated
[ERROR] <https://builds.apache.org/job/cTAKES-trunk/org.apache.ctakes$ctakes-assertion/ws/src/main/java/org/apache/ctakes/assertion/medfacts/cleartk/AssertionCleartkAnalysisEngine.java>:[46,49]
[deprecation] org.cleartk.classifier.feature.proliferate.CharacterNGramProliferator in org.cleartk.classifier.feature.proliferate
has been deprecated
[ERROR] <https://builds.apache.org/job/cTAKES-trunk/org.apache.ctakes$ctakes-assertion/ws/src/main/java/org/apache/ctakes/assertion/medfacts/cleartk/AssertionCleartkAnalysisEngine.java>:[47,49]
[deprecation] org.cleartk.classifier.feature.proliferate.LowerCaseProliferator in org.cleartk.classifier.feature.proliferate
has been deprecated
[ERROR] <https://builds.apache.org/job/cTAKES-trunk/org.apache.ctakes$ctakes-assertion/ws/src/main/java/org/apache/ctakes/assertion/medfacts/cleartk/AssertionCleartkAnalysisEngine.java>:[48,49]
[deprecation] org.cleartk.classifier.feature.proliferate.NumericTypeProliferator in org.cleartk.classifier.feature.proliferate
has been deprecated
[ERROR] <https://builds.apache.org/job/cTAKES-trunk/org.apache.ctakes$ctakes-assertion/ws/src/main/java/org/apache/ctakes/assertion/medfacts/cleartk/AssertionCleartkAnalysisEngine.java>:[49,49]
[deprecation] org.cleartk.classifier.feature.proliferate.ProliferatingExtractor in org.cleartk.classifier.feature.proliferate
has been deprecated
[ERROR] <https://builds.apache.org/job/cTAKES-trunk/org.apache.ctakes$ctakes-assertion/ws/src/main/java/org/apache/ctakes/assertion/medfacts/cleartk/AssertionCleartkAnalysisEngine.java>:[50,37]
[deprecation] org.cleartk.classifier.opennlp.DefaultMaxentDataWriterFactory in org.cleartk.classifier.opennlp
has been deprecated
[ERROR] <https://builds.apache.org/job/cTAKES-trunk/org.apache.ctakes$ctakes-assertion/ws/src/main/java/org/apache/ctakes/assertion/medfacts/cleartk/AssertionCleartkAnalysisEngine.java>:[51,37]
[deprecation] org.cleartk.classifier.opennlp.MaxentDataWriterFactory_ImplBase in org.cleartk.classifier.opennlp
has been deprecated
[ERROR] <https://builds.apache.org/job/cTAKES-trunk/org.apache.ctakes$ctakes-assertion/ws/src/main/java/org/apache/ctakes/assertion/medfacts/cleartk/AssertionCleartkAnalysisEngine.java>:[67,15]
[deprecation] org.cleartk.classifier.feature.extractor.ContextExtractor in org.cleartk.classifier.feature.extractor
has been deprecated
[ERROR] <https://builds.apache.org/job/cTAKES-trunk/org.apache.ctakes$ctakes-assertion/ws/src/main/java/org/apache/ctakes/assertion/medfacts/cleartk/AssertionCleartkAnalysisEngine.java>:[68,15]
[deprecation] org.cleartk.classifier.feature.extractor.ContextExtractor in org.cleartk.classifier.feature.extractor
has been deprecated
[ERROR] <https://builds.apache.org/job/cTAKES-trunk/org.apache.ctakes$ctakes-assertion/ws/src/main/java/org/apache/ctakes/assertion/medfacts/Converti2b2AnnotationsToCTAKES.java>:[78,16]
cannot find symbol
symbol  : class Logger
location: class org.apache.ctakes.assertion.medfacts.Converti2b2AnnotationsToCTAKES
[ERROR] <https://builds.apache.org/job/cTAKES-trunk/org.apache.ctakes$ctakes-assertion/ws/src/main/java/org/apache/ctakes/assertion/medfacts/Converti2b2AnnotationsToCTAKES.java>:[114,110]
cannot find symbol
symbol  : class AnalysisEngineProcessException
location: class org.apache.ctakes.assertion.medfacts.Converti2b2AnnotationsToCTAKES
[ERROR] <https://builds.apache.org/job/cTAKES-trunk/org.apache.ctakes$ctakes-assertion/ws/src/main/java/org/apache/ctakes/assertion/medfacts/Converti2b2AnnotationsToCTAKES.java>:[236,6]
cannot find symbol
symbol  : class IdentifiedAnnotation
location: class org.apache.ctakes.assertion.medfacts.Converti2b2AnnotationsToCTAKES
[ERROR] <https://builds.apache.org/job/cTAKES-trunk/org.apache.ctakes$ctakes-assertion/ws/src/main/java/org/apache/ctakes/assertion/medfacts/ConceptLookup.java>:[164,63]
cannot find symbol
symbol  : class JCas
location: class org.apache.ctakes.assertion.medfacts.ConceptLookup
[ERROR] <https://builds.apache.org/job/cTAKES-trunk/org.apache.ctakes$ctakes-assertion/ws/src/main/java/org/apache/ctakes/assertion/medfacts/cleartk/AssertionCleartkAnalysisEngine.java>:[74,20]
[deprecation] org.cleartk.classifier.feature.proliferate.CharacterNGramProliferator in org.cleartk.classifier.feature.proliferate
has been deprecated
[ERROR] <https://builds.apache.org/job/cTAKES-trunk/org.apache.ctakes$ctakes-assertion/ws/src/main/java/org/apache/ctakes/assertion/medfacts/cleartk/AssertionCleartkAnalysisEngine.java>:[82,12]
[deprecation] org.cleartk.classifier.feature.proliferate.ProliferatingExtractor in org.cleartk.classifier.feature.proliferate
has been deprecated
[ERROR] <https://builds.apache.org/job/cTAKES-trunk/org.apache.ctakes$ctakes-assertion/ws/src/main/java/org/apache/ctakes/assertion/medfacts/cleartk/AssertionCleartkAnalysisEngine.java>:[83,16]
[deprecation] org.cleartk.classifier.feature.extractor.simple.SpannedTextExtractor in org.cleartk.classifier.feature.extractor.simple
has been deprecated
[ERROR] <https://builds.apache.org/job/cTAKES-trunk/org.apache.ctakes$ctakes-assertion/ws/src/main/java/org/apache/ctakes/assertion/medfacts/cleartk/AssertionCleartkAnalysisEngine.java>:[84,16]
[deprecation] org.cleartk.classifier.feature.proliferate.LowerCaseProliferator in org.cleartk.classifier.feature.proliferate
has been deprecated
[ERROR] <https://builds.apache.org/job/cTAKES-trunk/org.apache.ctakes$ctakes-assertion/ws/src/main/java/org/apache/ctakes/assertion/medfacts/cleartk/AssertionCleartkAnalysisEngine.java>:[85,16]
[deprecation] org.cleartk.classifier.feature.proliferate.CapitalTypeProliferator in org.cleartk.classifier.feature.proliferate
has been deprecated
[ERROR] <https://builds.apache.org/job/cTAKES-trunk/org.apache.ctakes$ctakes-assertion/ws/src/main/java/org/apache/ctakes/assertion/medfacts/cleartk/AssertionCleartkAnalysisEngine.java>:[86,16]
[deprecation] org.cleartk.classifier.feature.proliferate.NumericTypeProliferator in org.cleartk.classifier.feature.proliferate
has been deprecated
[ERROR] <https://builds.apache.org/job/cTAKES-trunk/org.apache.ctakes$ctakes-assertion/ws/src/main/java/org/apache/ctakes/assertion/medfacts/cleartk/AssertionCleartkAnalysisEngine.java>:[87,16]
[deprecation] org.cleartk.classifier.feature.proliferate.CharacterNGramProliferator in org.cleartk.classifier.feature.proliferate
has been deprecated
[ERROR] <https://builds.apache.org/job/cTAKES-trunk/org.apache.ctakes$ctakes-assertion/ws/src/main/java/org/apache/ctakes/assertion/medfacts/cleartk/AssertionCleartkAnalysisEngine.java>:[88,16]
[deprecation] org.cleartk.classifier.feature.proliferate.CharacterNGramProliferator in org.cleartk.classifier.feature.proliferate
has been deprecated
[ERROR] <https://builds.apache.org/job/cTAKES-trunk/org.apache.ctakes$ctakes-assertion/ws/src/main/java/org/apache/ctakes/assertion/medfacts/cleartk/AssertionCleartkAnalysisEngine.java>:[91,50]
[deprecation] org.cleartk.classifier.feature.extractor.ContextExtractor in org.cleartk.classifier.feature.extractor
has been deprecated
[ERROR] <https://builds.apache.org/job/cTAKES-trunk/org.apache.ctakes$ctakes-assertion/ws/src/main/java/org/apache/ctakes/assertion/medfacts/cleartk/AssertionCleartkAnalysisEngine.java>:[92,42]
[deprecation] org.cleartk.classifier.feature.extractor.ContextExtractor in org.cleartk.classifier.feature.extractor
has been deprecated
[ERROR] <https://builds.apache.org/job/cTAKES-trunk/org.apache.ctakes$ctakes-assertion/ws/src/main/java/org/apache/ctakes/assertion/medfacts/cleartk/AssertionCleartkAnalysisEngine.java>:[98,4]
[deprecation] org.cleartk.classifier.feature.extractor.ContextExtractor in org.cleartk.classifier.feature.extractor
has been deprecated
[ERROR] <https://builds.apache.org/job/cTAKES-trunk/org.apache.ctakes$ctakes-assertion/ws/src/main/java/org/apache/ctakes/assertion/medfacts/cleartk/AssertionCleartkAnalysisEngine.java>:[98,61]
[deprecation] org.cleartk.classifier.feature.extractor.ContextExtractor in org.cleartk.classifier.feature.extractor
has been deprecated
[ERROR] <https://builds.apache.org/job/cTAKES-trunk/org.apache.ctakes$ctakes-assertion/ws/src/main/java/org/apache/ctakes/assertion/medfacts/cleartk/AssertionCleartkAnalysisEngine.java>:[100,12]
[deprecation] org.cleartk.classifier.feature.extractor.simple.SpannedTextExtractor in org.cleartk.classifier.feature.extractor.simple
has been deprecated
[ERROR] <https://builds.apache.org/job/cTAKES-trunk/org.apache.ctakes$ctakes-assertion/ws/src/main/java/org/apache/ctakes/assertion/medfacts/cleartk/AssertionCleartkAnalysisEngine.java>:[101,12]
[deprecation] org.cleartk.classifier.feature.extractor.ContextExtractor in org.cleartk.classifier.feature.extractor
has been deprecated
[ERROR] <https://builds.apache.org/job/cTAKES-trunk/org.apache.ctakes$ctakes-assertion/ws/src/main/java/org/apache/ctakes/assertion/medfacts/cleartk/AssertionCleartkAnalysisEngine.java>:[103,12]
[deprecation] org.cleartk.classifier.feature.extractor.ContextExtractor in org.cleartk.classifier.feature.extractor
has been deprecated
[ERROR] <https://builds.apache.org/job/cTAKES-trunk/org.apache.ctakes$ctakes-assertion/ws/src/main/java/org/apache/ctakes/assertion/medfacts/cleartk/AssertionCleartkAnalysisEngine.java>:[104,12]
[deprecation] org.cleartk.classifier.feature.extractor.ContextExtractor in org.cleartk.classifier.feature.extractor
has been deprecated
[ERROR] <https://builds.apache.org/job/cTAKES-trunk/org.apache.ctakes$ctakes-assertion/ws/src/main/java/org/apache/ctakes/assertion/medfacts/cleartk/AssertionCleartkAnalysisEngine.java>:[106,12]
[deprecation] org.cleartk.classifier.feature.extractor.ContextExtractor in org.cleartk.classifier.feature.extractor
has been deprecated
[ERROR] <https://builds.apache.org/job/cTAKES-trunk/org.apache.ctakes$ctakes-assertion/ws/src/main/java/org/apache/ctakes/assertion/medfacts/cleartk/AssertionCleartkAnalysisEngine.java>:[108,12]
[deprecation] org.cleartk.classifier.feature.extractor.ContextExtractor in org.cleartk.classifier.feature.extractor
has been deprecated
[ERROR] <https://builds.apache.org/job/cTAKES-trunk/org.apache.ctakes$ctakes-assertion/ws/src/main/java/org/apache/ctakes/assertion/medfacts/cleartk/AssertionCleartkAnalysisEngine.java>:[109,12]
[deprecation] org.cleartk.classifier.feature.extractor.ContextExtractor in org.cleartk.classifier.feature.extractor
has been deprecated
[ERROR] <https://builds.apache.org/job/cTAKES-trunk/org.apache.ctakes$ctakes-assertion/ws/src/main/java/org/apache/ctakes/assertion/medfacts/cleartk/AssertionCleartkAnalysisEngine.java>:[111,12]
[deprecation] org.cleartk.classifier.feature.extractor.ContextExtractor in org.cleartk.classifier.feature.extractor
has been deprecated
[ERROR] <https://builds.apache.org/job/cTAKES-trunk/org.apache.ctakes$ctakes-assertion/ws/src/main/java/org/apache/ctakes/assertion/medfacts/cleartk/AssertionCleartkAnalysisEngine.java>:[114,50]
[deprecation] org.cleartk.classifier.feature.extractor.ContextExtractor in org.cleartk.classifier.feature.extractor
has been deprecated
[ERROR] <https://builds.apache.org/job/cTAKES-trunk/org.apache.ctakes$ctakes-assertion/ws/src/main/java/org/apache/ctakes/assertion/medfacts/cleartk/AssertionCleartkAnalysisEngine.java>:[118,4]
[deprecation] org.cleartk.classifier.feature.extractor.ContextExtractor in org.cleartk.classifier.feature.extractor
has been deprecated
[ERROR] <https://builds.apache.org/job/cTAKES-trunk/org.apache.ctakes$ctakes-assertion/ws/src/main/java/org/apache/ctakes/assertion/medfacts/cleartk/AssertionCleartkAnalysisEngine.java>:[118,49]
[deprecation] org.cleartk.classifier.feature.extractor.ContextExtractor in org.cleartk.classifier.feature.extractor
has been deprecated
[ERROR] <https://builds.apache.org/job/cTAKES-trunk/org.apache.ctakes$ctakes-assertion/ws/src/main/java/org/apache/ctakes/assertion/medfacts/cleartk/AssertionCleartkAnalysisEngine.java>:[121,12]
[deprecation] org.cleartk.classifier.feature.extractor.ContextExtractor in org.cleartk.classifier.feature.extractor
has been deprecated
[ERROR] <https://builds.apache.org/job/cTAKES-trunk/org.apache.ctakes$ctakes-assertion/ws/src/main/java/org/apache/ctakes/assertion/medfacts/cleartk/AssertionCleartkAnalysisEngine.java>:[122,12]
[deprecation] org.cleartk.classifier.feature.extractor.ContextExtractor in org.cleartk.classifier.feature.extractor
has been deprecated
projectFailed org.apache.ctakes:ctakes-assertion:3.0.0-incubating-SNAPSHOT[ERROR] <https://builds.apache.org/job/cTAKES-trunk/org.apache.ctakes$ctakes-assertion/ws/src/main/java/org/apache/ctakes/assertion/medfacts/cleartk/AssertionCleartkAnalysisEngine.java>:[123,12]
[deprecation] org.cleartk.classifier.feature.extractor.ContextExtractor in org.cleartk.classifier.feature.extractor
has been deprecated

[ERROR] <https://builds.apache.org/job/cTAKES-trunk/org.apache.ctakes$ctakes-assertion/ws/src/main/java/org/apache/ctakes/assertion/medfacts/cleartk/AssertionCleartkAnalysisEngine.java>:[124,12]
[deprecation] org.cleartk.classifier.feature.extractor.ContextExtractor in org.cleartk.classifier.feature.extractor
has been deprecated
[ERROR] <https://builds.apache.org/job/cTAKES-trunk/org.apache.ctakes$ctakes-assertion/ws/src/main/java/org/apache/ctakes/assertion/medfacts/cleartk/AssertionCleartkAnalysisEngine.java>:[125,12]
[deprecation] org.cleartk.classifier.feature.extractor.ContextExtractor in org.cleartk.classifier.feature.extractor
has been deprecated
[ERROR] <https://builds.apache.org/job/cTAKES-trunk/org.apache.ctakes$ctakes-assertion/ws/src/main/java/org/apache/ctakes/assertion/medfacts/cleartk/AssertionCleartkAnalysisEngine.java>:[170,11]
[deprecation] org.cleartk.classifier.feature.extractor.ContextExtractor in org.cleartk.classifier.feature.extractor
has been deprecated
[ERROR] <https://builds.apache.org/job/cTAKES-trunk/org.apache.ctakes$ctakes-assertion/ws/src/main/java/org/apache/ctakes/assertion/medfacts/cleartk/AssertionCleartkAnalysisEngine.java>:[173,11]
[deprecation] org.cleartk.classifier.feature.extractor.ContextExtractor in org.cleartk.classifier.feature.extractor
has been deprecated
[ERROR] <https://builds.apache.org/job/cTAKES-trunk/org.apache.ctakes$ctakes-assertion/ws/src/main/java/org/apache/ctakes/assertion/medfacts/Converti2b2AnnotationsToCTAKES.java>:[78,32]
cannot find symbol
symbol  : variable Logger
location: class org.apache.ctakes.assertion.medfacts.Converti2b2AnnotationsToCTAKES
[ERROR] <https://builds.apache.org/job/cTAKES-trunk/org.apache.ctakes$ctakes-assertion/ws/src/main/java/org/apache/ctakes/assertion/medfacts/Converti2b2AnnotationsToCTAKES.java>:[194,4]
cannot find symbol
symbol  : class ConceptType
location: class org.apache.ctakes.assertion.medfacts.Converti2b2AnnotationsToCTAKES
[ERROR] <https://builds.apache.org/job/cTAKES-trunk/org.apache.ctakes$ctakes-assertion/ws/src/main/java/org/apache/ctakes/assertion/medfacts/Converti2b2AnnotationsToCTAKES.java>:[196,4]
cannot find symbol
symbol  : class IdentifiedAnnotation
location: class org.apache.ctakes.assertion.medfacts.Converti2b2AnnotationsToCTAKES
[ERROR] <https://builds.apache.org/job/cTAKES-trunk/org.apache.ctakes$ctakes-assertion/ws/src/main/java/org/apache/ctakes/assertion/medfacts/Converti2b2AnnotationsToCTAKES.java>:[197,27]
cannot find symbol
symbol  : variable ConceptType
location: class org.apache.ctakes.assertion.medfacts.Converti2b2AnnotationsToCTAKES
[ERROR] <https://builds.apache.org/job/cTAKES-trunk/org.apache.ctakes$ctakes-assertion/ws/src/main/java/org/apache/ctakes/assertion/medfacts/Converti2b2AnnotationsToCTAKES.java>:[199,33]
cannot find symbol
symbol  : class EventMention
location: class org.apache.ctakes.assertion.medfacts.Converti2b2AnnotationsToCTAKES
[ERROR] <https://builds.apache.org/job/cTAKES-trunk/org.apache.ctakes$ctakes-assertion/ws/src/main/java/org/apache/ctakes/assertion/medfacts/Converti2b2AnnotationsToCTAKES.java>:[202,33]
cannot find symbol
symbol  : class EntityMention
location: class org.apache.ctakes.assertion.medfacts.Converti2b2AnnotationsToCTAKES
[ERROR] <https://builds.apache.org/job/cTAKES-trunk/org.apache.ctakes$ctakes-assertion/ws/src/main/java/org/apache/ctakes/assertion/medfacts/Converti2b2AnnotationsToCTAKES.java>:[221,4]
cannot find symbol
symbol  : class FSArray
location: class org.apache.ctakes.assertion.medfacts.Converti2b2AnnotationsToCTAKES
[INFO] 59 errors 
[INFO] -------------------------------------------------------------

Mime
View raw message