ctakes-dev mailing list archives

Site index · List index
Message view « Date » · « Thread »
Top « Date » · « Thread »
From WP Roshan <suno...@gmail.com>
Subject [INFO] Apache cTAKES Dependency Parser ........ FAILURE [ 6.613 s]
Date Thu, 01 Sep 2016 04:31:25 GMT
Hi All,

I got following error when Im do "mvn clean install" Apache-cTakes-3.2.3
current issues at https://svn.apache.org/repos/asf/ctakes/trunk/


[INFO] Apache cTAKES Dependency Parser .................... FAILURE [
 6.613 s]
....................................................
[ERROR] Failed to execute goal
org.apache.maven.plugins:maven-surefire-plugin:2.12.1:test (default-test)
on project ctakes-dependency-parser: There are test failures.

Does anybody knows how to tackle this error ? the complete mvn clean
install log attached with email.

Roshan

-- 
SunONE

Mime
View raw message