ctakes-dev mailing list archives

Site index · List index
Message view « Date » · « Thread »
Top « Date » · « Thread »
From Bandeep Singh <bsi...@phemi.com>
Subject Re: [INFO] Apache cTAKES Dependency Parser ........ FAILURE [ 6.613 s]
Date Thu, 01 Sep 2016 04:38:00 GMT
Just run the maven command with -DskipTests parameter.
I had the same issue recently, the build itself doesn't have any issues.

On 31-Aug-2016 21:31, "WP Roshan" <sunone5@gmail.com> wrote:

> Hi All,
>
> I got following error when Im do "mvn clean install" Apache-cTakes-3.2.3
> current issues at https://svn.apache.org/repos/asf/ctakes/trunk/
>
>
> [INFO] Apache cTAKES Dependency Parser .................... FAILURE [
>  6.613 s]
> ....................................................
> [ERROR] Failed to execute goal org.apache.maven.plugins:
> maven-surefire-plugin:2.12.1:test (default-test) on project
> ctakes-dependency-parser: There are test failures.
>
> Does anybody knows how to tackle this error ? the complete mvn clean
> install log attached with email.
>
> Roshan
>
> --
> SunONE
>

Mime
  • Unnamed multipart/alternative (inline, None, 0 bytes)
View raw message