ctakes-dev mailing list archives

Site index · List index
Message view « Date » · « Thread »
Top « Date » · « Thread »
From Pei Chen <chen...@apache.org>
Subject Re: Build failed in Jenkins: ctakes-trunk-package #257
Date Mon, 08 Sep 2014 17:23:04 GMT
Hi Kim,
Jenkins occasionally get's timeouts when trying to upload artifacts to
the nightly snapshots.
I just kicked it off manually, and all seems okay.

On Mon, Sep 8, 2014 at 12:56 PM, Kim Ebert
<kim.ebert@perfectsearchcorp.com> wrote:
> Is there anything we need to do to get the build back to normal?
>
> Return code is: 503 , ReasonPhrase:Service Temporarily Unavailable.
>
>
> Kim Ebert
> 1.801.669.7342
> Perfect Search Corp
> http://www.perfectsearchcorp.com/
>
> On 09/06/2014 05:57 AM, Apache Jenkins Server wrote:
>> See <https://builds.apache.org/job/ctakes-trunk-package/257/changes>
>>
>> Changes:
>>
>> [kebert] CTAKES-310 fix to make it so all permutations are available and used.
>>
>> ------------------------------------------
>> [...truncated 9269 lines...]
>> [JENKINS] Archiving <https://builds.apache.org/job/ctakes-trunk-package/ws/ctakes-assertion-zoner-res/target/ctakes-assertion-zoner-res-3.2.1-SNAPSHOT.jar>
to org.apache.ctakes/ctakes-assertion-zoner-res/3.2.1-SNAPSHOT/ctakes-assertion-zoner-res-3.2.1-SNAPSHOT.jar
>> Sending artifact delta relative to ctakes-trunk-package ? Apache cTAKES Resources
assertion-zoner #256
>> Archived 2 artifacts
>> Archive block size is 32768
>> Received 0 blocks and 40838 bytes
>> Compression is 0.0%
>> Took 0.13 sec
>> [JENKINS] Archiving <https://builds.apache.org/job/ctakes-trunk-package/ws/ctakes-examples/pom.xml>
to org.apache.ctakes/ctakes-examples/3.2.1-SNAPSHOT/ctakes-examples-3.2.1-SNAPSHOT.pom
>> [JENKINS] Archiving <https://builds.apache.org/job/ctakes-trunk-package/ws/ctakes-examples/target/ctakes-examples-3.2.1-SNAPSHOT.jar>
to org.apache.ctakes/ctakes-examples/3.2.1-SNAPSHOT/ctakes-examples-3.2.1-SNAPSHOT.jar
>> Sending artifact delta relative to ctakes-trunk-package ? ctakes-examples #256
>> Archived 2 artifacts
>> Archive block size is 32768
>> Received 0 blocks and 16876 bytes
>> Compression is 0.0%
>> Took 0.13 sec
>> [JENKINS] Archiving <https://builds.apache.org/job/ctakes-trunk-package/ws/ctakes-utils/pom.xml>
to org.apache.ctakes/ctakes-utils/3.2.1-SNAPSHOT/ctakes-utils-3.2.1-SNAPSHOT.pom
>> [JENKINS] Archiving <https://builds.apache.org/job/ctakes-trunk-package/ws/ctakes-utils/target/ctakes-utils-3.2.1-SNAPSHOT.jar>
to org.apache.ctakes/ctakes-utils/3.2.1-SNAPSHOT/ctakes-utils-3.2.1-SNAPSHOT.jar
>> Sending artifact delta relative to ctakes-trunk-package ? Apache cTAKES utils #256
>> Archived 2 artifacts
>> Archive block size is 32768
>> Received 0 blocks and 72944 bytes
>> Compression is 0.0%
>> Took 0.14 sec
>> [JENKINS] Archiving <https://builds.apache.org/job/ctakes-trunk-package/ws/ctakes-side-effect-res/pom.xml>
to org.apache.ctakes/ctakes-side-effect-res/3.2.1-SNAPSHOT/ctakes-side-effect-res-3.2.1-SNAPSHOT.pom
>> [JENKINS] Archiving <https://builds.apache.org/job/ctakes-trunk-package/ws/ctakes-side-effect-res/target/ctakes-side-effect-res-3.2.1-SNAPSHOT.jar>
to org.apache.ctakes/ctakes-side-effect-res/3.2.1-SNAPSHOT/ctakes-side-effect-res-3.2.1-SNAPSHOT.jar
>> Sending artifact delta relative to ctakes-trunk-package ? Apache cTAKES Resources
side-effect #256
>> Archived 2 artifacts
>> Archive block size is 32768
>> Received 0 blocks and 28550 bytes
>> Compression is 0.0%
>> Took 76 ms
>> [JENKINS] Archiving <https://builds.apache.org/job/ctakes-trunk-package/ws/ctakes-constituency-parser-res/pom.xml>
to org.apache.ctakes/ctakes-constituency-parser-res/3.2.1-SNAPSHOT/ctakes-constituency-parser-res-3.2.1-SNAPSHOT.pom
>> [JENKINS] Archiving <https://builds.apache.org/job/ctakes-trunk-package/ws/ctakes-constituency-parser-res/target/ctakes-constituency-parser-res-3.2.1-SNAPSHOT.jar>
to org.apache.ctakes/ctakes-constituency-parser-res/3.2.1-SNAPSHOT/ctakes-constituency-parser-res-3.2.1-SNAPSHOT.jar
>> Sending artifact delta relative to ctakes-trunk-package ? Apache cTAKES Resources
constituency-parser #256
>> Archived 2 artifacts
>> Archive block size is 32768
>> Received 1025 blocks and 121524 bytes
>> Compression is 99.6%
>> Took 2.9 sec
>> [JENKINS] Archiving <https://builds.apache.org/job/ctakes-trunk-package/ws/ctakes-lvg/pom.xml>
to org.apache.ctakes/ctakes-lvg/3.2.1-SNAPSHOT/ctakes-lvg-3.2.1-SNAPSHOT.pom
>> [JENKINS] Archiving <https://builds.apache.org/job/ctakes-trunk-package/ws/ctakes-lvg/target/ctakes-lvg-3.2.1-SNAPSHOT.jar>
to org.apache.ctakes/ctakes-lvg/3.2.1-SNAPSHOT/ctakes-lvg-3.2.1-SNAPSHOT.jar
>> Sending artifact delta relative to ctakes-trunk-package ? Apache cTAKES LVG lexical
tools #256
>> Archived 2 artifacts
>> Archive block size is 32768
>> Received 0 blocks and 30340 bytes
>> Compression is 0.0%
>> Took 0.16 sec
>> [JENKINS] Archiving <https://builds.apache.org/job/ctakes-trunk-package/ws/ctakes-ytex-web/pom.xml>
to org.apache.ctakes/ctakes-ytex-web/3.2.1-SNAPSHOT/ctakes-ytex-web-3.2.1-SNAPSHOT.pom
>> [JENKINS] Archiving <https://builds.apache.org/job/ctakes-trunk-package/ws/ctakes-ytex-web/target/ctakes-ytex-web-3.2.1-SNAPSHOT.war>
to org.apache.ctakes/ctakes-ytex-web/3.2.1-SNAPSHOT/ctakes-ytex-web-3.2.1-SNAPSHOT.war
>> [JENKINS] Archiving <https://builds.apache.org/job/ctakes-trunk-package/ws/ctakes-ytex-web/target/ctakes-ytex-web-3.2.1-SNAPSHOT-classes.jar>
to org.apache.ctakes/ctakes-ytex-web/3.2.1-SNAPSHOT/ctakes-ytex-web-3.2.1-SNAPSHOT-classes.jar
>> Sending artifact delta relative to ctakes-trunk-package ? Apache cTAKES YTEX Web
#256
>> Archived 3 artifacts
>> Archive block size is 32768
>> Received 1465 blocks and 4343210 bytes
>> Compression is 91.7%
>> Took 5.9 sec
>> [JENKINS] Archiving <https://builds.apache.org/job/ctakes-trunk-package/ws/ctakes-lvg-res/pom.xml>
to org.apache.ctakes/ctakes-lvg-res/3.2.1-SNAPSHOT/ctakes-lvg-res-3.2.1-SNAPSHOT.pom
>> [JENKINS] Archiving <https://builds.apache.org/job/ctakes-trunk-package/ws/ctakes-lvg-res/target/ctakes-lvg-res-3.2.1-SNAPSHOT.jar>
to org.apache.ctakes/ctakes-lvg-res/3.2.1-SNAPSHOT/ctakes-lvg-res-3.2.1-SNAPSHOT.jar
>> Sending artifact delta relative to ctakes-trunk-package ? Apache cTAKES Resources
lvg #256
>> Archived 2 artifacts
>> Archive block size is 32768
>> Received 0 blocks and 9830 bytes
>> Compression is 0.0%
>> Took 0.1 sec
>> [JENKINS] Archiving <https://builds.apache.org/job/ctakes-trunk-package/ws/ctakes-assertion-res/pom.xml>
to org.apache.ctakes/ctakes-assertion-res/3.2.1-SNAPSHOT/ctakes-assertion-res-3.2.1-SNAPSHOT.pom
>> [JENKINS] Archiving <https://builds.apache.org/job/ctakes-trunk-package/ws/ctakes-assertion-res/target/ctakes-assertion-res-3.2.1-SNAPSHOT.jar>
to org.apache.ctakes/ctakes-assertion-res/3.2.1-SNAPSHOT/ctakes-assertion-res-3.2.1-SNAPSHOT.jar
>> Sending artifact delta relative to ctakes-trunk-package ? Apache cTAKES Resources
assertion #256
>> Archived 2 artifacts
>> Archive block size is 32768
>> Received 290 blocks and 315852 bytes
>> Compression is 96.8%
>> Took 0.51 sec
>> [JENKINS] Archiving <https://builds.apache.org/job/ctakes-trunk-package/ws/ctakes-dependency-parser-res/pom.xml>
to org.apache.ctakes/ctakes-dependency-parser-res/3.2.1-SNAPSHOT/ctakes-dependency-parser-res-3.2.1-SNAPSHOT.pom
>> [JENKINS] Archiving <https://builds.apache.org/job/ctakes-trunk-package/ws/ctakes-dependency-parser-res/target/ctakes-dependency-parser-res-3.2.1-SNAPSHOT.jar>
to org.apache.ctakes/ctakes-dependency-parser-res/3.2.1-SNAPSHOT/ctakes-dependency-parser-res-3.2.1-SNAPSHOT.jar
>> Sending artifact delta relative to ctakes-trunk-package ? Apache cTAKES Resources
dependency-parser #256
>> Archived 2 artifacts
>> Archive block size is 32768
>> Received 8288 blocks and 214324 bytes
>> Compression is 99.9%
>> Took 18 sec
>> [JENKINS] Archiving <https://builds.apache.org/job/ctakes-trunk-package/ws/ctakes-assertion/pom.xml>
to org.apache.ctakes/ctakes-assertion/3.2.1-SNAPSHOT/ctakes-assertion-3.2.1-SNAPSHOT.pom
>> [JENKINS] Archiving <https://builds.apache.org/job/ctakes-trunk-package/ws/ctakes-assertion/target/ctakes-assertion-3.2.1-SNAPSHOT.jar>
to org.apache.ctakes/ctakes-assertion/3.2.1-SNAPSHOT/ctakes-assertion-3.2.1-SNAPSHOT.jar
>> Sending artifact delta relative to ctakes-trunk-package ? Apache cTAKES Assertion
#256
>> Archived 2 artifacts
>> Archive block size is 32768
>> Received 0 blocks and 331608 bytes
>> Compression is 0.0%
>> Took 1.9 sec
>> [JENKINS] Archiving <https://builds.apache.org/job/ctakes-trunk-package/ws/ctakes-relation-extractor-res/pom.xml>
to org.apache.ctakes/ctakes-relation-extractor-res/3.2.1-SNAPSHOT/ctakes-relation-extractor-res-3.2.1-SNAPSHOT.pom
>> [JENKINS] Archiving <https://builds.apache.org/job/ctakes-trunk-package/ws/ctakes-relation-extractor-res/target/ctakes-relation-extractor-res-3.2.1-SNAPSHOT.jar>
to org.apache.ctakes/ctakes-relation-extractor-res/3.2.1-SNAPSHOT/ctakes-relation-extractor-res-3.2.1-SNAPSHOT.jar
>> Sending artifact delta relative to ctakes-trunk-package ? Apache cTAKES Resources
relation-extractor #256
>> Archived 2 artifacts
>> Archive block size is 32768
>> Received 174 blocks and 115054 bytes
>> Compression is 98.0%
>> Took 0.35 sec
>> [JENKINS] Archiving <https://builds.apache.org/job/ctakes-trunk-package/ws/ctakes-pos-tagger/pom.xml>
to org.apache.ctakes/ctakes-pos-tagger/3.2.1-SNAPSHOT/ctakes-pos-tagger-3.2.1-SNAPSHOT.pom
>> [JENKINS] Archiving <https://builds.apache.org/job/ctakes-trunk-package/ws/ctakes-pos-tagger/target/ctakes-pos-tagger-3.2.1-SNAPSHOT.jar>
to org.apache.ctakes/ctakes-pos-tagger/3.2.1-SNAPSHOT/ctakes-pos-tagger-3.2.1-SNAPSHOT.jar
>> Sending artifact delta relative to ctakes-trunk-package ? Apache cTAKES part-of-speech
tagger #256
>> Archived 2 artifacts
>> Archive block size is 32768
>> Received 0 blocks and 22671 bytes
>> Compression is 0.0%
>> Took 76 ms
>> [JENKINS] Archiving <https://builds.apache.org/job/ctakes-trunk-package/ws/ctakes-relation-extractor/pom.xml>
to org.apache.ctakes/ctakes-relation-extractor/3.2.1-SNAPSHOT/ctakes-relation-extractor-3.2.1-SNAPSHOT.pom
>> [JENKINS] Archiving <https://builds.apache.org/job/ctakes-trunk-package/ws/ctakes-relation-extractor/target/ctakes-relation-extractor-3.2.1-SNAPSHOT.jar>
to org.apache.ctakes/ctakes-relation-extractor/3.2.1-SNAPSHOT/ctakes-relation-extractor-3.2.1-SNAPSHOT.jar
>> Sending artifact delta relative to ctakes-trunk-package ? Apache cTAKES Relation
Extractor #256
>> Archived 2 artifacts
>> Archive block size is 32768
>> Received 0 blocks and 166876 bytes
>> Compression is 0.0%
>> Took 1.9 sec
>> [JENKINS] Archiving <https://builds.apache.org/job/ctakes-trunk-package/ws/ctakes-ne-contexts-res/pom.xml>
to org.apache.ctakes/ctakes-ne-contexts-res/3.2.1-SNAPSHOT/ctakes-ne-contexts-res-3.2.1-SNAPSHOT.pom
>> [JENKINS] Archiving <https://builds.apache.org/job/ctakes-trunk-package/ws/ctakes-ne-contexts-res/target/ctakes-ne-contexts-res-3.2.1-SNAPSHOT.jar>
to org.apache.ctakes/ctakes-ne-contexts-res/3.2.1-SNAPSHOT/ctakes-ne-contexts-res-3.2.1-SNAPSHOT.jar
>> Sending artifact delta relative to ctakes-trunk-package ? Apache cTAKES Resources
ne-contexts #256
>> Archived 2 artifacts
>> Archive block size is 32768
>> Received 0 blocks and 10347 bytes
>> Compression is 0.0%
>> Took 0.16 sec
>> [JENKINS] Archiving <https://builds.apache.org/job/ctakes-trunk-package/ws/ctakes-constituency-parser/pom.xml>
to org.apache.ctakes/ctakes-constituency-parser/3.2.1-SNAPSHOT/ctakes-constituency-parser-3.2.1-SNAPSHOT.pom
>> [JENKINS] Archiving <https://builds.apache.org/job/ctakes-trunk-package/ws/ctakes-constituency-parser/target/ctakes-constituency-parser-3.2.1-SNAPSHOT.jar>
to org.apache.ctakes/ctakes-constituency-parser/3.2.1-SNAPSHOT/ctakes-constituency-parser-3.2.1-SNAPSHOT.jar
>> Sending artifact delta relative to ctakes-trunk-package ? Apache cTAKES Constituency
Parser #256
>> Archived 2 artifacts
>> Archive block size is 32768
>> Received 0 blocks and 43536 bytes
>> Compression is 0.0%
>> Took 0.16 sec
>> [JENKINS] Archiving <https://builds.apache.org/job/ctakes-trunk-package/ws/ctakes-assertion-zoner/pom.xml>
to org.apache.ctakes/ctakes-assertion-zoner/3.2.1-SNAPSHOT/ctakes-assertion-zoner-3.2.1-SNAPSHOT.pom
>> [JENKINS] Archiving <https://builds.apache.org/job/ctakes-trunk-package/ws/ctakes-assertion-zoner/target/ctakes-assertion-zoner-3.2.1-SNAPSHOT.jar>
to org.apache.ctakes/ctakes-assertion-zoner/3.2.1-SNAPSHOT/ctakes-assertion-zoner-3.2.1-SNAPSHOT.jar
>> Sending artifact delta relative to ctakes-trunk-package ? Apache cTAKES Assertion's
zoner #256
>> Archived 2 artifacts
>> Archive block size is 32768
>> Received 0 blocks and 32751 bytes
>> Compression is 0.0%
>> Took 0.1 sec
>> [JENKINS] Archiving <https://builds.apache.org/job/ctakes-trunk-package/ws/ctakes-drug-ner-res/pom.xml>
to org.apache.ctakes/ctakes-drug-ner-res/3.2.1-SNAPSHOT/ctakes-drug-ner-res-3.2.1-SNAPSHOT.pom
>> [JENKINS] Archiving <https://builds.apache.org/job/ctakes-trunk-package/ws/ctakes-drug-ner-res/target/ctakes-drug-ner-res-3.2.1-SNAPSHOT.jar>
to org.apache.ctakes/ctakes-drug-ner-res/3.2.1-SNAPSHOT/ctakes-drug-ner-res-3.2.1-SNAPSHOT.jar
>> Sending artifact delta relative to ctakes-trunk-package ? Apache cTAKES Resources
drug-ner #256
>> Archived 2 artifacts
>> Archive block size is 32768
>> Received 0 blocks and 42865 bytes
>> Compression is 0.0%
>> Took 78 ms
>> [JENKINS] Archiving <https://builds.apache.org/job/ctakes-trunk-package/ws/ctakes-pos-tagger-res/pom.xml>
to org.apache.ctakes/ctakes-pos-tagger-res/3.2.1-SNAPSHOT/ctakes-pos-tagger-res-3.2.1-SNAPSHOT.pom
>> [JENKINS] Archiving <https://builds.apache.org/job/ctakes-trunk-package/ws/ctakes-pos-tagger-res/target/ctakes-pos-tagger-res-3.2.1-SNAPSHOT.jar>
to org.apache.ctakes/ctakes-pos-tagger-res/3.2.1-SNAPSHOT/ctakes-pos-tagger-res-3.2.1-SNAPSHOT.jar
>> Sending artifact delta relative to ctakes-trunk-package ? Apache cTAKES Resources
pos-tagger #256
>> Archived 2 artifacts
>> Archive block size is 32768
>> Received 358 blocks and 71985 bytes
>> Compression is 99.4%
>> Took 0.74 sec
>> [JENKINS] Archiving <https://builds.apache.org/job/ctakes-trunk-package/ws/ctakes-chunker-res/pom.xml>
to org.apache.ctakes/ctakes-chunker-res/3.2.1-SNAPSHOT/ctakes-chunker-res-3.2.1-SNAPSHOT.pom
>> [JENKINS] Archiving <https://builds.apache.org/job/ctakes-trunk-package/ws/ctakes-chunker-res/target/ctakes-chunker-res-3.2.1-SNAPSHOT.jar>
to org.apache.ctakes/ctakes-chunker-res/3.2.1-SNAPSHOT/ctakes-chunker-res-3.2.1-SNAPSHOT.jar
>> Sending artifact delta relative to ctakes-trunk-package ? Apache cTAKES Resources
ctakes-chunker-res #256
>> Archived 2 artifacts
>> Archive block size is 32768
>> Received 388 blocks and 41392 bytes
>> Compression is 99.7%
>> Took 2.6 sec
>> [JENKINS] Archiving <https://builds.apache.org/job/ctakes-trunk-package/ws/ctakes-ytex/pom.xml>
to org.apache.ctakes/ctakes-ytex/3.2.1-SNAPSHOT/ctakes-ytex-3.2.1-SNAPSHOT.pom
>> [JENKINS] Archiving <https://builds.apache.org/job/ctakes-trunk-package/ws/ctakes-ytex/target/ctakes-ytex-3.2.1-SNAPSHOT.jar>
to org.apache.ctakes/ctakes-ytex/3.2.1-SNAPSHOT/ctakes-ytex-3.2.1-SNAPSHOT.jar
>> Sending artifact delta relative to ctakes-trunk-package ? Apache cTAKES YTEX #256
>> Archived 2 artifacts
>> Archive block size is 32768
>> Received 0 blocks and 429179 bytes
>> Compression is 0.0%
>> Took 0.23 sec
>> [JENKINS] Archiving <https://builds.apache.org/job/ctakes-trunk-package/ws/ctakes-template-filler/pom.xml>
to org.apache.ctakes/ctakes-template-filler/3.2.1-SNAPSHOT/ctakes-template-filler-3.2.1-SNAPSHOT.pom
>> [JENKINS] Archiving <https://builds.apache.org/job/ctakes-trunk-package/ws/ctakes-template-filler/target/ctakes-template-filler-3.2.1-SNAPSHOT.jar>
to org.apache.ctakes/ctakes-template-filler/3.2.1-SNAPSHOT/ctakes-template-filler-3.2.1-SNAPSHOT.jar
>> Sending artifact delta relative to ctakes-trunk-package ? Apache cTAKES template
filler #256
>> Archived 2 artifacts
>> Archive block size is 32768
>> Received 0 blocks and 21250 bytes
>> Compression is 0.0%
>> Took 0.16 sec
>> [JENKINS] Archiving <https://builds.apache.org/job/ctakes-trunk-package/ws/ctakes-type-system/pom.xml>
to org.apache.ctakes/ctakes-type-system/3.2.1-SNAPSHOT/ctakes-type-system-3.2.1-SNAPSHOT.pom
>> [JENKINS] Archiving <https://builds.apache.org/job/ctakes-trunk-package/ws/ctakes-type-system/target/ctakes-type-system-3.2.1-SNAPSHOT.jar>
to org.apache.ctakes/ctakes-type-system/3.2.1-SNAPSHOT/ctakes-type-system-3.2.1-SNAPSHOT.jar
>> Sending artifact delta relative to ctakes-trunk-package ? Apache cTAKES common type
system #256
>> Archived 2 artifacts
>> Archive block size is 32768
>> Received 0 blocks and 578497 bytes
>> Compression is 0.0%
>> Took 0.27 sec
>> [JENKINS] Archiving <https://builds.apache.org/job/ctakes-trunk-package/ws/ctakes-side-effect/pom.xml>
to org.apache.ctakes/ctakes-side-effect/3.2.1-SNAPSHOT/ctakes-side-effect-3.2.1-SNAPSHOT.pom
>> [JENKINS] Archiving <https://builds.apache.org/job/ctakes-trunk-package/ws/ctakes-side-effect/target/ctakes-side-effect-3.2.1-SNAPSHOT.jar>
to org.apache.ctakes/ctakes-side-effect/3.2.1-SNAPSHOT/ctakes-side-effect-3.2.1-SNAPSHOT.jar
>> Sending artifact delta relative to ctakes-trunk-package ? Apache cTAKES Side Effects
#256
>> Archived 2 artifacts
>> Archive block size is 32768
>> Received 0 blocks and 609249 bytes
>> Compression is 0.0%
>> Took 2 sec
>> [JENKINS] Archiving <https://builds.apache.org/job/ctakes-trunk-package/ws/ctakes-context-tokenizer/pom.xml>
to org.apache.ctakes/ctakes-context-tokenizer/3.2.1-SNAPSHOT/ctakes-context-tokenizer-3.2.1-SNAPSHOT.pom
>> [JENKINS] Archiving <https://builds.apache.org/job/ctakes-trunk-package/ws/ctakes-context-tokenizer/target/ctakes-context-tokenizer-3.2.1-SNAPSHOT.jar>
to org.apache.ctakes/ctakes-context-tokenizer/3.2.1-SNAPSHOT/ctakes-context-tokenizer-3.2.1-SNAPSHOT.jar
>> Sending artifact delta relative to ctakes-trunk-package ? Apache cTAKES context dependent
tokenizer #256
>> Archived 2 artifacts
>> Archive block size is 32768
>> Received 0 blocks and 15397 bytes
>> Compression is 0.0%
>> Took 0.13 sec
>> channel stopped
>> No artifacts are recorded for moduleorg.apache.ctakes:ctakes. Is this a Maven project?
>> No artifacts are recorded for moduleorg.apache.ctakes:ctakes-dictionary-lookup-fast.
Is this a Maven project?
>> No artifacts are recorded for moduleorg.apache.ctakes:ctakes-dictionary-lookup-fast-res.
Is this a Maven project?
>> No artifacts are recorded for moduleorg.apache.ctakes:ctakes-distribution. Is this
a Maven project?
>> No artifacts are recorded for moduleorg.apache.ctakes:ctakes-temporal. Is this a
Maven project?
>> No artifacts are recorded for moduleorg.apache.ctakes:ctakes-temporal-res. Is this
a Maven project?
>> Maven RedeployPublisher use remote H11 maven settings from : /home/jenkins/.m2/settings.xml
>> [INFO] Deployment in https://repository.apache.org/content/repositories/snapshots
(id=apache.snapshots.https,uniqueVersion=true)
>> Deploying the main artifact ctakes-assertion-3.2.1-SNAPSHOT.jar
>> Downloading: https://repository.apache.org/content/repositories/snapshots/org/apache/ctakes/ctakes-assertion/3.2.1-SNAPSHOT/maven-metadata.xml
>> ERROR: Failed to retrieve remote metadata org.apache.ctakes:ctakes-assertion:3.2.1-SNAPSHOT/maven-metadata.xml:
Could not transfer metadata org.apache.ctakes:ctakes-assertion:3.2.1-SNAPSHOT/maven-metadata.xml
from/to apache.snapshots.https (https://repository.apache.org/content/repositories/snapshots):
Failed to transfer file: https://repository.apache.org/content/repositories/snapshots/org/apache/ctakes/ctakes-assertion/3.2.1-SNAPSHOT/maven-metadata.xml.
Return code is: 503 , ReasonPhrase:Service Temporarily Unavailable.
>> org.apache.maven.artifact.deployer.ArtifactDeploymentException: Failed to retrieve
remote metadata org.apache.ctakes:ctakes-assertion:3.2.1-SNAPSHOT/maven-metadata.xml: Could
not transfer metadata org.apache.ctakes:ctakes-assertion:3.2.1-SNAPSHOT/maven-metadata.xml
from/to apache.snapshots.https (https://repository.apache.org/content/repositories/snapshots):
Failed to transfer file: https://repository.apache.org/content/repositories/snapshots/org/apache/ctakes/ctakes-assertion/3.2.1-SNAPSHOT/maven-metadata.xml.
Return code is: 503 , ReasonPhrase:Service Temporarily Unavailable.
>>       at org.apache.maven.artifact.deployer.DefaultArtifactDeployer.deploy(DefaultArtifactDeployer.java:143)
>>       at hudson.maven.reporters.MavenArtifactRecord.deploy(MavenArtifactRecord.java:193)
>>       at hudson.maven.RedeployPublisher.perform(RedeployPublisher.java:176)
>>       at hudson.tasks.BuildStepMonitor$1.perform(BuildStepMonitor.java:20)
>>       at hudson.model.AbstractBuild$AbstractBuildExecution.perform(AbstractBuild.java:804)
>>       at hudson.model.AbstractBuild$AbstractBuildExecution.performAllBuildSteps(AbstractBuild.java:776)
>>       at hudson.maven.MavenModuleSetBuild$MavenModuleSetBuildExecution.post2(MavenModuleSetBuild.java:1040)
>>       at hudson.model.AbstractBuild$AbstractBuildExecution.post(AbstractBuild.java:725)
>>       at hudson.model.Run.execute(Run.java:1701)
>>       at hudson.maven.MavenModuleSetBuild.run(MavenModuleSetBuild.java:529)
>>       at hudson.model.ResourceController.execute(ResourceController.java:88)
>>       at hudson.model.Executor.run(Executor.java:231)
>> Caused by: org.eclipse.aether.deployment.DeploymentException: Failed to retrieve
remote metadata org.apache.ctakes:ctakes-assertion:3.2.1-SNAPSHOT/maven-metadata.xml: Could
not transfer metadata org.apache.ctakes:ctakes-assertion:3.2.1-SNAPSHOT/maven-metadata.xml
from/to apache.snapshots.https (https://repository.apache.org/content/repositories/snapshots):
Failed to transfer file: https://repository.apache.org/content/repositories/snapshots/org/apache/ctakes/ctakes-assertion/3.2.1-SNAPSHOT/maven-metadata.xml.
Return code is: 503 , ReasonPhrase:Service Temporarily Unavailable.
>>       at org.eclipse.aether.internal.impl.DefaultDeployer.upload(DefaultDeployer.java:470)
>>       at org.eclipse.aether.internal.impl.DefaultDeployer.deploy(DefaultDeployer.java:314)
>>       at org.eclipse.aether.internal.impl.DefaultDeployer.deploy(DefaultDeployer.java:269)
>>       at org.eclipse.aether.internal.impl.DefaultRepositorySystem.deploy(DefaultRepositorySystem.java:413)
>>       at org.apache.maven.artifact.deployer.DefaultArtifactDeployer.deploy(DefaultArtifactDeployer.java:139)
>>       ... 11 more
>> Caused by: org.eclipse.aether.transfer.MetadataTransferException: Could not transfer
metadata org.apache.ctakes:ctakes-assertion:3.2.1-SNAPSHOT/maven-metadata.xml from/to apache.snapshots.https
(https://repository.apache.org/content/repositories/snapshots): Failed to transfer file: https://repository.apache.org/content/repositories/snapshots/org/apache/ctakes/ctakes-assertion/3.2.1-SNAPSHOT/maven-metadata.xml.
Return code is: 503 , ReasonPhrase:Service Temporarily Unavailable.
>>       at org.eclipse.aether.connector.wagon.WagonRepositoryConnector$5.wrap(WagonRepositoryConnector.java:995)
>>       at org.eclipse.aether.connector.wagon.WagonRepositoryConnector$5.wrap(WagonRepositoryConnector.java:983)
>>       at org.eclipse.aether.connector.wagon.WagonRepositoryConnector$GetTask.run(WagonRepositoryConnector.java:725)
>>       at org.eclipse.aether.util.concurrency.RunnableErrorForwarder$1.run(RunnableErrorForwarder.java:67)
>>       at java.util.concurrent.ThreadPoolExecutor.runWorker(ThreadPoolExecutor.java:1145)
>>       at java.util.concurrent.ThreadPoolExecutor$Worker.run(ThreadPoolExecutor.java:615)
>>       at java.lang.Thread.run(Thread.java:745)
>> Caused by: org.apache.maven.wagon.TransferFailedException: Failed to transfer file:
https://repository.apache.org/content/repositories/snapshots/org/apache/ctakes/ctakes-assertion/3.2.1-SNAPSHOT/maven-metadata.xml.
Return code is: 503 , ReasonPhrase:Service Temporarily Unavailable.
>>       at org.apache.maven.wagon.shared.http4.AbstractHttpClientWagon.fillInputData(AbstractHttpClientWagon.java:945)
>>       at org.apache.maven.wagon.StreamWagon.getInputStream(StreamWagon.java:116)
>>       at org.apache.maven.wagon.StreamWagon.getIfNewer(StreamWagon.java:88)
>>       at org.apache.maven.wagon.StreamWagon.get(StreamWagon.java:61)
>>       at org.eclipse.aether.connector.wagon.WagonRepositoryConnector$GetTask.run(WagonRepositoryConnector.java:660)
>>       ... 4 more
>> [INFO] Deployment failed after 2.6 sec
>> Build step 'Deploy artifacts to Maven repository' changed build result to FAILURE
>>
>

Mime
View raw message