ctakes-dev mailing list archives

Site index · List index
Message view « Date » · « Thread »
Top « Date » · « Thread »
From Steven Bethard <steven.beth...@Colorado.EDU>
Subject ctakes-assertion build failures
Date Fri, 19 Jul 2013 21:33:18 GMT
Perhaps everyone is already aware of this, but just in case, I'm seeing build failures and
have been for a while now:

$ mvn clean compile
[INFO] Scanning for projects...
[ERROR] The build could not read 1 project -> [Help 1]
[ERROR]   
[ERROR]   The project org.apache.ctakes:ctakes-assertion-zoner:3.1.0-SNAPSHOT (.../ctakes/ctakes-assertion-zoner/pom.xml)
has 1 error
[ERROR]     'dependencies.dependency.version' for net.sf.mastif:mastif-zoner:jar is missing.
@ line 36, column 15

If I add a <version>1.4</version> for assertion-zoner, I then get the errors:

[ERROR] Failed to execute goal on project ctakes-assertion: Could not resolve dependencies
for project org.apache.ctakes:ctakes-assertion:jar:3.1.0-SNAPSHOT: The following artifacts
could not be resolved: org.mitre.medfacts:medfacts-i2b2:jar:1.2, org.mitre.medfacts:medfacts-zoner:jar:1.1,
org.mitre.jcarafe.core:jcarafe.core:jar:2.9.1, org.mitre.jcarafe.ext:jcarafe.ext:jar:2.9.1:
Could not find artifact org.mitre.medfacts:medfacts-i2b2:jar:1.2 at specified path .../ctakes/ctakes-assertion/lib/med-facts-i2b2-1.2-SNAPSHOT.jar
-> [Help 1]

I don't see medfacts on Maven central at all.

http://search.maven.org/#search%7Cga%7C1%7Cmedfacts

And for jcarafe, I see differently named versions:

<dependency>
    <groupId>net.sf.carafe.jcarafe</groupId>
    <artifactId>jcarafe-ext_2.9.1</artifactId>
    <version>0.9.8.3.RC4</version>
</dependency>
<dependency>
    <groupId>net.sf.carafe.jcarafe</groupId>
    <artifactId>jcarafe-core_2.9.1</artifactId>
    <version>0.9.8.3.RC4</version>
</dependency>

Steve
Mime
View raw message