crunch-dev mailing list archives

Site index · List index
Message view « Date » · « Thread »
Top « Date » · « Thread »
From Apache Jenkins Server <jenk...@builds.apache.org>
Subject Build failed in Jenkins: crunch-commit #289
Date Mon, 02 Sep 2013 06:14:40 GMT
See <https://builds.apache.org/job/crunch-commit/289/changes>

Changes:

[chaoshi] CRUNCH-246: HFileSource and related utilities (Thanks Ryan Brush for contributing
HFileInputFormat)

------------------------------------------
[...truncated 250 lines...]
173  [main] INFO  org.apache.crunch.io.impl.FileTargetImpl  - Will write output files to new
path: /tmp/junit6123963246809698417/existing
174  [main] WARN  org.apache.crunch.impl.mem.MemPipeline  - Defaulting to write to a text
file from MemPipeline
175  [main] INFO  org.apache.crunch.io.impl.FileTargetImpl  - Adding output files to existing
path: /tmp/junit6123963246809698417/existing
177  [main] WARN  org.apache.crunch.impl.mem.MemPipeline  - Defaulting to write to a text
file from MemPipeline
200  [main] INFO  org.apache.crunch.io.impl.FileTargetImpl  - Will write output files to new
path: /tmp/junit6363746910490888987/existing
202  [main] WARN  org.apache.crunch.impl.mem.MemPipeline  - Defaulting to write to a text
file from MemPipeline
203  [main] INFO  org.apache.crunch.io.impl.FileTargetImpl  - Adding output files to existing
path: /tmp/junit6363746910490888987/existing
204  [main] WARN  org.apache.crunch.impl.mem.MemPipeline  - Defaulting to write to a text
file from MemPipeline
Tests run: 6, Failures: 0, Errors: 0, Skipped: 0, Time elapsed: 0.728 sec
Running org.apache.crunch.PairTest
Tests run: 3, Failures: 0, Errors: 0, Skipped: 0, Time elapsed: 0 sec
Running org.apache.crunch.fn.MapValuesTest
Tests run: 1, Failures: 0, Errors: 0, Skipped: 0, Time elapsed: 0 sec
Running org.apache.crunch.fn.PairMapTest
Tests run: 1, Failures: 0, Errors: 0, Skipped: 0, Time elapsed: 0 sec
Running org.apache.crunch.fn.ExtractKeyFnTest
Tests run: 1, Failures: 0, Errors: 0, Skipped: 0, Time elapsed: 0 sec
Running org.apache.crunch.fn.FilterFnTest
Tests run: 7, Failures: 0, Errors: 0, Skipped: 0, Time elapsed: 0.009 sec
Running org.apache.crunch.fn.AggregatorsTest
Tests run: 16, Failures: 0, Errors: 0, Skipped: 0, Time elapsed: 0.036 sec
Running org.apache.crunch.fn.MapKeysTest
Tests run: 1, Failures: 0, Errors: 0, Skipped: 0, Time elapsed: 0 sec
Running org.apache.crunch.test.CountersTest
Tests run: 2, Failures: 0, Errors: 0, Skipped: 0, Time elapsed: 0.009 sec
Running org.apache.crunch.lib.MapreduceTest
Tests run: 2, Failures: 0, Errors: 0, Skipped: 0, Time elapsed: 0.092 sec
Running org.apache.crunch.lib.SampleTest
Tests run: 2, Failures: 0, Errors: 0, Skipped: 0, Time elapsed: 0.208 sec
Running org.apache.crunch.lib.MapredTest
Tests run: 2, Failures: 0, Errors: 0, Skipped: 0, Time elapsed: 0.008 sec
Running org.apache.crunch.lib.join.BrokenLeftAndOuterJoinTest
Tests run: 2, Failures: 0, Errors: 0, Skipped: 0, Time elapsed: 0.032 sec
Running org.apache.crunch.lib.join.InnerJoinFnTest
Tests run: 1, Failures: 0, Errors: 0, Skipped: 0, Time elapsed: 0.01 sec
Running org.apache.crunch.lib.join.LeftOuterJoinTest
Tests run: 1, Failures: 0, Errors: 0, Skipped: 0, Time elapsed: 0.012 sec
Running org.apache.crunch.lib.join.OneToManyJoinTest
Tests run: 4, Failures: 0, Errors: 0, Skipped: 0, Time elapsed: 0.013 sec
Running org.apache.crunch.lib.join.RightOuterJoinFnTest
Tests run: 1, Failures: 0, Errors: 0, Skipped: 0, Time elapsed: 0.01 sec
Running org.apache.crunch.lib.join.FullOuterJoinFnTest
Tests run: 1, Failures: 0, Errors: 0, Skipped: 0, Time elapsed: 0.011 sec
Running org.apache.crunch.lib.AvroIndexedRecordPartitionerTest
Tests run: 3, Failures: 0, Errors: 0, Skipped: 0, Time elapsed: 0 sec
Running org.apache.crunch.lib.CartesianTest
Tests run: 2, Failures: 0, Errors: 0, Skipped: 0, Time elapsed: 0.011 sec
Running org.apache.crunch.lib.TupleWritablePartitionerTest
Tests run: 3, Failures: 0, Errors: 0, Skipped: 0, Time elapsed: 0.001 sec
Running org.apache.crunch.lib.DistinctTest
Tests run: 2, Failures: 0, Errors: 0, Skipped: 0, Time elapsed: 0.002 sec
Running org.apache.crunch.lib.SecondarySortTest
Tests run: 1, Failures: 0, Errors: 0, Skipped: 0, Time elapsed: 0.004 sec
Running org.apache.crunch.io.avro.AvroFileSourceTest
Tests run: 3, Failures: 0, Errors: 0, Skipped: 0, Time elapsed: 0.032 sec
Running org.apache.crunch.io.avro.AvroFileReaderFactoryTest
Tests run: 8, Failures: 0, Errors: 0, Skipped: 1, Time elapsed: 0.049 sec
Running org.apache.crunch.io.SequentialFileNamingSchemeTest
Tests run: 4, Failures: 0, Errors: 0, Skipped: 0, Time elapsed: 0.035 sec
Running org.apache.crunch.io.SourceTargetHelperTest
Tests run: 2, Failures: 0, Errors: 0, Skipped: 0, Time elapsed: 0.009 sec
Running org.apache.crunch.io.impl.CrunchJobHooksTest
Tests run: 3, Failures: 0, Errors: 0, Skipped: 0, Time elapsed: 0.001 sec
Running org.apache.crunch.AndFnTest
Tests run: 4, Failures: 0, Errors: 0, Skipped: 0, Time elapsed: 0.002 sec
Running org.apache.crunch.impl.SingleUseIterableTest
Tests run: 2, Failures: 0, Errors: 0, Skipped: 0, Time elapsed: 0 sec
Running org.apache.crunch.impl.mr.plan.DotfileWriterTest
Tests run: 9, Failures: 0, Errors: 0, Skipped: 0, Time elapsed: 0.05 sec
Running org.apache.crunch.impl.mr.plan.JobNameBuilderTest
Tests run: 1, Failures: 0, Errors: 0, Skipped: 0, Time elapsed: 0 sec
Running org.apache.crunch.impl.mr.exec.CappedExponentialCounterTest
Tests run: 2, Failures: 0, Errors: 0, Skipped: 0, Time elapsed: 0 sec
Running org.apache.crunch.impl.mr.emit.IntermediateEmitterTest
Tests run: 2, Failures: 0, Errors: 0, Skipped: 0, Time elapsed: 0.039 sec
Running org.apache.crunch.impl.mr.MRPipelineTest
Tests run: 3, Failures: 0, Errors: 0, Skipped: 0, Time elapsed: 0.078 sec
Running org.apache.crunch.impl.mr.collect.DoTableImplTest
Tests run: 3, Failures: 0, Errors: 0, Skipped: 0, Time elapsed: 0.001 sec
Running org.apache.crunch.impl.mr.collect.DoCollectionImplTest
Tests run: 3, Failures: 0, Errors: 0, Skipped: 0, Time elapsed: 0.001 sec
Running org.apache.crunch.util.DistCacheTest
Tests run: 5, Failures: 0, Errors: 0, Skipped: 0, Time elapsed: 0.018 sec
Running org.apache.crunch.CombineFnTest
Tests run: 15, Failures: 0, Errors: 0, Skipped: 0, Time elapsed: 0.009 sec
Running org.apache.crunch.types.MapDeepCopierTest
Tests run: 2, Failures: 0, Errors: 0, Skipped: 0, Time elapsed: 0.005 sec
Running org.apache.crunch.types.TupleDeepCopierTest
Tests run: 3, Failures: 0, Errors: 0, Skipped: 0, Time elapsed: 0.001 sec
Running org.apache.crunch.types.avro.AvroDeepCopierTest
Tests run: 4, Failures: 0, Errors: 0, Skipped: 0, Time elapsed: 0.009 sec
Running org.apache.crunch.types.avro.AvroGroupedTableTypeTest
Tests run: 1, Failures: 0, Errors: 0, Skipped: 0, Time elapsed: 0.002 sec
Running org.apache.crunch.types.avro.AvroTypeTest
Tests run: 29, Failures: 0, Errors: 0, Skipped: 0, Time elapsed: 0.017 sec
Running org.apache.crunch.types.avro.AvroTableTypeTest
Tests run: 4, Failures: 0, Errors: 0, Skipped: 0, Time elapsed: 0.001 sec
Running org.apache.crunch.types.avro.AvrosTest
Tests run: 24, Failures: 0, Errors: 0, Skipped: 0, Time elapsed: 0.013 sec
Running org.apache.crunch.types.TupleFactoryTest
Tests run: 4, Failures: 0, Errors: 0, Skipped: 0, Time elapsed: 0 sec
Running org.apache.crunch.types.writable.WritableGroupedTableTypeTest
Tests run: 1, Failures: 0, Errors: 0, Skipped: 0, Time elapsed: 0 sec
Running org.apache.crunch.types.writable.GenericArrayWritableTest
Tests run: 3, Failures: 0, Errors: 0, Skipped: 0, Time elapsed: 0.005 sec
Running org.apache.crunch.types.writable.WritableDeepCopierTest
Tests run: 2, Failures: 0, Errors: 0, Skipped: 0, Time elapsed: 0.001 sec
Running org.apache.crunch.types.writable.WritableTypeTest
Tests run: 5, Failures: 0, Errors: 0, Skipped: 0, Time elapsed: 0.001 sec
Running org.apache.crunch.types.writable.WritablesTest
Tests run: 18, Failures: 0, Errors: 0, Skipped: 0, Time elapsed: 0.005 sec
Running org.apache.crunch.types.writable.WritableTableTypeTest
Tests run: 1, Failures: 0, Errors: 0, Skipped: 0, Time elapsed: 0 sec
Running org.apache.crunch.types.CollectionDeepCopierTest
Tests run: 2, Failures: 0, Errors: 0, Skipped: 0, Time elapsed: 0 sec
Running org.apache.crunch.types.PTypesTest
Tests run: 1, Failures: 0, Errors: 0, Skipped: 0, Time elapsed: 0.002 sec
Running org.apache.crunch.types.PTypeUtilsTest
Tests run: 7, Failures: 0, Errors: 0, Skipped: 0, Time elapsed: 0.002 sec

Results :

Tests run: 260, Failures: 0, Errors: 0, Skipped: 1

[JENKINS] Recording test results
Sep 2, 2013 6:14:03 AM org.apache.maven.cli.event.ExecutionEventLogger mojoStarted
INFO: 
Sep 2, 2013 6:14:03 AM org.apache.maven.cli.event.ExecutionEventLogger mojoStarted
INFO: --- apache-rat-plugin:0.8:check (rat-check) @ crunch-core ---
[INFO] Exclude: .git/**
[INFO] Exclude: .gitignore
[INFO] Exclude: .repository/
[INFO] Exclude: .idea/**
[INFO] Exclude: **/resources/*.txt
[INFO] Exclude: **/resources/**/*.txt
[INFO] Exclude: **/goal.txt
[INFO] Exclude: **/target/generated-test-sources/**
[INFO] Exclude: **/scripts/scrunch
Sep 2, 2013 6:14:03 AM org.apache.maven.cli.event.ExecutionEventLogger mojoStarted
INFO: 
Sep 2, 2013 6:14:03 AM org.apache.maven.cli.event.ExecutionEventLogger mojoStarted
INFO: --- maven-jar-plugin:2.4:jar (default-jar) @ crunch-core ---
[INFO] Building jar: <https://builds.apache.org/job/crunch-commit/ws/crunch-core/target/crunch-core-0.8.0-SNAPSHOT.jar>
Sep 2, 2013 6:14:07 AM org.apache.maven.cli.event.ExecutionEventLogger projectStarted
INFO:                                                                         
Sep 2, 2013 6:14:07 AM org.apache.maven.cli.event.ExecutionEventLogger projectStarted
INFO: ------------------------------------------------------------------------
Sep 2, 2013 6:14:07 AM org.apache.maven.cli.event.ExecutionEventLogger projectStarted
INFO: Building Apache Crunch HBase Support 0.8.0-SNAPSHOT
Sep 2, 2013 6:14:07 AM org.apache.maven.cli.event.ExecutionEventLogger projectStarted
INFO: ------------------------------------------------------------------------
Sep 2, 2013 6:14:08 AM org.apache.maven.cli.event.ExecutionEventLogger mojoStarted
INFO: 
Sep 2, 2013 6:14:08 AM org.apache.maven.cli.event.ExecutionEventLogger mojoStarted
INFO: --- maven-clean-plugin:2.5:clean (default-clean) @ crunch-hbase ---
[INFO] Deleting <https://builds.apache.org/job/crunch-commit/ws/crunch-hbase/target>
Sep 2, 2013 6:14:08 AM org.apache.maven.cli.event.ExecutionEventLogger mojoStarted
INFO: 
Sep 2, 2013 6:14:08 AM org.apache.maven.cli.event.ExecutionEventLogger mojoStarted
INFO: --- build-helper-maven-plugin:1.7:add-test-source (add-test-source) @ crunch-hbase ---
[INFO] Test Source directory: <https://builds.apache.org/job/crunch-commit/ws/crunch-hbase/src/it/java>
added.
Sep 2, 2013 6:14:08 AM org.apache.maven.cli.event.ExecutionEventLogger mojoStarted
INFO: 
Sep 2, 2013 6:14:08 AM org.apache.maven.cli.event.ExecutionEventLogger mojoStarted
INFO: --- build-helper-maven-plugin:1.7:add-test-resource (add-test-resource) @ crunch-hbase
---
Sep 2, 2013 6:14:08 AM org.apache.maven.cli.event.ExecutionEventLogger mojoStarted
INFO: 
Sep 2, 2013 6:14:08 AM org.apache.maven.cli.event.ExecutionEventLogger mojoStarted
INFO: --- maven-remote-resources-plugin:1.3:process (default) @ crunch-hbase ---
Sep 2, 2013 6:14:08 AM org.apache.maven.cli.event.ExecutionEventLogger mojoStarted
INFO: 
Sep 2, 2013 6:14:08 AM org.apache.maven.cli.event.ExecutionEventLogger mojoStarted
INFO: --- maven-resources-plugin:2.5:resources (default-resources) @ crunch-hbase ---
[debug] execute contextualize
[INFO] Using 'UTF-8' encoding to copy filtered resources.
[INFO] skip non existing resourceDirectory <https://builds.apache.org/job/crunch-commit/ws/crunch-hbase/src/main/resources>
[INFO] Copying 3 resources
Sep 2, 2013 6:14:08 AM org.apache.maven.cli.event.ExecutionEventLogger mojoStarted
INFO: 
Sep 2, 2013 6:14:08 AM org.apache.maven.cli.event.ExecutionEventLogger mojoStarted
INFO: --- maven-compiler-plugin:2.5.1:compile (default-compile) @ crunch-hbase ---
[INFO] Compiling 11 source files to <https://builds.apache.org/job/crunch-commit/ws/crunch-hbase/target/classes>
[INFO] -------------------------------------------------------------
[ERROR] COMPILATION ERROR : 
[INFO] -------------------------------------------------------------
[ERROR] <https://builds.apache.org/job/crunch-commit/ws/crunch-hbase/src/main/java/org/apache/crunch/io/hbase/HFileSource.java>:[34,16]
cannot find symbol
symbol  : class Objects
location: package java.util
[ERROR] <https://builds.apache.org/job/crunch-commit/ws/crunch-hbase/src/main/java/org/apache/crunch/io/hbase/HFileSource.java>:[58,9]
cannot find symbol
symbol  : variable Objects
location: class org.apache.crunch.io.hbase.HFileSource
[ERROR] <https://builds.apache.org/job/crunch-commit/ws/crunch-hbase/src/main/java/org/apache/crunch/io/hbase/HFileSource.java>:[61,9]
cannot find symbol
symbol  : variable Objects
location: class org.apache.crunch.io.hbase.HFileSource
[INFO] 3 errors 
[INFO] -------------------------------------------------------------
Sep 2, 2013 6:14:09 AM org.apache.maven.cli.event.ExecutionEventLogger logReactorSummary
INFO: ------------------------------------------------------------------------
Sep 2, 2013 6:14:09 AM org.apache.maven.cli.event.ExecutionEventLogger logReactorSummary
INFO: Reactor Summary:
Sep 2, 2013 6:14:09 AM org.apache.maven.cli.event.ExecutionEventLogger logReactorSummary
INFO: 
Sep 2, 2013 6:14:09 AM org.apache.maven.cli.event.ExecutionEventLogger logReactorSummary
INFO: Apache Crunch ..................................... SUCCESS [12.392s]
Sep 2, 2013 6:14:09 AM org.apache.maven.cli.event.ExecutionEventLogger logReactorSummary
INFO: Apache Crunch Test ................................ SUCCESS [9.505s]
Sep 2, 2013 6:14:09 AM org.apache.maven.cli.event.ExecutionEventLogger logReactorSummary
INFO: Apache Crunch Core ................................ SUCCESS [16.699s]
Sep 2, 2013 6:14:09 AM org.apache.maven.cli.event.ExecutionEventLogger logReactorSummary
INFO: Apache Crunch HBase Support ....................... FAILURE [5.039s]
Sep 2, 2013 6:14:09 AM org.apache.maven.cli.event.ExecutionEventLogger logReactorSummary
INFO: Apache Crunch Contrib ............................. SKIPPED
Sep 2, 2013 6:14:09 AM org.apache.maven.cli.event.ExecutionEventLogger logReactorSummary
INFO: Apache Crunch Examples ............................ SKIPPED
Sep 2, 2013 6:14:09 AM org.apache.maven.cli.event.ExecutionEventLogger logReactorSummary
INFO: Apache Crunch Archetype ........................... SKIPPED
Sep 2, 2013 6:14:09 AM org.apache.maven.cli.event.ExecutionEventLogger logReactorSummary
INFO: Apache Crunch for Scala ........................... SKIPPED
Sep 2, 2013 6:14:09 AM org.apache.maven.cli.event.ExecutionEventLogger logReactorSummary
INFO: Apache Crunch Distribution ........................ SKIPPED
Sep 2, 2013 6:14:09 AM org.apache.maven.cli.event.ExecutionEventLogger logResult
INFO: ------------------------------------------------------------------------
Sep 2, 2013 6:14:09 AM org.apache.maven.cli.event.ExecutionEventLogger logResult
INFO: BUILD FAILURE
Sep 2, 2013 6:14:09 AM org.apache.maven.cli.event.ExecutionEventLogger logStats
INFO: ------------------------------------------------------------------------
Sep 2, 2013 6:14:09 AM org.apache.maven.cli.event.ExecutionEventLogger logStats
INFO: Total time: 44.898s
Sep 2, 2013 6:14:09 AM org.apache.maven.cli.event.ExecutionEventLogger logStats
INFO: Finished at: Mon Sep 02 06:14:09 UTC 2013
Sep 2, 2013 6:14:09 AM org.apache.maven.cli.event.ExecutionEventLogger logStats
INFO: Final Memory: 29M/121M
Sep 2, 2013 6:14:09 AM org.apache.maven.cli.event.ExecutionEventLogger sessionEnded
INFO: ------------------------------------------------------------------------
[JENKINS] Archiving <https://builds.apache.org/job/crunch-commit/ws/crunch-dist/pom.xml>
to /home/hudson/hudson/jobs/crunch-commit/modules/org.apache.crunch$crunch-dist/builds/2013-09-02_06-13-21/archive/org.apache.crunch/crunch-dist/0.8.0-SNAPSHOT/crunch-dist-0.8.0-SNAPSHOT.pom
[JENKINS] Archiving <https://builds.apache.org/job/crunch-commit/ws/crunch-core/pom.xml>
to /home/hudson/hudson/jobs/crunch-commit/modules/org.apache.crunch$crunch-core/builds/2013-09-02_06-13-21/archive/org.apache.crunch/crunch-core/0.8.0-SNAPSHOT/crunch-core-0.8.0-SNAPSHOT.pom
[JENKINS] Archiving <https://builds.apache.org/job/crunch-commit/ws/crunch-core/target/crunch-core-0.8.0-SNAPSHOT.jar>
to /home/hudson/hudson/jobs/crunch-commit/modules/org.apache.crunch$crunch-core/builds/2013-09-02_06-13-21/archive/org.apache.crunch/crunch-core/0.8.0-SNAPSHOT/crunch-core-0.8.0-SNAPSHOT.jar
[JENKINS] Archiving <https://builds.apache.org/job/crunch-commit/ws/crunch-hbase/pom.xml>
to /home/hudson/hudson/jobs/crunch-commit/modules/org.apache.crunch$crunch-hbase/builds/2013-09-02_06-13-21/archive/org.apache.crunch/crunch-hbase/0.8.0-SNAPSHOT/crunch-hbase-0.8.0-SNAPSHOT.pom
[JENKINS] Archiving <https://builds.apache.org/job/crunch-commit/ws/crunch-scrunch/pom.xml>
to /home/hudson/hudson/jobs/crunch-commit/modules/org.apache.crunch$crunch-scrunch/builds/2013-09-02_06-13-21/archive/org.apache.crunch/crunch-scrunch/0.8.0-SNAPSHOT/crunch-scrunch-0.8.0-SNAPSHOT.pom
[JENKINS] Archiving <https://builds.apache.org/job/crunch-commit/ws/crunch-contrib/pom.xml>
to /home/hudson/hudson/jobs/crunch-commit/modules/org.apache.crunch$crunch-contrib/builds/2013-09-02_06-13-21/archive/org.apache.crunch/crunch-contrib/0.8.0-SNAPSHOT/crunch-contrib-0.8.0-SNAPSHOT.pom
[JENKINS] Archiving <https://builds.apache.org/job/crunch-commit/ws/crunch-archetype/pom.xml>
to /home/hudson/hudson/jobs/crunch-commit/modules/org.apache.crunch$crunch-archetype/builds/2013-09-02_06-13-21/archive/org.apache.crunch/crunch-archetype/0.8.0-SNAPSHOT/crunch-archetype-0.8.0-SNAPSHOT.pom
[JENKINS] Archiving <https://builds.apache.org/job/crunch-commit/ws/pom.xml> to /home/hudson/hudson/jobs/crunch-commit/modules/org.apache.crunch$crunch-parent/builds/2013-09-02_06-13-21/archive/org.apache.crunch/crunch-parent/0.8.0-SNAPSHOT/crunch-parent-0.8.0-SNAPSHOT.pom
[JENKINS] Archiving <https://builds.apache.org/job/crunch-commit/ws/target/crunch-parent-0.8.0-SNAPSHOT-site.xml>
to /home/hudson/hudson/jobs/crunch-commit/modules/org.apache.crunch$crunch-parent/builds/2013-09-02_06-13-21/archive/org.apache.crunch/crunch-parent/0.8.0-SNAPSHOT/crunch-parent-0.8.0-SNAPSHOT-site.xml
[JENKINS] Archiving <https://builds.apache.org/job/crunch-commit/ws/crunch-examples/pom.xml>
to /home/hudson/hudson/jobs/crunch-commit/modules/org.apache.crunch$crunch-examples/builds/2013-09-02_06-13-21/archive/org.apache.crunch/crunch-examples/0.8.0-SNAPSHOT/crunch-examples-0.8.0-SNAPSHOT.pom
[JENKINS] Archiving <https://builds.apache.org/job/crunch-commit/ws/crunch-test/pom.xml>
to /home/hudson/hudson/jobs/crunch-commit/modules/org.apache.crunch$crunch-test/builds/2013-09-02_06-13-21/archive/org.apache.crunch/crunch-test/0.8.0-SNAPSHOT/crunch-test-0.8.0-SNAPSHOT.pom
[JENKINS] Archiving <https://builds.apache.org/job/crunch-commit/ws/crunch-test/target/crunch-test-0.8.0-SNAPSHOT.jar>
to /home/hudson/hudson/jobs/crunch-commit/modules/org.apache.crunch$crunch-test/builds/2013-09-02_06-13-21/archive/org.apache.crunch/crunch-test/0.8.0-SNAPSHOT/crunch-test-0.8.0-SNAPSHOT.jar
Waiting for Jenkins to finish collecting data
Sending e-mails to: dev@crunch.apache.org
channel stopped

Mime
View raw message