crunch-dev mailing list archives

Site index · List index
Message view « Date » · « Thread »
Top « Date » · « Thread »
From Apache Jenkins Server <jenk...@builds.apache.org>
Subject Build failed in Jenkins: crunch-master-integration #5
Date Fri, 03 May 2013 00:15:32 GMT
See <https://builds.apache.org/job/crunch-master-integration/5/>

------------------------------------------
[...truncated 67 lines...]
[INFO] --- build-helper-maven-plugin:1.7:add-test-resource (add-test-resource) @ crunch-test
---
[INFO] 
[INFO] --- maven-remote-resources-plugin:1.3:process (default) @ crunch-test ---
[INFO] 
[INFO] --- maven-resources-plugin:2.5:resources (default-resources) @ crunch-test ---
[debug] execute contextualize
[INFO] Using 'UTF-8' encoding to copy filtered resources.
[INFO] skip non existing resourceDirectory <https://builds.apache.org/job/crunch-master-integration/ws/crunch-test/src/main/resources>
[INFO] Copying 3 resources
[INFO] 
[INFO] --- maven-compiler-plugin:2.5.1:compile (default-compile) @ crunch-test ---
[INFO] Compiling 5 source files to <https://builds.apache.org/job/crunch-master-integration/ws/crunch-test/target/classes>
[debug] execute contextualize
[INFO] [INFO] Using 'UTF-8' encoding to copy filtered resources.
[INFO] skip non existing resourceDirectory <https://builds.apache.org/job/crunch-master-integration/ws/crunch-test/src/test/resources>
[INFO] Copying 1 resource
[INFO] Copying 3 resources

[INFO] --- maven-resources-plugin:2.5:testResources (default-testResources) @ crunch-test
---
[INFO] Compiling 2 source files to <https://builds.apache.org/job/crunch-master-integration/ws/crunch-test/target/test-classes>
[INFO] 
[INFO] --- maven-compiler-plugin:2.5.1:testCompile (default-testCompile) @ crunch-test ---
[INFO] 
[INFO] --- maven-surefire-plugin:2.12:test (default-test) @ crunch-test ---
[INFO] Surefire report directory: <https://builds.apache.org/job/crunch-master-integration/ws/crunch-test/target/surefire-reports>

-------------------------------------------------------
 T E S T S
-------------------------------------------------------
Running org.apache.crunch.test.CrunchTestSupportTest
Tests run: 1, Failures: 0, Errors: 0, Skipped: 0, Time elapsed: 0.335 sec

Results :

Tests run: 1, Failures: 0, Errors: 0, Skipped: 0

[JENKINS] Recording test results
[INFO] [INFO] Exclude: .git/**
[INFO] Exclude: .gitignore
[INFO] Exclude: .repository/
[INFO] Exclude: .idea/**
[INFO] Exclude: **/resources/*.txt
[INFO] Exclude: **/resources/**/*.txt
[INFO] Exclude: **/goal.txt
[INFO] Exclude: **/target/generated-test-sources/**
[INFO] Exclude: **/scripts/scrunch

[INFO] --- apache-rat-plugin:0.8:check (rat-check) @ crunch-test ---
[INFO] 
[INFO] --- maven-jar-plugin:2.4:jar (default-jar) @ crunch-test ---
[INFO] Building jar: <https://builds.apache.org/job/crunch-master-integration/ws/crunch-test/target/crunch-test-0.6.0-SNAPSHOT.jar>
[INFO] 
[INFO] --- maven-failsafe-plugin:2.12:integration-test (default) @ crunch-test ---
[INFO] Failsafe report directory: <https://builds.apache.org/job/crunch-master-integration/ws/crunch-test/target/failsafe-reports>

-------------------------------------------------------
 T E S T S
-------------------------------------------------------
Running org.apache.crunch.test.TemporaryPathIT
Tests run: 7, Failures: 0, Errors: 0, Skipped: 0, Time elapsed: 0.569 sec

Results :

Tests run: 7, Failures: 0, Errors: 0, Skipped: 0

[INFO] [INFO] Failsafe report directory: <https://builds.apache.org/job/crunch-master-integration/ws/crunch-test/target/failsafe-reports>

[INFO] --- maven-failsafe-plugin:2.12:verify (default) @ crunch-test ---
[JENKINS] Recording test results
[INFO] [INFO] Installing <https://builds.apache.org/job/crunch-master-integration/ws/crunch-test/target/crunch-test-0.6.0-SNAPSHOT.jar>
to /home/jenkins/jenkins-slave/maven-repositories/1/org/apache/crunch/crunch-test/0.6.0-SNAPSHOT/crunch-test-0.6.0-SNAPSHOT.jar
[INFO] Installing <https://builds.apache.org/job/crunch-master-integration/ws/crunch-test/pom.xml>
to /home/jenkins/jenkins-slave/maven-repositories/1/org/apache/crunch/crunch-test/0.6.0-SNAPSHOT/crunch-test-0.6.0-SNAPSHOT.pom

[INFO] --- maven-install-plugin:2.3.1:install (default-install) @ crunch-test ---
[INFO]                                                                         
[INFO] ------------------------------------------------------------------------
[INFO] Building Apache Crunch Core 0.6.0-SNAPSHOT
[INFO] ------------------------------------------------------------------------
Downloading: http://repo.maven.apache.org/maven2/org/apache/avro/avro-maven-plugin/1.7.4/avro-maven-plugin-1.7.4.pom
Downloaded: http://repo.maven.apache.org/maven2/org/apache/avro/avro-maven-plugin/1.7.4/avro-maven-plugin-1.7.4.pom
(4 KB at 17.7 KB/sec)
Downloading: http://repo.maven.apache.org/maven2/org/apache/avro/avro-parent/1.7.4/avro-parent-1.7.4.pom
Downloaded: http://repo.maven.apache.org/maven2/org/apache/avro/avro-parent/1.7.4/avro-parent-1.7.4.pom
(16 KB at 141.2 KB/sec)
Downloading: http://repo.maven.apache.org/maven2/org/apache/avro/avro-toplevel/1.7.4/avro-toplevel-1.7.4.pom
Downloaded: http://repo.maven.apache.org/maven2/org/apache/avro/avro-toplevel/1.7.4/avro-toplevel-1.7.4.pom
(10 KB at 213.4 KB/sec)
Downloading: http://repo.maven.apache.org/maven2/org/apache/avro/avro-maven-plugin/1.7.4/avro-maven-plugin-1.7.4.jar
Downloaded: http://repo.maven.apache.org/maven2/org/apache/avro/avro-maven-plugin/1.7.4/avro-maven-plugin-1.7.4.jar
(23 KB at 218.3 KB/sec)
Downloading: http://repo.maven.apache.org/maven2/org/apache/avro/avro/1.7.4/avro-1.7.4.pom
Downloaded: http://repo.maven.apache.org/maven2/org/apache/avro/avro/1.7.4/avro-1.7.4.pom
(5 KB at 65.4 KB/sec)
Downloading: http://repo.maven.apache.org/maven2/org/apache/avro/avro-mapred/1.7.4/avro-mapred-1.7.4.pom
Downloaded: http://repo.maven.apache.org/maven2/org/apache/avro/avro-mapred/1.7.4/avro-mapred-1.7.4.pom
(7 KB at 256.1 KB/sec)
Downloading: http://repo.maven.apache.org/maven2/org/apache/avro/trevni-avro/1.7.4/trevni-avro-1.7.4.pom
Downloaded: http://repo.maven.apache.org/maven2/org/apache/avro/trevni-avro/1.7.4/trevni-avro-1.7.4.pom
(3 KB at 38.3 KB/sec)
Downloading: http://repo.maven.apache.org/maven2/org/apache/avro/trevni-java/1.7.4/trevni-java-1.7.4.pom
Downloaded: http://repo.maven.apache.org/maven2/org/apache/avro/trevni-java/1.7.4/trevni-java-1.7.4.pom
(4 KB at 35.3 KB/sec)
Downloading: http://repo.maven.apache.org/maven2/org/apache/avro/trevni-core/1.7.4/trevni-core-1.7.4.pom
Downloaded: http://repo.maven.apache.org/maven2/org/apache/avro/trevni-core/1.7.4/trevni-core-1.7.4.pom
(3 KB at 13.1 KB/sec)
Downloading: http://repo.maven.apache.org/maven2/org/apache/avro/avro/1.7.4/avro-1.7.4.jar
Downloading: http://repo.maven.apache.org/maven2/org/apache/avro/avro-mapred/1.7.4/avro-mapred-1.7.4.jar
Downloading: http://repo.maven.apache.org/maven2/org/apache/avro/trevni-avro/1.7.4/trevni-avro-1.7.4.jar
Downloading: http://repo.maven.apache.org/maven2/org/apache/avro/trevni-core/1.7.4/trevni-core-1.7.4.jar
Downloaded: http://repo.maven.apache.org/maven2/org/apache/avro/avro-mapred/1.7.4/avro-mapred-1.7.4.jar
(163 KB at 3696.6 KB/sec)
Downloaded: http://repo.maven.apache.org/maven2/org/apache/avro/avro/1.7.4/avro-1.7.4.jar
(297 KB at 5585.6 KB/sec)
Downloaded: http://repo.maven.apache.org/maven2/org/apache/avro/trevni-avro/1.7.4/trevni-avro-1.7.4.jar
(43 KB at 477.4 KB/sec)
Downloaded: http://repo.maven.apache.org/maven2/org/apache/avro/trevni-core/1.7.4/trevni-core-1.7.4.jar
(46 KB at 375.7 KB/sec)
[INFO] [INFO] Deleting <https://builds.apache.org/job/crunch-master-integration/ws/crunch-core/target>

[INFO] --- maven-clean-plugin:2.5:clean (default-clean) @ crunch-core ---
[INFO] [INFO] Test Source directory: <https://builds.apache.org/job/crunch-master-integration/ws/crunch-core/src/it/java>
added.

[INFO] --- build-helper-maven-plugin:1.7:add-test-source (add-test-source) @ crunch-core ---
[INFO] 
[INFO] --- build-helper-maven-plugin:1.7:add-test-resource (add-test-resource) @ crunch-core
---
[INFO] 
[INFO] --- avro-maven-plugin:1.7.4:schema (schemas) @ crunch-core ---
Downloading: http://repo.maven.apache.org/maven2/org/apache/avro/avro-compiler/1.7.4/avro-compiler-1.7.4.pom
Downloaded: http://repo.maven.apache.org/maven2/org/apache/avro/avro-compiler/1.7.4/avro-compiler-1.7.4.pom
(4 KB at 44.3 KB/sec)
Downloading: http://repo.maven.apache.org/maven2/org/apache/avro/avro-compiler/1.7.4/avro-compiler-1.7.4.jar
Downloaded: http://repo.maven.apache.org/maven2/org/apache/avro/avro-compiler/1.7.4/avro-compiler-1.7.4.jar
(74 KB at 1177.9 KB/sec)
[INFO] 
[INFO] --- maven-remote-resources-plugin:1.3:process (default) @ crunch-core ---
[debug] execute contextualize
[INFO] [INFO] Using 'UTF-8' encoding to copy filtered resources.
[INFO] Copying 1 resource
[INFO] Copying 3 resources

[INFO] --- maven-resources-plugin:2.5:resources (default-resources) @ crunch-core ---
[INFO] 
[INFO] --- maven-compiler-plugin:2.5.1:compile (default-compile) @ crunch-core ---
[INFO] Compiling 215 source files to <https://builds.apache.org/job/crunch-master-integration/ws/crunch-core/target/classes>
[INFO] -------------------------------------------------------------
[ERROR] COMPILATION ERROR : 
[INFO] -------------------------------------------------------------
[ERROR] <https://builds.apache.org/job/crunch-master-integration/ws/crunch-core/src/main/java/org/apache/crunch/lib/sort/Comparators.java>:[95,54]
cannot find symbol
symbol  : class WritableComparator
location: class org.apache.crunch.lib.sort.Comparators
[ERROR] <https://builds.apache.org/job/crunch-master-integration/ws/crunch-core/src/main/java/org/apache/crunch/lib/sort/Comparators.java>:[95,84]
cannot find symbol
symbol  : class Configurable
location: class org.apache.crunch.lib.sort.Comparators
[ERROR] <https://builds.apache.org/job/crunch-master-integration/ws/crunch-core/src/main/java/org/apache/crunch/lib/sort/Comparators.java>:[72,55]
cannot find symbol
symbol  : class Configured
location: class org.apache.crunch.lib.sort.Comparators
[ERROR] <https://builds.apache.org/job/crunch-master-integration/ws/crunch-core/src/main/java/org/apache/crunch/lib/sort/Comparators.java>:[72,77]
cannot find symbol
symbol  : class RawComparator
location: class org.apache.crunch.lib.sort.Comparators
[ERROR] <https://builds.apache.org/job/crunch-master-integration/ws/crunch-core/src/main/java/org/apache/crunch/lib/sort/Comparators.java>:[72,90]
interface expected here
[ERROR] <https://builds.apache.org/job/crunch-master-integration/ws/crunch-core/src/main/java/org/apache/crunch/lib/sort/Comparators.java>:[47,59]
cannot find symbol
symbol  : class Configured
location: class org.apache.crunch.lib.sort.Comparators
[ERROR] <https://builds.apache.org/job/crunch-master-integration/ws/crunch-core/src/main/java/org/apache/crunch/lib/sort/Comparators.java>:[47,81]
cannot find symbol
symbol  : class RawComparator
location: class org.apache.crunch.lib.sort.Comparators
[ERROR] <https://builds.apache.org/job/crunch-master-integration/ws/crunch-core/src/main/java/org/apache/crunch/lib/sort/Comparators.java>:[47,94]
interface expected here
[ERROR] <https://builds.apache.org/job/crunch-master-integration/ws/crunch-core/src/main/java/org/apache/crunch/lib/Sort.java>:[230,15]
sortComparatorClass(java.lang.Class<? extends org.apache.hadoop.io.RawComparator>) in
org.apache.crunch.GroupingOptions.Builder cannot be applied to (java.lang.Class<org.apache.crunch.lib.sort.Comparators.ReverseWritableComparator>)
[ERROR] <https://builds.apache.org/job/crunch-master-integration/ws/crunch-core/src/main/java/org/apache/crunch/lib/Sort.java>:[235,15]
sortComparatorClass(java.lang.Class<? extends org.apache.hadoop.io.RawComparator>) in
org.apache.crunch.GroupingOptions.Builder cannot be applied to (java.lang.Class<org.apache.crunch.lib.sort.Comparators.ReverseAvroComparator>)
[ERROR] <https://builds.apache.org/job/crunch-master-integration/ws/crunch-core/src/main/java/org/apache/crunch/lib/Sort.java>:[253,15]
sortComparatorClass(java.lang.Class<? extends org.apache.hadoop.io.RawComparator>) in
org.apache.crunch.GroupingOptions.Builder cannot be applied to (java.lang.Class<org.apache.crunch.lib.sort.Comparators.ReverseWritableComparator>)
[ERROR] <https://builds.apache.org/job/crunch-master-integration/ws/crunch-core/src/main/java/org/apache/crunch/lib/Sort.java>:[256,15]
sortComparatorClass(java.lang.Class<? extends org.apache.hadoop.io.RawComparator>) in
org.apache.crunch.GroupingOptions.Builder cannot be applied to (java.lang.Class<org.apache.crunch.lib.sort.Comparators.TupleWritableComparator>)
[ERROR] <https://builds.apache.org/job/crunch-master-integration/ws/crunch-core/src/main/java/org/apache/crunch/lib/Sort.java>:[263,15]
sortComparatorClass(java.lang.Class<? extends org.apache.hadoop.io.RawComparator>) in
org.apache.crunch.GroupingOptions.Builder cannot be applied to (java.lang.Class<org.apache.crunch.lib.sort.Comparators.ReverseAvroComparator>)
[ERROR] <https://builds.apache.org/job/crunch-master-integration/ws/crunch-core/src/main/java/org/apache/crunch/lib/sort/Comparators.java>:[54,6]
non-static variable super cannot be referenced from a static context
[ERROR] <https://builds.apache.org/job/crunch-master-integration/ws/crunch-core/src/main/java/org/apache/crunch/lib/sort/Comparators.java>:[54,11]
cannot find symbol
symbol  : method setConf(org.apache.hadoop.conf.Configuration)
location: class java.lang.Object
[ERROR] <https://builds.apache.org/job/crunch-master-integration/ws/crunch-core/src/main/java/org/apache/crunch/lib/sort/Comparators.java>:[52,4]
method does not override or implement a method from a supertype
[ERROR] <https://builds.apache.org/job/crunch-master-integration/ws/crunch-core/src/main/java/org/apache/crunch/lib/sort/Comparators.java>:[61,4]
method does not override or implement a method from a supertype
[ERROR] <https://builds.apache.org/job/crunch-master-integration/ws/crunch-core/src/main/java/org/apache/crunch/lib/sort/Comparators.java>:[66,4]
method does not override or implement a method from a supertype
[ERROR] <https://builds.apache.org/job/crunch-master-integration/ws/crunch-core/src/main/java/org/apache/crunch/lib/sort/Comparators.java>:[78,6]
non-static variable super cannot be referenced from a static context
[ERROR] <https://builds.apache.org/job/crunch-master-integration/ws/crunch-core/src/main/java/org/apache/crunch/lib/sort/Comparators.java>:[78,11]
cannot find symbol
symbol  : method setConf(org.apache.hadoop.conf.Configuration)
location: class java.lang.Object
[ERROR] <https://builds.apache.org/job/crunch-master-integration/ws/crunch-core/src/main/java/org/apache/crunch/lib/sort/Comparators.java>:[76,4]
method does not override or implement a method from a supertype
[ERROR] <https://builds.apache.org/job/crunch-master-integration/ws/crunch-core/src/main/java/org/apache/crunch/lib/sort/Comparators.java>:[84,4]
method does not override or implement a method from a supertype
[ERROR] <https://builds.apache.org/job/crunch-master-integration/ws/crunch-core/src/main/java/org/apache/crunch/lib/sort/Comparators.java>:[89,4]
method does not override or implement a method from a supertype
[ERROR] <https://builds.apache.org/job/crunch-master-integration/ws/crunch-core/src/main/java/org/apache/crunch/lib/sort/Comparators.java>:[126,4]
method does not override or implement a method from a supertype
[ERROR] <https://builds.apache.org/job/crunch-master-integration/ws/crunch-core/src/main/java/org/apache/crunch/lib/sort/Comparators.java>:[166,4]
method does not override or implement a method from a supertype
[ERROR] <https://builds.apache.org/job/crunch-master-integration/ws/crunch-core/src/main/java/org/apache/crunch/lib/sort/Comparators.java>:[171,4]
method does not override or implement a method from a supertype
[INFO] 26 errors 
[INFO] -------------------------------------------------------------
[INFO] ------------------------------------------------------------------------
[INFO] Reactor Summary:
[INFO] 
[INFO] Apache Crunch ..................................... SUCCESS [24.644s]
[INFO] Apache Crunch Test ................................ SUCCESS [15.580s]
[INFO] Apache Crunch Core ................................ FAILURE [7.178s]
[INFO] Apache Crunch HBase Support ....................... SKIPPED
[INFO] Apache Crunch Contrib ............................. SKIPPED
[INFO] Apache Crunch Examples ............................ SKIPPED
[INFO] Apache Crunch Archetype ........................... SKIPPED
[INFO] Apache Crunch for Scala ........................... SKIPPED
[INFO] Apache Crunch Distribution ........................ SKIPPED
[INFO] ------------------------------------------------------------------------
[INFO] BUILD FAILURE
[INFO] ------------------------------------------------------------------------
[INFO] Total time: 50.739s
[INFO] Finished at: Fri May 03 00:15:23 UTC 2013
[INFO] Final Memory: 24M/80M
[INFO] ------------------------------------------------------------------------
[JENKINS] Archiving <https://builds.apache.org/job/crunch-master-integration/ws/crunch-dist/pom.xml>
to /home/hudson/hudson/jobs/crunch-master-integration/modules/org.apache.crunch$crunch-dist/builds/2013-05-03_00-14-15/archive/org.apache.crunch/crunch-dist/0.6.0-SNAPSHOT/crunch-dist-0.6.0-SNAPSHOT.pom
[JENKINS] Archiving <https://builds.apache.org/job/crunch-master-integration/ws/crunch-core/pom.xml>
to /home/hudson/hudson/jobs/crunch-master-integration/modules/org.apache.crunch$crunch-core/builds/2013-05-03_00-14-15/archive/org.apache.crunch/crunch-core/0.6.0-SNAPSHOT/crunch-core-0.6.0-SNAPSHOT.pom
[JENKINS] Archiving <https://builds.apache.org/job/crunch-master-integration/ws/crunch-hbase/pom.xml>
to /home/hudson/hudson/jobs/crunch-master-integration/modules/org.apache.crunch$crunch-hbase/builds/2013-05-03_00-14-15/archive/org.apache.crunch/crunch-hbase/0.6.0-SNAPSHOT/crunch-hbase-0.6.0-SNAPSHOT.pom
[JENKINS] Archiving <https://builds.apache.org/job/crunch-master-integration/ws/crunch-scrunch/pom.xml>
to /home/hudson/hudson/jobs/crunch-master-integration/modules/org.apache.crunch$crunch-scrunch/builds/2013-05-03_00-14-15/archive/org.apache.crunch/crunch-scrunch/0.6.0-SNAPSHOT/crunch-scrunch-0.6.0-SNAPSHOT.pom
[JENKINS] Archiving <https://builds.apache.org/job/crunch-master-integration/ws/crunch-contrib/pom.xml>
to /home/hudson/hudson/jobs/crunch-master-integration/modules/org.apache.crunch$crunch-contrib/builds/2013-05-03_00-14-15/archive/org.apache.crunch/crunch-contrib/0.6.0-SNAPSHOT/crunch-contrib-0.6.0-SNAPSHOT.pom
[JENKINS] Archiving <https://builds.apache.org/job/crunch-master-integration/ws/crunch-archetype/pom.xml>
to /home/hudson/hudson/jobs/crunch-master-integration/modules/org.apache.crunch$crunch-archetype/builds/2013-05-03_00-14-15/archive/org.apache.crunch/crunch-archetype/0.6.0-SNAPSHOT/crunch-archetype-0.6.0-SNAPSHOT.pom
[JENKINS] Archiving <https://builds.apache.org/job/crunch-master-integration/ws/pom.xml>
to /home/hudson/hudson/jobs/crunch-master-integration/modules/org.apache.crunch$crunch-parent/builds/2013-05-03_00-14-14/archive/org.apache.crunch/crunch-parent/0.6.0-SNAPSHOT/crunch-parent-0.6.0-SNAPSHOT.pom
[JENKINS] Archiving <https://builds.apache.org/job/crunch-master-integration/ws/target/crunch-parent-0.6.0-SNAPSHOT-site.xml>
to /home/hudson/hudson/jobs/crunch-master-integration/modules/org.apache.crunch$crunch-parent/builds/2013-05-03_00-14-14/archive/org.apache.crunch/crunch-parent/0.6.0-SNAPSHOT/crunch-parent-0.6.0-SNAPSHOT-site.xml
[JENKINS] Archiving <https://builds.apache.org/job/crunch-master-integration/ws/crunch-examples/pom.xml>
to /home/hudson/hudson/jobs/crunch-master-integration/modules/org.apache.crunch$crunch-examples/builds/2013-05-03_00-14-15/archive/org.apache.crunch/crunch-examples/0.6.0-SNAPSHOT/crunch-examples-0.6.0-SNAPSHOT.pom
[JENKINS] Archiving <https://builds.apache.org/job/crunch-master-integration/ws/crunch-test/pom.xml>
to /home/hudson/hudson/jobs/crunch-master-integration/modules/org.apache.crunch$crunch-test/builds/2013-05-03_00-14-15/archive/org.apache.crunch/crunch-test/0.6.0-SNAPSHOT/crunch-test-0.6.0-SNAPSHOT.pom
[JENKINS] Archiving <https://builds.apache.org/job/crunch-master-integration/ws/crunch-test/target/crunch-test-0.6.0-SNAPSHOT.jar>
to /home/hudson/hudson/jobs/crunch-master-integration/modules/org.apache.crunch$crunch-test/builds/2013-05-03_00-14-15/archive/org.apache.crunch/crunch-test/0.6.0-SNAPSHOT/crunch-test-0.6.0-SNAPSHOT.jar
Waiting for Jenkins to finish collecting data
mavenExecutionResult exceptions not empty
message : Failed to execute goal org.apache.maven.plugins:maven-compiler-plugin:2.5.1:compile
(default-compile) on project crunch-core: Compilation failure
cause : Compilation failure
Stack trace : 
org.apache.maven.lifecycle.LifecycleExecutionException: Failed to execute goal org.apache.maven.plugins:maven-compiler-plugin:2.5.1:compile
(default-compile) on project crunch-core: Compilation failure
	at org.apache.maven.lifecycle.internal.MojoExecutor.execute(MojoExecutor.java:213)
	at org.apache.maven.lifecycle.internal.MojoExecutor.execute(MojoExecutor.java:153)
	at org.apache.maven.lifecycle.internal.MojoExecutor.execute(MojoExecutor.java:145)
	at org.apache.maven.lifecycle.internal.LifecycleModuleBuilder.buildProject(LifecycleModuleBuilder.java:84)
	at org.apache.maven.lifecycle.internal.LifecycleModuleBuilder.buildProject(LifecycleModuleBuilder.java:59)
	at org.apache.maven.lifecycle.internal.LifecycleStarter.singleThreadedBuild(LifecycleStarter.java:183)
	at org.apache.maven.lifecycle.internal.LifecycleStarter.execute(LifecycleStarter.java:161)
	at org.apache.maven.DefaultMaven.doExecute(DefaultMaven.java:320)
	at org.apache.maven.DefaultMaven.execute(DefaultMaven.java:156)
	at org.jvnet.hudson.maven3.launcher.Maven3Launcher.main(Maven3Launcher.java:79)
	at sun.reflect.NativeMethodAccessorImpl.invoke0(Native Method)
	at sun.reflect.NativeMethodAccessorImpl.invoke(NativeMethodAccessorImpl.java:39)
	at sun.reflect.DelegatingMethodAccessorImpl.invoke(DelegatingMethodAccessorImpl.java:25)
	at java.lang.reflect.Method.invoke(Method.java:597)
	at org.codehaus.plexus.classworlds.launcher.Launcher.launchStandard(Launcher.java:329)
	at org.codehaus.plexus.classworlds.launcher.Launcher.launch(Launcher.java:239)
	at org.jvnet.hudson.maven3.agent.Maven3Main.launch(Maven3Main.java:158)
	at hudson.maven.Maven3Builder.call(Maven3Builder.java:100)
	at hudson.maven.Maven3Builder.call(Maven3Builder.java:66)
	at hudson.remoting.UserRequest.perform(UserRequest.java:118)
	at hudson.remoting.UserRequest.perform(UserRequest.java:48)
	at hudson.remoting.Request$2.run(Request.java:326)
	at hudson.remoting.InterceptingExecutorService$1.call(InterceptingExecutorService.java:72)
	at java.util.concurrent.FutureTask$Sync.innerRun(FutureTask.java:303)
	at java.util.concurrent.FutureTask.run(FutureTask.java:138)
	at java.util.concurrent.ThreadPoolExecutor$Worker.runTask(ThreadPoolExecutor.java:895)
	at java.util.concurrent.ThreadPoolExecutor$Worker.run(ThreadPoolExecutor.java:918)
	at java.lang.Thread.run(Thread.java:662)
Caused by: org.apache.maven.plugin.CompilationFailureException: Compilation failure
	at org.apache.maven.plugin.AbstractCompilerMojo.execute(AbstractCompilerMojo.java:729)
	at org.apache.maven.plugin.CompilerMojo.execute(CompilerMojo.java:128)
	at org.apache.maven.plugin.DefaultBuildPluginManager.executeMojo(DefaultBuildPluginManager.java:101)
	at org.apache.maven.lifecycle.internal.MojoExecutor.execute(MojoExecutor.java:209)
	... 27 more
Sending e-mails to: dev@crunch.apache.org
channel stopped
[locks-and-latches] Releasing all the locks
[locks-and-latches] All the locks released

Mime
View raw message