crunch-dev mailing list archives

Site index · List index
Message view « Date » · « Thread »
Top « Date » · « Thread »
From Apache Jenkins Server <jenk...@builds.apache.org>
Subject Build failed in Jenkins: crunch-master-integration » Apache Crunch Core #5
Date Fri, 03 May 2013 00:15:31 GMT
See <https://builds.apache.org/job/crunch-master-integration/org.apache.crunch$crunch-core/5/>

------------------------------------------
[INFO]                                                                         
[INFO] ------------------------------------------------------------------------
[INFO] Building Apache Crunch Core 0.6.0-SNAPSHOT
[INFO] ------------------------------------------------------------------------
Downloading: http://repo.maven.apache.org/maven2/org/apache/avro/avro-maven-plugin/1.7.4/avro-maven-plugin-1.7.4.pom
Downloaded: http://repo.maven.apache.org/maven2/org/apache/avro/avro-maven-plugin/1.7.4/avro-maven-plugin-1.7.4.pom
(4 KB at 17.7 KB/sec)
Downloading: http://repo.maven.apache.org/maven2/org/apache/avro/avro-parent/1.7.4/avro-parent-1.7.4.pom
Downloaded: http://repo.maven.apache.org/maven2/org/apache/avro/avro-parent/1.7.4/avro-parent-1.7.4.pom
(16 KB at 141.2 KB/sec)
Downloading: http://repo.maven.apache.org/maven2/org/apache/avro/avro-toplevel/1.7.4/avro-toplevel-1.7.4.pom
Downloaded: http://repo.maven.apache.org/maven2/org/apache/avro/avro-toplevel/1.7.4/avro-toplevel-1.7.4.pom
(10 KB at 213.4 KB/sec)
Downloading: http://repo.maven.apache.org/maven2/org/apache/avro/avro-maven-plugin/1.7.4/avro-maven-plugin-1.7.4.jar
Downloaded: http://repo.maven.apache.org/maven2/org/apache/avro/avro-maven-plugin/1.7.4/avro-maven-plugin-1.7.4.jar
(23 KB at 218.3 KB/sec)
Downloading: http://repo.maven.apache.org/maven2/org/apache/avro/avro/1.7.4/avro-1.7.4.pom
Downloaded: http://repo.maven.apache.org/maven2/org/apache/avro/avro/1.7.4/avro-1.7.4.pom
(5 KB at 65.4 KB/sec)
Downloading: http://repo.maven.apache.org/maven2/org/apache/avro/avro-mapred/1.7.4/avro-mapred-1.7.4.pom
Downloaded: http://repo.maven.apache.org/maven2/org/apache/avro/avro-mapred/1.7.4/avro-mapred-1.7.4.pom
(7 KB at 256.1 KB/sec)
Downloading: http://repo.maven.apache.org/maven2/org/apache/avro/trevni-avro/1.7.4/trevni-avro-1.7.4.pom
Downloaded: http://repo.maven.apache.org/maven2/org/apache/avro/trevni-avro/1.7.4/trevni-avro-1.7.4.pom
(3 KB at 38.3 KB/sec)
Downloading: http://repo.maven.apache.org/maven2/org/apache/avro/trevni-java/1.7.4/trevni-java-1.7.4.pom
Downloaded: http://repo.maven.apache.org/maven2/org/apache/avro/trevni-java/1.7.4/trevni-java-1.7.4.pom
(4 KB at 35.3 KB/sec)
Downloading: http://repo.maven.apache.org/maven2/org/apache/avro/trevni-core/1.7.4/trevni-core-1.7.4.pom
Downloaded: http://repo.maven.apache.org/maven2/org/apache/avro/trevni-core/1.7.4/trevni-core-1.7.4.pom
(3 KB at 13.1 KB/sec)
Downloading: http://repo.maven.apache.org/maven2/org/apache/avro/avro/1.7.4/avro-1.7.4.jar
Downloading: http://repo.maven.apache.org/maven2/org/apache/avro/avro-mapred/1.7.4/avro-mapred-1.7.4.jar
Downloading: http://repo.maven.apache.org/maven2/org/apache/avro/trevni-avro/1.7.4/trevni-avro-1.7.4.jar
Downloading: http://repo.maven.apache.org/maven2/org/apache/avro/trevni-core/1.7.4/trevni-core-1.7.4.jar
Downloaded: http://repo.maven.apache.org/maven2/org/apache/avro/avro-mapred/1.7.4/avro-mapred-1.7.4.jar
(163 KB at 3696.6 KB/sec)
Downloaded: http://repo.maven.apache.org/maven2/org/apache/avro/avro/1.7.4/avro-1.7.4.jar
(297 KB at 5585.6 KB/sec)
Downloaded: http://repo.maven.apache.org/maven2/org/apache/avro/trevni-avro/1.7.4/trevni-avro-1.7.4.jar
(43 KB at 477.4 KB/sec)
Downloaded: http://repo.maven.apache.org/maven2/org/apache/avro/trevni-core/1.7.4/trevni-core-1.7.4.jar
(46 KB at 375.7 KB/sec)
[INFO] [INFO] Deleting <https://builds.apache.org/job/crunch-master-integration/org.apache.crunch$crunch-core/ws/target>

[INFO] --- maven-clean-plugin:2.5:clean (default-clean) @ crunch-core ---
[INFO] [INFO] Test Source directory: <https://builds.apache.org/job/crunch-master-integration/org.apache.crunch$crunch-core/ws/src/it/java>
added.

[INFO] --- build-helper-maven-plugin:1.7:add-test-source (add-test-source) @ crunch-core ---
[INFO] 
[INFO] --- build-helper-maven-plugin:1.7:add-test-resource (add-test-resource) @ crunch-core
---
[INFO] 
[INFO] --- avro-maven-plugin:1.7.4:schema (schemas) @ crunch-core ---
Downloading: http://repo.maven.apache.org/maven2/org/apache/avro/avro-compiler/1.7.4/avro-compiler-1.7.4.pom
Downloaded: http://repo.maven.apache.org/maven2/org/apache/avro/avro-compiler/1.7.4/avro-compiler-1.7.4.pom
(4 KB at 44.3 KB/sec)
Downloading: http://repo.maven.apache.org/maven2/org/apache/avro/avro-compiler/1.7.4/avro-compiler-1.7.4.jar
Downloaded: http://repo.maven.apache.org/maven2/org/apache/avro/avro-compiler/1.7.4/avro-compiler-1.7.4.jar
(74 KB at 1177.9 KB/sec)
[INFO] 
[INFO] --- maven-remote-resources-plugin:1.3:process (default) @ crunch-core ---
[debug] execute contextualize
[INFO] [INFO] Using 'UTF-8' encoding to copy filtered resources.
[INFO] Copying 1 resource
[INFO] Copying 3 resources

[INFO] --- maven-resources-plugin:2.5:resources (default-resources) @ crunch-core ---
[INFO] 
[INFO] --- maven-compiler-plugin:2.5.1:compile (default-compile) @ crunch-core ---
[INFO] Compiling 215 source files to <https://builds.apache.org/job/crunch-master-integration/org.apache.crunch$crunch-core/ws/target/classes>
[INFO] -------------------------------------------------------------
[ERROR] COMPILATION ERROR : 
[INFO] -------------------------------------------------------------
[ERROR] <https://builds.apache.org/job/crunch-master-integration/org.apache.crunch$crunch-core/ws/src/main/java/org/apache/crunch/lib/sort/Comparators.java>:[95,54]
cannot find symbol
symbol  : class WritableComparator
location: class org.apache.crunch.lib.sort.Comparators
[ERROR] <https://builds.apache.org/job/crunch-master-integration/org.apache.crunch$crunch-core/ws/src/main/java/org/apache/crunch/lib/sort/Comparators.java>:[95,84]
cannot find symbol
symbol  : class Configurable
location: class org.apache.crunch.lib.sort.Comparators
[ERROR] <https://builds.apache.org/job/crunch-master-integration/org.apache.crunch$crunch-core/ws/src/main/java/org/apache/crunch/lib/sort/Comparators.java>:[72,55]
cannot find symbol
symbol  : class Configured
location: class org.apache.crunch.lib.sort.Comparators
[ERROR] <https://builds.apache.org/job/crunch-master-integration/org.apache.crunch$crunch-core/ws/src/main/java/org/apache/crunch/lib/sort/Comparators.java>:[72,77]
cannot find symbol
symbol  : class RawComparator
location: class org.apache.crunch.lib.sort.Comparators
[ERROR] <https://builds.apache.org/job/crunch-master-integration/org.apache.crunch$crunch-core/ws/src/main/java/org/apache/crunch/lib/sort/Comparators.java>:[72,90]
interface expected here
[ERROR] <https://builds.apache.org/job/crunch-master-integration/org.apache.crunch$crunch-core/ws/src/main/java/org/apache/crunch/lib/sort/Comparators.java>:[47,59]
cannot find symbol
symbol  : class Configured
location: class org.apache.crunch.lib.sort.Comparators
[ERROR] <https://builds.apache.org/job/crunch-master-integration/org.apache.crunch$crunch-core/ws/src/main/java/org/apache/crunch/lib/sort/Comparators.java>:[47,81]
cannot find symbol
symbol  : class RawComparator
location: class org.apache.crunch.lib.sort.Comparators
[ERROR] <https://builds.apache.org/job/crunch-master-integration/org.apache.crunch$crunch-core/ws/src/main/java/org/apache/crunch/lib/sort/Comparators.java>:[47,94]
interface expected here
[ERROR] <https://builds.apache.org/job/crunch-master-integration/org.apache.crunch$crunch-core/ws/src/main/java/org/apache/crunch/lib/Sort.java>:[230,15]
sortComparatorClass(java.lang.Class<? extends org.apache.hadoop.io.RawComparator>) in
org.apache.crunch.GroupingOptions.Builder cannot be applied to (java.lang.Class<org.apache.crunch.lib.sort.Comparators.ReverseWritableComparator>)
[ERROR] <https://builds.apache.org/job/crunch-master-integration/org.apache.crunch$crunch-core/ws/src/main/java/org/apache/crunch/lib/Sort.java>:[235,15]
sortComparatorClass(java.lang.Class<? extends org.apache.hadoop.io.RawComparator>) in
org.apache.crunch.GroupingOptions.Builder cannot be applied to (java.lang.Class<org.apache.crunch.lib.sort.Comparators.ReverseAvroComparator>)
[ERROR] <https://builds.apache.org/job/crunch-master-integration/org.apache.crunch$crunch-core/ws/src/main/java/org/apache/crunch/lib/Sort.java>:[253,15]
sortComparatorClass(java.lang.Class<? extends org.apache.hadoop.io.RawComparator>) in
org.apache.crunch.GroupingOptions.Builder cannot be applied to (java.lang.Class<org.apache.crunch.lib.sort.Comparators.ReverseWritableComparator>)
[ERROR] <https://builds.apache.org/job/crunch-master-integration/org.apache.crunch$crunch-core/ws/src/main/java/org/apache/crunch/lib/Sort.java>:[256,15]
sortComparatorClass(java.lang.Class<? extends org.apache.hadoop.io.RawComparator>) in
org.apache.crunch.GroupingOptions.Builder cannot be applied to (java.lang.Class<org.apache.crunch.lib.sort.Comparators.TupleWritableComparator>)
[ERROR] <https://builds.apache.org/job/crunch-master-integration/org.apache.crunch$crunch-core/ws/src/main/java/org/apache/crunch/lib/Sort.java>:[263,15]
sortComparatorClass(java.lang.Class<? extends org.apache.hadoop.io.RawComparator>) in
org.apache.crunch.GroupingOptions.Builder cannot be applied to (java.lang.Class<org.apache.crunch.lib.sort.Comparators.ReverseAvroComparator>)
[ERROR] <https://builds.apache.org/job/crunch-master-integration/org.apache.crunch$crunch-core/ws/src/main/java/org/apache/crunch/lib/sort/Comparators.java>:[54,6]
non-static variable super cannot be referenced from a static context
[ERROR] <https://builds.apache.org/job/crunch-master-integration/org.apache.crunch$crunch-core/ws/src/main/java/org/apache/crunch/lib/sort/Comparators.java>:[54,11]
cannot find symbol
symbol  : method setConf(org.apache.hadoop.conf.Configuration)
location: class java.lang.Object
[ERROR] <https://builds.apache.org/job/crunch-master-integration/org.apache.crunch$crunch-core/ws/src/main/java/org/apache/crunch/lib/sort/Comparators.java>:[52,4]
method does not override or implement a method from a supertype
[ERROR] <https://builds.apache.org/job/crunch-master-integration/org.apache.crunch$crunch-core/ws/src/main/java/org/apache/crunch/lib/sort/Comparators.java>:[61,4]
method does not override or implement a method from a supertype
[ERROR] <https://builds.apache.org/job/crunch-master-integration/org.apache.crunch$crunch-core/ws/src/main/java/org/apache/crunch/lib/sort/Comparators.java>:[66,4]
method does not override or implement a method from a supertype
[ERROR] <https://builds.apache.org/job/crunch-master-integration/org.apache.crunch$crunch-core/ws/src/main/java/org/apache/crunch/lib/sort/Comparators.java>:[78,6]
non-static variable super cannot be referenced from a static context
[ERROR] <https://builds.apache.org/job/crunch-master-integration/org.apache.crunch$crunch-core/ws/src/main/java/org/apache/crunch/lib/sort/Comparators.java>:[78,11]
cannot find symbol
symbol  : method setConf(org.apache.hadoop.conf.Configuration)
location: class java.lang.Object
[ERROR] <https://builds.apache.org/job/crunch-master-integration/org.apache.crunch$crunch-core/ws/src/main/java/org/apache/crunch/lib/sort/Comparators.java>:[76,4]
method does not override or implement a method from a supertype
[ERROR] <https://builds.apache.org/job/crunch-master-integration/org.apache.crunch$crunch-core/ws/src/main/java/org/apache/crunch/lib/sort/Comparators.java>:[84,4]
method does not override or implement a method from a supertype
[ERROR] <https://builds.apache.org/job/crunch-master-integration/org.apache.crunch$crunch-core/ws/src/main/java/org/apache/crunch/lib/sort/Comparators.java>:[89,4]
method does not override or implement a method from a supertype
[ERROR] <https://builds.apache.org/job/crunch-master-integration/org.apache.crunch$crunch-core/ws/src/main/java/org/apache/crunch/lib/sort/Comparators.java>:[126,4]
method does not override or implement a method from a supertype
[ERROR] <https://builds.apache.org/job/crunch-master-integration/org.apache.crunch$crunch-core/ws/src/main/java/org/apache/crunch/lib/sort/Comparators.java>:[166,4]
method does not override or implement a method from a supertype
[ERROR] <https://builds.apache.org/job/crunch-master-integration/org.apache.crunch$crunch-core/ws/src/main/java/org/apache/crunch/lib/sort/Comparators.java>:[171,4]
method does not override or implement a method from a supertype
[INFO] 26 errors 
[INFO] -------------------------------------------------------------

Mime
View raw message