crunch-dev mailing list archives

Site index · List index
Message view « Date » · « Thread »
Top « Date » · « Thread »
From Apache Jenkins Server <jenk...@builds.apache.org>
Subject Build failed in Jenkins: Crunch-master » Apache Crunch Core #1118
Date Thu, 25 Apr 2013 00:34:50 GMT
See <https://builds.apache.org/job/Crunch-master/org.apache.crunch$crunch-core/1118/changes>

Changes:

[jwills] CRUNCH-197: Swap in AvroKey for AvroWrapper in the AvroKeyConverter object.

------------------------------------------
[INFO]                                                                         
[INFO] ------------------------------------------------------------------------
[INFO] Building Apache Crunch Core 0.6.0-SNAPSHOT
[INFO] ------------------------------------------------------------------------
[INFO] 
[INFO] --- maven-clean-plugin:2.5:clean (default-clean) @ crunch-core ---
[INFO] Test Source directory: <https://builds.apache.org/job/Crunch-master/org.apache.crunch$crunch-core/ws/src/it/java>
added.
[INFO] 
[INFO] --- build-helper-maven-plugin:1.7:add-test-source (add-test-source) @ crunch-core ---
[INFO] 
[INFO] --- build-helper-maven-plugin:1.7:add-test-resource (add-test-resource) @ crunch-core
---
[INFO] 
[INFO] --- avro-maven-plugin:1.7.0:schema (schemas) @ crunch-core ---
[INFO] 
[INFO] --- maven-remote-resources-plugin:1.3:process (default) @ crunch-core ---
[debug] execute contextualize
[INFO] [INFO] Using 'UTF-8' encoding to copy filtered resources.
[INFO] Copying 1 resource
[INFO] Copying 3 resources

[INFO] --- maven-resources-plugin:2.5:resources (default-resources) @ crunch-core ---
[INFO] [INFO] Compiling 212 source files to <https://builds.apache.org/job/Crunch-master/org.apache.crunch$crunch-core/ws/target/classes>

[INFO] --- maven-compiler-plugin:2.5.1:compile (default-compile) @ crunch-core ---
[INFO] -------------------------------------------------------------
[ERROR] COMPILATION ERROR : 
[INFO] -------------------------------------------------------------
[ERROR] <https://builds.apache.org/job/Crunch-master/org.apache.crunch$crunch-core/ws/src/main/java/org/apache/crunch/lib/sort/Comparators.java>:[95,54]
cannot find symbol
symbol  : class WritableComparator
location: class org.apache.crunch.lib.sort.Comparators
[ERROR] <https://builds.apache.org/job/Crunch-master/org.apache.crunch$crunch-core/ws/src/main/java/org/apache/crunch/lib/sort/Comparators.java>:[95,84]
cannot find symbol
symbol  : class Configurable
location: class org.apache.crunch.lib.sort.Comparators
[ERROR] <https://builds.apache.org/job/Crunch-master/org.apache.crunch$crunch-core/ws/src/main/java/org/apache/crunch/lib/sort/Comparators.java>:[72,55]
cannot find symbol
symbol  : class Configured
location: class org.apache.crunch.lib.sort.Comparators
[ERROR] <https://builds.apache.org/job/Crunch-master/org.apache.crunch$crunch-core/ws/src/main/java/org/apache/crunch/lib/sort/Comparators.java>:[72,77]
cannot find symbol
symbol  : class RawComparator
location: class org.apache.crunch.lib.sort.Comparators
[ERROR] <https://builds.apache.org/job/Crunch-master/org.apache.crunch$crunch-core/ws/src/main/java/org/apache/crunch/lib/sort/Comparators.java>:[72,90]
interface expected here
[ERROR] <https://builds.apache.org/job/Crunch-master/org.apache.crunch$crunch-core/ws/src/main/java/org/apache/crunch/lib/sort/Comparators.java>:[47,59]
cannot find symbol
symbol  : class Configured
location: class org.apache.crunch.lib.sort.Comparators
[ERROR] <https://builds.apache.org/job/Crunch-master/org.apache.crunch$crunch-core/ws/src/main/java/org/apache/crunch/lib/sort/Comparators.java>:[47,81]
cannot find symbol
symbol  : class RawComparator
location: class org.apache.crunch.lib.sort.Comparators
[ERROR] <https://builds.apache.org/job/Crunch-master/org.apache.crunch$crunch-core/ws/src/main/java/org/apache/crunch/lib/sort/Comparators.java>:[47,94]
interface expected here
[ERROR] <https://builds.apache.org/job/Crunch-master/org.apache.crunch$crunch-core/ws/src/main/java/org/apache/crunch/lib/Sort.java>:[230,15]
sortComparatorClass(java.lang.Class<? extends org.apache.hadoop.io.RawComparator>) in
org.apache.crunch.GroupingOptions.Builder cannot be applied to (java.lang.Class<org.apache.crunch.lib.sort.Comparators.ReverseWritableComparator>)
[ERROR] <https://builds.apache.org/job/Crunch-master/org.apache.crunch$crunch-core/ws/src/main/java/org/apache/crunch/lib/Sort.java>:[235,15]
sortComparatorClass(java.lang.Class<? extends org.apache.hadoop.io.RawComparator>) in
org.apache.crunch.GroupingOptions.Builder cannot be applied to (java.lang.Class<org.apache.crunch.lib.sort.Comparators.ReverseAvroComparator>)
[ERROR] <https://builds.apache.org/job/Crunch-master/org.apache.crunch$crunch-core/ws/src/main/java/org/apache/crunch/lib/Sort.java>:[253,15]
sortComparatorClass(java.lang.Class<? extends org.apache.hadoop.io.RawComparator>) in
org.apache.crunch.GroupingOptions.Builder cannot be applied to (java.lang.Class<org.apache.crunch.lib.sort.Comparators.ReverseWritableComparator>)
[ERROR] <https://builds.apache.org/job/Crunch-master/org.apache.crunch$crunch-core/ws/src/main/java/org/apache/crunch/lib/Sort.java>:[256,15]
sortComparatorClass(java.lang.Class<? extends org.apache.hadoop.io.RawComparator>) in
org.apache.crunch.GroupingOptions.Builder cannot be applied to (java.lang.Class<org.apache.crunch.lib.sort.Comparators.TupleWritableComparator>)
[ERROR] <https://builds.apache.org/job/Crunch-master/org.apache.crunch$crunch-core/ws/src/main/java/org/apache/crunch/lib/Sort.java>:[263,15]
sortComparatorClass(java.lang.Class<? extends org.apache.hadoop.io.RawComparator>) in
org.apache.crunch.GroupingOptions.Builder cannot be applied to (java.lang.Class<org.apache.crunch.lib.sort.Comparators.ReverseAvroComparator>)
[ERROR] <https://builds.apache.org/job/Crunch-master/org.apache.crunch$crunch-core/ws/src/main/java/org/apache/crunch/lib/sort/Comparators.java>:[54,6]
non-static variable super cannot be referenced from a static context
[ERROR] <https://builds.apache.org/job/Crunch-master/org.apache.crunch$crunch-core/ws/src/main/java/org/apache/crunch/lib/sort/Comparators.java>:[54,11]
cannot find symbol
symbol  : method setConf(org.apache.hadoop.conf.Configuration)
location: class java.lang.Object
[ERROR] <https://builds.apache.org/job/Crunch-master/org.apache.crunch$crunch-core/ws/src/main/java/org/apache/crunch/lib/sort/Comparators.java>:[52,4]
method does not override or implement a method from a supertype
[ERROR] <https://builds.apache.org/job/Crunch-master/org.apache.crunch$crunch-core/ws/src/main/java/org/apache/crunch/lib/sort/Comparators.java>:[61,4]
method does not override or implement a method from a supertype
[ERROR] <https://builds.apache.org/job/Crunch-master/org.apache.crunch$crunch-core/ws/src/main/java/org/apache/crunch/lib/sort/Comparators.java>:[66,4]
method does not override or implement a method from a supertype
[ERROR] <https://builds.apache.org/job/Crunch-master/org.apache.crunch$crunch-core/ws/src/main/java/org/apache/crunch/lib/sort/Comparators.java>:[78,6]
non-static variable super cannot be referenced from a static context
[ERROR] <https://builds.apache.org/job/Crunch-master/org.apache.crunch$crunch-core/ws/src/main/java/org/apache/crunch/lib/sort/Comparators.java>:[78,11]
cannot find symbol
symbol  : method setConf(org.apache.hadoop.conf.Configuration)
location: class java.lang.Object
[ERROR] <https://builds.apache.org/job/Crunch-master/org.apache.crunch$crunch-core/ws/src/main/java/org/apache/crunch/lib/sort/Comparators.java>:[76,4]
method does not override or implement a method from a supertype
[ERROR] <https://builds.apache.org/job/Crunch-master/org.apache.crunch$crunch-core/ws/src/main/java/org/apache/crunch/lib/sort/Comparators.java>:[84,4]
method does not override or implement a method from a supertype
[ERROR] <https://builds.apache.org/job/Crunch-master/org.apache.crunch$crunch-core/ws/src/main/java/org/apache/crunch/lib/sort/Comparators.java>:[89,4]
method does not override or implement a method from a supertype
[ERROR] <https://builds.apache.org/job/Crunch-master/org.apache.crunch$crunch-core/ws/src/main/java/org/apache/crunch/lib/sort/Comparators.java>:[126,4]
method does not override or implement a method from a supertype
[ERROR] <https://builds.apache.org/job/Crunch-master/org.apache.crunch$crunch-core/ws/src/main/java/org/apache/crunch/lib/sort/Comparators.java>:[166,4]
method does not override or implement a method from a supertype
[ERROR] <https://builds.apache.org/job/Crunch-master/org.apache.crunch$crunch-core/ws/src/main/java/org/apache/crunch/lib/sort/Comparators.java>:[171,4]
method does not override or implement a method from a supertype
[INFO] 26 errors 
[INFO] -------------------------------------------------------------

Mime
View raw message