crunch-dev mailing list archives

Site index · List index
Message view « Date » · « Thread »
Top « Date » · « Thread »
From Apache Jenkins Server <jenk...@builds.apache.org>
Subject Build failed in Jenkins: Crunch-master-integration #260
Date Thu, 18 Apr 2013 03:49:08 GMT
See <https://builds.apache.org/job/Crunch-master-integration/260/>

------------------------------------------
[...truncated 1372 lines...]
1174096 [Thread-3105] WARN  org.apache.hadoop.mapred.JobClient  - Use GenericOptionsParser
for parsing the arguments. Applications should implement Tool for the same.
1174142 [Thread-3105] WARN  org.apache.hadoop.mapred.JobClient  - No job jar file set.  User
classes may not be found. See JobConf(Class) or JobConf#setJar(String).
1174166 [Thread-3105] INFO  org.apache.crunch.hadoop.mapreduce.lib.jobcontrol.CrunchControlledJob
 - Running job "org.apache.crunch.lib.AggregateIT: Text(/tmp/junit777955773531245645/shakes.txt)+S0+S1+min+GBK+combine+PTables.values+Avro(/tmp/junit777955773531245645/tmp-crunch.tmp.dir/crunch-949060873/p3)"
1174166 [Thread-3105] INFO  org.apache.crunch.hadoop.mapreduce.lib.jobcontrol.CrunchControlledJob
 - Job status available at: http://localhost:8080/
1181748 [main] INFO  org.apache.crunch.impl.mr.collect.PGroupedTableImpl  - Setting num reduce
tasks to 1
1181751 [Thread-3130] WARN  org.apache.hadoop.mapred.JobClient  - Use GenericOptionsParser
for parsing the arguments. Applications should implement Tool for the same.
1181784 [Thread-3130] WARN  org.apache.hadoop.mapred.JobClient  - No job jar file set.  User
classes may not be found. See JobConf(Class) or JobConf#setJar(String).
1181803 [Thread-3130] INFO  org.apache.crunch.hadoop.mapreduce.lib.jobcontrol.CrunchControlledJob
 - Running job "org.apache.crunch.lib.AggregateIT: Text(/tmp/junit8087747471245993739/urls.txt)+S0+GBK+collect+SeqFile(/tmp/junit8087747471245993739/tmp-crunch.tmp.dir/crunch-1663365377/p1)"
1181803 [Thread-3130] INFO  org.apache.crunch.hadoop.mapreduce.lib.jobcontrol.CrunchControlledJob
 - Job status available at: http://localhost:8080/
1189375 [main] INFO  org.apache.crunch.impl.mr.collect.PGroupedTableImpl  - Setting num reduce
tasks to 1
1189379 [Thread-3148] WARN  org.apache.hadoop.mapred.JobClient  - Use GenericOptionsParser
for parsing the arguments. Applications should implement Tool for the same.
1189411 [Thread-3148] WARN  org.apache.hadoop.mapred.JobClient  - No job jar file set.  User
classes may not be found. See JobConf(Class) or JobConf#setJar(String).
1189431 [Thread-3148] INFO  org.apache.crunch.hadoop.mapreduce.lib.jobcontrol.CrunchControlledJob
 - Running job "org.apache.crunch.lib.AggregateIT: Text(/tmp/junit3278126769674636399/set2.txt)+S0+GBK+collect+SeqFile(/tmp/junit3278126769674636399/tmp-crunch.tmp.dir/crunch-1279180059/p1)"
1189431 [Thread-3148] INFO  org.apache.crunch.hadoop.mapreduce.lib.jobcontrol.CrunchControlledJob
 - Job status available at: http://localhost:8080/
1197062 [main] INFO  org.apache.crunch.impl.mr.collect.PGroupedTableImpl  - Setting num reduce
tasks to 1
1197066 [Thread-3166] WARN  org.apache.hadoop.mapred.JobClient  - Use GenericOptionsParser
for parsing the arguments. Applications should implement Tool for the same.
1197097 [Thread-3166] WARN  org.apache.hadoop.mapred.JobClient  - No job jar file set.  User
classes may not be found. See JobConf(Class) or JobConf#setJar(String).
1197118 [Thread-3166] INFO  org.apache.crunch.hadoop.mapreduce.lib.jobcontrol.CrunchControlledJob
 - Running job "org.apache.crunch.lib.AggregateIT: Text(/tmp/junit8223312797947568374/set2.txt)+S0+GBK+collect+Avro(/tmp/junit8223312797947568374/tmp-crunch.tmp.dir/crunch-1092010719/p1)"
1197118 [Thread-3166] INFO  org.apache.crunch.hadoop.mapreduce.lib.jobcontrol.CrunchControlledJob
 - Job status available at: http://localhost:8080/
Tests run: 7, Failures: 0, Errors: 0, Skipped: 0, Time elapsed: 53.513 sec
Running org.apache.crunch.CollectionsLengthIT
1204692 [Thread-3184] WARN  org.apache.hadoop.mapred.JobClient  - Use GenericOptionsParser
for parsing the arguments. Applications should implement Tool for the same.
1204739 [Thread-3184] WARN  org.apache.hadoop.mapred.JobClient  - No job jar file set.  User
classes may not be found. See JobConf(Class) or JobConf#setJar(String).
1204761 [Thread-3184] INFO  org.apache.crunch.hadoop.mapreduce.lib.jobcontrol.CrunchControlledJob
 - Running job "org.apache.crunch.CollectionsIT: Text(/tmp/junit3938072044057693824/shakes.txt)+Aggregate.count+GBK+combine+PTables.values+SeqFile(/tmp/junit3938072044057693824/tmp-crunch.tmp.dir/crunch-1089905551/p1)"
1204761 [Thread-3184] INFO  org.apache.crunch.hadoop.mapreduce.lib.jobcontrol.CrunchControlledJob
 - Job status available at: http://localhost:8080/
1212333 [Thread-3209] WARN  org.apache.hadoop.mapred.JobClient  - Use GenericOptionsParser
for parsing the arguments. Applications should implement Tool for the same.
1212380 [Thread-3209] WARN  org.apache.hadoop.mapred.JobClient  - No job jar file set.  User
classes may not be found. See JobConf(Class) or JobConf#setJar(String).
1212402 [Thread-3209] INFO  org.apache.crunch.hadoop.mapreduce.lib.jobcontrol.CrunchControlledJob
 - Running job "org.apache.crunch.CollectionsIT: Text(/tmp/junit1859229178680082368/shakes.txt)+Aggregate.count+GBK+combine+PTables.values+SeqFile(/tmp/junit1859229178680082368/tmp-crunch.tmp.dir/crunch-555684562/p1)"
1212402 [Thread-3209] INFO  org.apache.crunch.hadoop.mapreduce.lib.jobcontrol.CrunchControlledJob
 - Job status available at: http://localhost:8080/
Tests run: 4, Failures: 0, Errors: 0, Skipped: 0, Time elapsed: 15.301 sec
Running org.apache.crunch.MapPObjectIT
1219992 [Thread-3234] WARN  org.apache.hadoop.mapred.JobClient  - Use GenericOptionsParser
for parsing the arguments. Applications should implement Tool for the same.
1220007 [Thread-3234] WARN  org.apache.hadoop.mapred.JobClient  - No job jar file set.  User
classes may not be found. See JobConf(Class) or JobConf#setJar(String).
1220024 [Thread-3234] INFO  org.apache.crunch.hadoop.mapreduce.lib.jobcontrol.CrunchControlledJob
 - Running job "org.apache.crunch.MaterializeToMapIT: Text(/tmp/junit8585096285370234450/set1.txt)+S0+SeqFile(/tmp/junit8585096285370234450/tmp-crunch.tmp.dir/crunch-1739163469/p1)"
1220024 [Thread-3234] INFO  org.apache.crunch.hadoop.mapreduce.lib.jobcontrol.CrunchControlledJob
 - Job status available at: http://localhost:8080/
1224594 [Thread-3244] WARN  org.apache.hadoop.mapred.JobClient  - Use GenericOptionsParser
for parsing the arguments. Applications should implement Tool for the same.
1224611 [Thread-3244] WARN  org.apache.hadoop.mapred.JobClient  - No job jar file set.  User
classes may not be found. See JobConf(Class) or JobConf#setJar(String).
1224627 [Thread-3244] INFO  org.apache.crunch.hadoop.mapreduce.lib.jobcontrol.CrunchControlledJob
 - Running job "org.apache.crunch.MaterializeToMapIT: Text(/tmp/junit7747789926365006808/set1.txt)+S0+SeqFile(/tmp/junit7747789926365006808/tmp-crunch.tmp.dir/crunch-847314460/p1)"
1224627 [Thread-3244] INFO  org.apache.crunch.hadoop.mapreduce.lib.jobcontrol.CrunchControlledJob
 - Job status available at: http://localhost:8080/
Tests run: 4, Failures: 0, Errors: 0, Skipped: 0, Time elapsed: 9.205 sec
Running org.apache.crunch.CancelJobsIT
1229190 [main] INFO  org.apache.crunch.io.impl.FileTargetImpl  - Will write output files to
new path: /tmp/junit2189807988238510905/cancel
1229198 [main] INFO  org.apache.crunch.impl.mr.collect.PGroupedTableImpl  - Setting num reduce
tasks to 1
1229204 [Thread-3254] WARN  org.apache.hadoop.mapred.JobClient  - Use GenericOptionsParser
for parsing the arguments. Applications should implement Tool for the same.
1229253 [Thread-3254] WARN  org.apache.hadoop.mapred.JobClient  - No job jar file set.  User
classes may not be found. See JobConf(Class) or JobConf#setJar(String).
1229276 [Thread-3254] INFO  org.apache.crunch.hadoop.mapreduce.lib.jobcontrol.CrunchControlledJob
 - Running job "org.apache.crunch.CancelJobsIT: Text(/tmp/junit2189807988238510905/shakes.txt)+Aggregate.count+GBK+combine+top20map+SeqFile(/tmp/junit2189807988238510905/tmp-crunch.tmp.dir/crunch-1891078581/p1)"
1229276 [Thread-3254] INFO  org.apache.crunch.hadoop.mapreduce.lib.jobcontrol.CrunchControlledJob
 - Job status available at: http://localhost:8080/
1235830 [Thread-3254] WARN  org.apache.hadoop.mapred.JobClient  - Use GenericOptionsParser
for parsing the arguments. Applications should implement Tool for the same.
1235876 [Thread-3254] WARN  org.apache.hadoop.mapred.JobClient  - No job jar file set.  User
classes may not be found. See JobConf(Class) or JobConf#setJar(String).
1235899 [Thread-3254] INFO  org.apache.crunch.hadoop.mapreduce.lib.jobcontrol.CrunchControlledJob
 - Running job "org.apache.crunch.CancelJobsIT: SeqFile(/tmp/junit2189807988238510905/tmp-crunch.tmp.dir/crunch-1891078581/p1)+GBK+combine+top20reduce+Text(/tmp/junit2189807988238510905/cancel)"
1235899 [Thread-3254] INFO  org.apache.crunch.hadoop.mapreduce.lib.jobcontrol.CrunchControlledJob
 - Job status available at: http://localhost:8080/
1243942 [main] INFO  org.apache.crunch.io.impl.FileTargetImpl  - Will write output files to
new path: /tmp/junit8344577451883696115/cancel
1243951 [main] INFO  org.apache.crunch.impl.mr.collect.PGroupedTableImpl  - Setting num reduce
tasks to 1
1243959 [main] INFO  org.apache.crunch.io.impl.FileTargetImpl  - Will write output files to
new path: /tmp/junit3336671511161494013/cancel
1243969 [main] INFO  org.apache.crunch.impl.mr.collect.PGroupedTableImpl  - Setting num reduce
tasks to 1
1243976 [main] INFO  org.apache.crunch.io.impl.FileTargetImpl  - Will write output files to
new path: /tmp/junit7770566773088051041/cancel
1243986 [main] INFO  org.apache.crunch.impl.mr.collect.PGroupedTableImpl  - Setting num reduce
tasks to 1
1243989 [Thread-3305] WARN  org.apache.hadoop.mapred.JobClient  - Use GenericOptionsParser
for parsing the arguments. Applications should implement Tool for the same.
1244037 [Thread-3305] WARN  org.apache.hadoop.mapred.JobClient  - No job jar file set.  User
classes may not be found. See JobConf(Class) or JobConf#setJar(String).
1244059 [Thread-3305] INFO  org.apache.crunch.hadoop.mapreduce.lib.jobcontrol.CrunchControlledJob
 - Running job "org.apache.crunch.CancelJobsIT: Text(/tmp/junit7770566773088051041/shakes.txt)+Aggregate.count+GBK+combine+top20map+SeqFile(/tmp/junit7770566773088051041/tmp-crunch.tmp.dir/crunch-1312245747/p1)"
1244059 [Thread-3305] INFO  org.apache.crunch.hadoop.mapreduce.lib.jobcontrol.CrunchControlledJob
 - Job status available at: http://localhost:8080/
1250613 [Thread-3305] WARN  org.apache.hadoop.mapred.JobClient  - Use GenericOptionsParser
for parsing the arguments. Applications should implement Tool for the same.
1250660 [Thread-3305] WARN  org.apache.hadoop.mapred.JobClient  - No job jar file set.  User
classes may not be found. See JobConf(Class) or JobConf#setJar(String).
1250683 [Thread-3305] INFO  org.apache.crunch.hadoop.mapreduce.lib.jobcontrol.CrunchControlledJob
 - Running job "org.apache.crunch.CancelJobsIT: SeqFile(/tmp/junit7770566773088051041/tmp-crunch.tmp.dir/crunch-1312245747/p1)+GBK+combine+top20reduce+Text(/tmp/junit7770566773088051041/cancel)"
1250683 [Thread-3305] INFO  org.apache.crunch.hadoop.mapreduce.lib.jobcontrol.CrunchControlledJob
 - Job status available at: http://localhost:8080/
Tests run: 4, Failures: 0, Errors: 0, Skipped: 0, Time elapsed: 29.507 sec
Running org.apache.crunch.MaterializeIT
1258717 [main] WARN  org.apache.crunch.impl.mr.collect.PCollectionImpl  - Materializing an
empty PCollection: S0
1258722 [main] WARN  org.apache.crunch.impl.mr.collect.PCollectionImpl  - Materializing an
empty PCollection: S0
1258737 [Thread-3356] WARN  org.apache.hadoop.mapred.JobClient  - Use GenericOptionsParser
for parsing the arguments. Applications should implement Tool for the same.
1258749 [Thread-3356] WARN  org.apache.hadoop.mapred.JobClient  - No job jar file set.  User
classes may not be found. See JobConf(Class) or JobConf#setJar(String).
1258765 [Thread-3356] INFO  org.apache.crunch.hadoop.mapreduce.lib.jobcontrol.CrunchControlledJob
 - Running job "org.apache.crunch.MaterializeIT: Text(/tmp/junit6567303040739316399/set1.txt)+S0+Avro(/tmp/crunch-1613591421/p1)"
1258766 [Thread-3356] INFO  org.apache.crunch.hadoop.mapreduce.lib.jobcontrol.CrunchControlledJob
 - Job status available at: http://localhost:8080/
Tests run: 9, Failures: 0, Errors: 0, Skipped: 0, Time elapsed: 4.629 sec
Running org.apache.crunch.TextPairIT
1263335 [Thread-3364] WARN  org.apache.hadoop.mapred.JobClient  - Use GenericOptionsParser
for parsing the arguments. Applications should implement Tool for the same.
1263350 [Thread-3364] WARN  org.apache.hadoop.mapred.JobClient  - No job jar file set.  User
classes may not be found. See JobConf(Class) or JobConf#setJar(String).
1263367 [Thread-3364] INFO  org.apache.crunch.hadoop.mapreduce.lib.jobcontrol.CrunchControlledJob
 - Running job "org.apache.crunch.TextPairIT: Text(/tmp/junit82518651903293238/shakes.txt)+my
word duplicator+SeqFile(/tmp/junit82518651903293238/tmp-crunch.tmp.dir/crunch-665263352/p1)"
1263367 [Thread-3364] INFO  org.apache.crunch.hadoop.mapreduce.lib.jobcontrol.CrunchControlledJob
 - Job status available at: http://localhost:8080/
Tests run: 1, Failures: 0, Errors: 0, Skipped: 0, Time elapsed: 4.602 sec
Running org.apache.crunch.TupleNClassCastBugIT
1267931 [main] INFO  org.apache.crunch.io.impl.FileTargetImpl  - Will write output files to
new path: /tmp/junit8380050544117738920/output
1267938 [main] INFO  org.apache.crunch.impl.mr.collect.PGroupedTableImpl  - Setting num reduce
tasks to 1
1267941 [Thread-3374] WARN  org.apache.hadoop.mapred.JobClient  - Use GenericOptionsParser
for parsing the arguments. Applications should implement Tool for the same.
1267973 [Thread-3374] WARN  org.apache.hadoop.mapred.JobClient  - No job jar file set.  User
classes may not be found. See JobConf(Class) or JobConf#setJar(String).
1267994 [Thread-3374] INFO  org.apache.crunch.hadoop.mapreduce.lib.jobcontrol.CrunchControlledJob
 - Running job "org.apache.crunch.TupleNClassCastBugIT: Text(/tmp/junit8380050544117738920/docs.txt)+S0+GBK+S1+asText+Text(/tmp/junit8380050544117738920/output)"
1267994 [Thread-3374] INFO  org.apache.crunch.hadoop.mapreduce.lib.jobcontrol.CrunchControlledJob
 - Job status available at: http://localhost:8080/
1275556 [main] INFO  org.apache.crunch.io.impl.FileTargetImpl  - Will write output files to
new path: /tmp/junit3499015708488024565/output
1275564 [main] INFO  org.apache.crunch.impl.mr.collect.PGroupedTableImpl  - Setting num reduce
tasks to 1
1275567 [Thread-3392] WARN  org.apache.hadoop.mapred.JobClient  - Use GenericOptionsParser
for parsing the arguments. Applications should implement Tool for the same.
1275599 [Thread-3392] WARN  org.apache.hadoop.mapred.JobClient  - No job jar file set.  User
classes may not be found. See JobConf(Class) or JobConf#setJar(String).
1275616 [Thread-3392] INFO  org.apache.crunch.hadoop.mapreduce.lib.jobcontrol.CrunchControlledJob
 - Running job "org.apache.crunch.TupleNClassCastBugIT: Text(/tmp/junit3499015708488024565/docs.txt)+S0+GBK+S1+asText+Text(/tmp/junit3499015708488024565/output)"
1275616 [Thread-3392] INFO  org.apache.crunch.hadoop.mapreduce.lib.jobcontrol.CrunchControlledJob
 - Job status available at: http://localhost:8080/
Tests run: 2, Failures: 0, Errors: 0, Skipped: 0, Time elapsed: 15.305 sec
Running org.apache.crunch.CleanTextIT
1283237 [main] INFO  org.apache.crunch.io.impl.FileTargetImpl  - Will write output files to
new path: /tmp/junit771307677564113299/cleanShakes
1283238 [main] INFO  org.apache.crunch.io.impl.FileTargetImpl  - Will write output files to
new path: /tmp/junit771307677564113299/wordCounts
1283248 [main] INFO  org.apache.crunch.impl.mr.collect.PGroupedTableImpl  - Setting num reduce
tasks to 1
1283251 [Thread-3410] WARN  org.apache.hadoop.mapred.JobClient  - Use GenericOptionsParser
for parsing the arguments. Applications should implement Tool for the same.
1283267 [Thread-3410] WARN  org.apache.hadoop.mapred.JobClient  - No job jar file set.  User
classes may not be found. See JobConf(Class) or JobConf#setJar(String).
1283284 [Thread-3410] INFO  org.apache.crunch.hadoop.mapreduce.lib.jobcontrol.CrunchControlledJob
 - Running job "org.apache.crunch.CleanTextIT: Text(/tmp/junit771307677564113299/shakes.txt)+S0+Text(/tmp/junit771307677564113299/cleanShakes)"
1283284 [Thread-3410] INFO  org.apache.crunch.hadoop.mapreduce.lib.jobcontrol.CrunchControlledJob
 - Job status available at: http://localhost:8080/
1283285 [Thread-3410] WARN  org.apache.hadoop.mapred.JobClient  - Use GenericOptionsParser
for parsing the arguments. Applications should implement Tool for the same.
1283328 [Thread-3410] WARN  org.apache.hadoop.mapred.JobClient  - No job jar file set.  User
classes may not be found. See JobConf(Class) or JobConf#setJar(String).
1283350 [Thread-3410] INFO  org.apache.crunch.hadoop.mapreduce.lib.jobcontrol.CrunchControlledJob
 - Running job "org.apache.crunch.CleanTextIT: Text(/tmp/junit771307677564113299/shakes.txt)+S0+S1+Aggregate.count+GBK+combine+Text(/tmp/junit771307677564113299/wordCounts)"
1283350 [Thread-3410] INFO  org.apache.crunch.hadoop.mapreduce.lib.jobcontrol.CrunchControlledJob
 - Job status available at: http://localhost:8080/
Tests run: 1, Failures: 0, Errors: 0, Skipped: 0, Time elapsed: 7.679 sec
Running org.apache.crunch.StageResultsCountersIT
1290925 [Thread-3444] WARN  org.apache.hadoop.mapred.JobClient  - Use GenericOptionsParser
for parsing the arguments. Applications should implement Tool for the same.
1290947 [Thread-3444] WARN  org.apache.hadoop.mapred.JobClient  - No job jar file set.  User
classes may not be found. See JobConf(Class) or JobConf#setJar(String).
1290963 [Thread-3444] INFO  org.apache.crunch.hadoop.mapreduce.lib.jobcontrol.CrunchControlledJob
 - Running job "org.apache.crunch.StageResultsCountersIT: Text(/tmp/junit2677624312891495730/shakes.txt)+S0+SeqFile(/tmp/junit2677624312891495730/tmp-crunch.tmp.dir/crunch-1033251601/p1)"
1290963 [Thread-3444] INFO  org.apache.crunch.hadoop.mapreduce.lib.jobcontrol.CrunchControlledJob
 - Job status available at: http://localhost:8080/
1295534 [Thread-3454] WARN  org.apache.hadoop.mapred.JobClient  - Use GenericOptionsParser
for parsing the arguments. Applications should implement Tool for the same.
1295549 [Thread-3454] WARN  org.apache.hadoop.mapred.JobClient  - No job jar file set.  User
classes may not be found. See JobConf(Class) or JobConf#setJar(String).
1295566 [Thread-3454] INFO  org.apache.crunch.hadoop.mapreduce.lib.jobcontrol.CrunchControlledJob
 - Running job "org.apache.crunch.StageResultsCountersIT: Text(/tmp/junit894892268686315920/shakes.txt)+S0+Avro(/tmp/junit894892268686315920/tmp-crunch.tmp.dir/crunch-545103971/p1)"
1295566 [Thread-3454] INFO  org.apache.crunch.hadoop.mapreduce.lib.jobcontrol.CrunchControlledJob
 - Job status available at: http://localhost:8080/
Tests run: 4, Failures: 0, Errors: 0, Skipped: 0, Time elapsed: 9.263 sec
Running org.apache.crunch.CollectionsIT
1300188 [main] INFO  org.apache.crunch.impl.mr.collect.PGroupedTableImpl  - Setting num reduce
tasks to 1
1300194 [Thread-3464] WARN  org.apache.hadoop.mapred.JobClient  - Use GenericOptionsParser
for parsing the arguments. Applications should implement Tool for the same.
1300240 [Thread-3464] WARN  org.apache.hadoop.mapred.JobClient  - No job jar file set.  User
classes may not be found. See JobConf(Class) or JobConf#setJar(String).
1300263 [Thread-3464] INFO  org.apache.crunch.hadoop.mapreduce.lib.jobcontrol.CrunchControlledJob
 - Running job "org.apache.crunch.CollectionsIT: Text(/tmp/junit2470113445073086992/shakes.txt)+S0+GBK+combine+SeqFile(/tmp/junit2470113445073086992/tmp-crunch.tmp.dir/crunch-497295058/p1)"
1300263 [Thread-3464] INFO  org.apache.crunch.hadoop.mapreduce.lib.jobcontrol.CrunchControlledJob
 - Job status available at: http://localhost:8080/
1308101 [main] INFO  org.apache.crunch.impl.mr.collect.PGroupedTableImpl  - Setting num reduce
tasks to 1
1308103 [Thread-3489] WARN  org.apache.hadoop.mapred.JobClient  - Use GenericOptionsParser
for parsing the arguments. Applications should implement Tool for the same.
1308150 [Thread-3489] WARN  org.apache.hadoop.mapred.JobClient  - No job jar file set.  User
classes may not be found. See JobConf(Class) or JobConf#setJar(String).
1308173 [Thread-3489] INFO  org.apache.crunch.hadoop.mapreduce.lib.jobcontrol.CrunchControlledJob
 - Running job "org.apache.crunch.CollectionsIT: Text(/tmp/junit1291715299119188599/shakes.txt)+S0+GBK+combine+Avro(/tmp/junit1291715299119188599/tmp-crunch.tmp.dir/crunch-244136472/p1)"
1308173 [Thread-3489] INFO  org.apache.crunch.hadoop.mapreduce.lib.jobcontrol.CrunchControlledJob
 - Job status available at: http://localhost:8080/
Tests run: 4, Failures: 0, Errors: 0, Skipped: 0, Time elapsed: 15.75 sec

Results :

Tests run: 167, Failures: 0, Errors: 0, Skipped: 1

[INFO] ------------------------------------------------------------------------
[INFO] Reactor Summary:
[INFO] 
[INFO] Apache Crunch ..................................... SUCCESS [31.885s]
[INFO] Apache Crunch Test ................................ SUCCESS [23.461s]
[INFO] Apache Crunch Core ................................ FAILURE [22:22.716s]
[INFO] Apache Crunch HBase Support ....................... SKIPPED
[INFO] Apache Crunch Contrib ............................. SKIPPED
[INFO] Apache Crunch Examples ............................ SKIPPED
[INFO] Apache Crunch Archetype ........................... SKIPPED
[INFO] Apache Crunch for Scala ........................... SKIPPED
[INFO] Apache Crunch Distribution ........................ SKIPPED
[INFO] ------------------------------------------------------------------------
[INFO] BUILD FAILURE
[INFO] ------------------------------------------------------------------------
[INFO] Total time: 23:21.627s
[INFO] Finished at: Thu Apr 18 03:48:41 UTC 2013
[INFO] Final Memory: 21M/71M
[INFO] ------------------------------------------------------------------------
[JENKINS] Archiving <https://builds.apache.org/job/Crunch-master-integration/ws/crunch-dist/pom.xml>
to /home/hudson/hudson/jobs/Crunch-master-integration/modules/org.apache.crunch$crunch-dist/builds/2013-04-18_03-25-03/archive/org.apache.crunch/crunch-dist/0.6.0-SNAPSHOT/crunch-dist-0.6.0-SNAPSHOT.pom
[JENKINS] Archiving <https://builds.apache.org/job/Crunch-master-integration/ws/crunch-hbase/pom.xml>
to /home/hudson/hudson/jobs/Crunch-master-integration/modules/org.apache.crunch$crunch-hbase/builds/2013-04-18_03-25-03/archive/org.apache.crunch/crunch-hbase/0.6.0-SNAPSHOT/crunch-hbase-0.6.0-SNAPSHOT.pom
[JENKINS] Archiving <https://builds.apache.org/job/Crunch-master-integration/ws/crunch-scrunch/pom.xml>
to /home/hudson/hudson/jobs/Crunch-master-integration/modules/org.apache.crunch$crunch-scrunch/builds/2013-04-18_03-25-03/archive/org.apache.crunch/crunch-scrunch/0.6.0-SNAPSHOT/crunch-scrunch-0.6.0-SNAPSHOT.pom
[JENKINS] Archiving <https://builds.apache.org/job/Crunch-master-integration/ws/crunch/pom.xml>
to /home/hudson/hudson/jobs/Crunch-master-integration/modules/org.apache.crunch$crunch/builds/2013-04-18_03-25-03/archive/org.apache.crunch/crunch/0.6.0-SNAPSHOT/crunch-0.6.0-SNAPSHOT.pom
[JENKINS] Archiving <https://builds.apache.org/job/Crunch-master-integration/ws/crunch/target/crunch-0.6.0-SNAPSHOT.jar>
to /home/hudson/hudson/jobs/Crunch-master-integration/modules/org.apache.crunch$crunch/builds/2013-04-18_03-25-03/archive/org.apache.crunch/crunch/0.6.0-SNAPSHOT/crunch-0.6.0-SNAPSHOT.jar
[JENKINS] Archiving <https://builds.apache.org/job/Crunch-master-integration/ws/crunch-contrib/pom.xml>
to /home/hudson/hudson/jobs/Crunch-master-integration/modules/org.apache.crunch$crunch-contrib/builds/2013-04-18_03-25-03/archive/org.apache.crunch/crunch-contrib/0.6.0-SNAPSHOT/crunch-contrib-0.6.0-SNAPSHOT.pom
[JENKINS] Archiving <https://builds.apache.org/job/Crunch-master-integration/ws/crunch-archetype/pom.xml>
to /home/hudson/hudson/jobs/Crunch-master-integration/modules/org.apache.crunch$crunch-archetype/builds/2013-04-18_03-25-03/archive/org.apache.crunch/crunch-archetype/0.6.0-SNAPSHOT/crunch-archetype-0.6.0-SNAPSHOT.pom
[JENKINS] Archiving <https://builds.apache.org/job/Crunch-master-integration/ws/pom.xml>
to /home/hudson/hudson/jobs/Crunch-master-integration/modules/org.apache.crunch$crunch-parent/builds/2013-04-18_03-25-03/archive/org.apache.crunch/crunch-parent/0.6.0-SNAPSHOT/crunch-parent-0.6.0-SNAPSHOT.pom
[JENKINS] Archiving <https://builds.apache.org/job/Crunch-master-integration/ws/target/crunch-parent-0.6.0-SNAPSHOT-site.xml>
to /home/hudson/hudson/jobs/Crunch-master-integration/modules/org.apache.crunch$crunch-parent/builds/2013-04-18_03-25-03/archive/org.apache.crunch/crunch-parent/0.6.0-SNAPSHOT/crunch-parent-0.6.0-SNAPSHOT-site.xml
[JENKINS] Archiving <https://builds.apache.org/job/Crunch-master-integration/ws/crunch-examples/pom.xml>
to /home/hudson/hudson/jobs/Crunch-master-integration/modules/org.apache.crunch$crunch-examples/builds/2013-04-18_03-25-03/archive/org.apache.crunch/crunch-examples/0.6.0-SNAPSHOT/crunch-examples-0.6.0-SNAPSHOT.pom
[JENKINS] Archiving <https://builds.apache.org/job/Crunch-master-integration/ws/crunch-test/pom.xml>
to /home/hudson/hudson/jobs/Crunch-master-integration/modules/org.apache.crunch$crunch-test/builds/2013-04-18_03-25-03/archive/org.apache.crunch/crunch-test/0.6.0-SNAPSHOT/crunch-test-0.6.0-SNAPSHOT.pom
[JENKINS] Archiving <https://builds.apache.org/job/Crunch-master-integration/ws/crunch-test/target/crunch-test-0.6.0-SNAPSHOT.jar>
to /home/hudson/hudson/jobs/Crunch-master-integration/modules/org.apache.crunch$crunch-test/builds/2013-04-18_03-25-03/archive/org.apache.crunch/crunch-test/0.6.0-SNAPSHOT/crunch-test-0.6.0-SNAPSHOT.jar
Waiting for Jenkins to finish collecting data
mavenExecutionResult exceptions not empty
message : Internal error: java.lang.reflect.UndeclaredThrowableException
cause : null
Stack trace : 
org.apache.maven.InternalErrorException: Internal error: java.lang.reflect.UndeclaredThrowableException
	at org.apache.maven.lifecycle.internal.BuilderCommon.handleBuildError(BuilderCommon.java:128)
	at org.apache.maven.lifecycle.internal.LifecycleModuleBuilder.buildProject(LifecycleModuleBuilder.java:95)
	at org.apache.maven.lifecycle.internal.LifecycleModuleBuilder.buildProject(LifecycleModuleBuilder.java:59)
	at org.apache.maven.lifecycle.internal.LifecycleStarter.singleThreadedBuild(LifecycleStarter.java:183)
	at org.apache.maven.lifecycle.internal.LifecycleStarter.execute(LifecycleStarter.java:161)
	at org.apache.maven.DefaultMaven.doExecute(DefaultMaven.java:320)
	at org.apache.maven.DefaultMaven.execute(DefaultMaven.java:156)
	at org.jvnet.hudson.maven3.launcher.Maven3Launcher.main(Maven3Launcher.java:79)
	at sun.reflect.NativeMethodAccessorImpl.invoke0(Native Method)
	at sun.reflect.NativeMethodAccessorImpl.invoke(NativeMethodAccessorImpl.java:39)
	at sun.reflect.DelegatingMethodAccessorImpl.invoke(DelegatingMethodAccessorImpl.java:25)
	at java.lang.reflect.Method.invoke(Method.java:597)
	at org.codehaus.plexus.classworlds.launcher.Launcher.launchStandard(Launcher.java:329)
	at org.codehaus.plexus.classworlds.launcher.Launcher.launch(Launcher.java:239)
	at org.jvnet.hudson.maven3.agent.Maven3Main.launch(Maven3Main.java:158)
	at hudson.maven.Maven3Builder.call(Maven3Builder.java:100)
	at hudson.maven.Maven3Builder.call(Maven3Builder.java:66)
	at hudson.remoting.UserRequest.perform(UserRequest.java:118)
	at hudson.remoting.UserRequest.perform(UserRequest.java:48)
	at hudson.remoting.Request$2.run(Request.java:326)
	at hudson.remoting.InterceptingExecutorService$1.call(InterceptingExecutorService.java:72)
	at java.util.concurrent.FutureTask$Sync.innerRun(FutureTask.java:303)
	at java.util.concurrent.FutureTask.run(FutureTask.java:138)
	at java.util.concurrent.ThreadPoolExecutor$Worker.runTask(ThreadPoolExecutor.java:886)
	at java.util.concurrent.ThreadPoolExecutor$Worker.run(ThreadPoolExecutor.java:908)
	at java.lang.Thread.run(Thread.java:662)
Caused by: java.lang.reflect.UndeclaredThrowableException
	at $Proxy2.setExecutedMojos(Unknown Source)
	at hudson.maven.MavenBuildProxy$Filter.setExecutedMojos(MavenBuildProxy.java:243)
	at hudson.maven.Maven3Builder$MavenExecutionListener.recordMojoEnded(Maven3Builder.java:439)
	at hudson.maven.Maven3Builder$MavenExecutionListener.mojoSucceeded(Maven3Builder.java:425)
	at org.apache.maven.lifecycle.internal.DefaultExecutionEventCatapult.fire(DefaultExecutionEventCatapult.java:87)
	at org.apache.maven.lifecycle.internal.DefaultExecutionEventCatapult.fire(DefaultExecutionEventCatapult.java:42)
	at org.apache.maven.lifecycle.internal.MojoExecutor.execute(MojoExecutor.java:228)
	at org.apache.maven.lifecycle.internal.MojoExecutor.execute(MojoExecutor.java:153)
	at org.apache.maven.lifecycle.internal.MojoExecutor.execute(MojoExecutor.java:145)
	at org.apache.maven.lifecycle.internal.LifecycleModuleBuilder.buildProject(LifecycleModuleBuilder.java:84)
	... 24 more
Caused by: java.io.UTFDataFormatException
	at java.io.ObjectInputStream$BlockDataInputStream.readUTFSpan(ObjectInputStream.java:3105)
	at java.io.ObjectInputStream$BlockDataInputStream.readUTFBody(ObjectInputStream.java:3030)
	at java.io.ObjectInputStream$BlockDataInputStream.readUTF(ObjectInputStream.java:2843)
	at java.io.ObjectInputStream.readUTF(ObjectInputStream.java:1069)
	at java.io.ObjectStreamClass.readNonProxy(ObjectStreamClass.java:658)
	at java.io.ObjectInputStream.readClassDescriptor(ObjectInputStream.java:827)
	at java.io.ObjectInputStream.readNonProxyDesc(ObjectInputStream.java:1583)
	at java.io.ObjectInputStream.readClassDesc(ObjectInputStream.java:1514)
	at java.io.ObjectInputStream.readOrdinaryObject(ObjectInputStream.java:1750)
	at java.io.ObjectInputStream.readObject0(ObjectInputStream.java:1347)
	at java.io.ObjectInputStream.readObject(ObjectInputStream.java:369)
	at java.util.concurrent.CopyOnWriteArrayList.readObject(CopyOnWriteArrayList.java:879)
	at sun.reflect.GeneratedMethodAccessor77563.invoke(Unknown Source)
	at sun.reflect.DelegatingMethodAccessorImpl.invoke(DelegatingMethodAccessorImpl.java:43)
	at java.lang.reflect.Method.invoke(Method.java:601)
	at java.io.ObjectStreamClass.invokeReadObject(ObjectStreamClass.java:1004)
	at java.io.ObjectInputStream.readSerialData(ObjectInputStream.java:1872)
	at java.io.ObjectInputStream.readOrdinaryObject(ObjectInputStream.java:1777)
	at java.io.ObjectInputStream.readObject0(ObjectInputStream.java:1347)
	at java.io.ObjectInputStream.readArray(ObjectInputStream.java:1685)
	at java.io.ObjectInputStream.readObject0(ObjectInputStream.java:1341)
	at java.io.ObjectInputStream.defaultReadFields(ObjectInputStream.java:1970)
	at java.io.ObjectInputStream.readSerialData(ObjectInputStream.java:1894)
	at java.io.ObjectInputStream.readOrdinaryObject(ObjectInputStream.java:1777)
	at java.io.ObjectInputStream.readObject0(ObjectInputStream.java:1347)
	at java.io.ObjectInputStream.readObject(ObjectInputStream.java:369)
	at hudson.remoting.UserRequest.deserialize(UserRequest.java:182)
	at hudson.remoting.UserRequest.perform(UserRequest.java:98)
	at hudson.remoting.UserRequest.perform(UserRequest.java:48)
	at hudson.remoting.Request$2.run(Request.java:326)
	at hudson.remoting.InterceptingExecutorService$1.call(InterceptingExecutorService.java:72)
	at java.util.concurrent.FutureTask$Sync.innerRun(FutureTask.java:334)
	at java.util.concurrent.FutureTask.run(FutureTask.java:166)
	at java.util.concurrent.ThreadPoolExecutor.runWorker(ThreadPoolExecutor.java:1145)
	at java.util.concurrent.ThreadPoolExecutor$Worker.run(ThreadPoolExecutor.java:615)
	at java.lang.Thread.run(Thread.java:722)
channel stopped
[locks-and-latches] Releasing all the locks
[locks-and-latches] All the locks released

Mime
View raw message