crunch-dev mailing list archives

Site index · List index
Message view « Date » · « Thread »
Top « Date » · « Thread »
From Apache Jenkins Server <jenk...@builds.apache.org>
Subject Build failed in Jenkins: Crunch-master-integration #262
Date Sat, 20 Apr 2013 13:03:36 GMT
See <https://builds.apache.org/job/Crunch-master-integration/262/>

------------------------------------------
[...truncated 1549 lines...]
 T E S T S
-------------------------------------------------------

[INFO] --- maven-surefire-plugin:2.12:test (default-test) @ crunch-hbase ---

Results :

Tests run: 0, Failures: 0, Errors: 0, Skipped: 0

[JENKINS] Recording test results[INFO] Exclude: .git/**
[INFO] Exclude: .gitignore
[INFO] Exclude: .repository/
[INFO] Exclude: .idea/**
[INFO] Exclude: **/resources/*.txt
[INFO] Exclude: **/resources/**/*.txt
[INFO] Exclude: **/goal.txt
[INFO] Exclude: **/target/generated-test-sources/**
[INFO] Exclude: **/scripts/scrunch

[INFO] 
[INFO] --- apache-rat-plugin:0.8:check (rat-check) @ crunch-hbase ---
[INFO] Building jar: <https://builds.apache.org/job/Crunch-master-integration/ws/crunch-hbase/target/crunch-hbase-0.6.0-SNAPSHOT.jar>
[INFO] 
[INFO] --- maven-jar-plugin:2.4:jar (default-jar) @ crunch-hbase ---
[INFO] 
[INFO] --- maven-dependency-plugin:2.5.1:copy-dependencies (default) @ crunch-hbase ---
[INFO] Copying hbase-0.90.4.jar to <https://builds.apache.org/job/Crunch-master-integration/ws/crunch-hbase/target/lib/hbase-0.90.4.jar>
[INFO] Copying hadoop-minicluster-1.0.3.jar to <https://builds.apache.org/job/Crunch-master-integration/ws/crunch-hbase/target/lib/hadoop-minicluster-1.0.3.jar>
[INFO] Copying core-3.1.1.jar to <https://builds.apache.org/job/Crunch-master-integration/ws/crunch-hbase/target/lib/core-3.1.1.jar>
[INFO] Copying jackson-xc-1.5.5.jar to <https://builds.apache.org/job/Crunch-master-integration/ws/crunch-hbase/target/lib/jackson-xc-1.5.5.jar>
[INFO] Copying oro-2.0.8.jar to <https://builds.apache.org/job/Crunch-master-integration/ws/crunch-hbase/target/lib/oro-2.0.8.jar>
[INFO] Copying ftpserver-deprecated-1.0.0-M2.jar to <https://builds.apache.org/job/Crunch-master-integration/ws/crunch-hbase/target/lib/ftpserver-deprecated-1.0.0-M2.jar>
[INFO] Copying hamcrest-core-1.1.jar to <https://builds.apache.org/job/Crunch-master-integration/ws/crunch-hbase/target/lib/hamcrest-core-1.1.jar>
[INFO] Copying stax-api-1.0.1.jar to <https://builds.apache.org/job/Crunch-master-integration/ws/crunch-hbase/target/lib/stax-api-1.0.1.jar>
[INFO] Copying commons-net-1.4.1.jar to <https://builds.apache.org/job/Crunch-master-integration/ws/crunch-hbase/target/lib/commons-net-1.4.1.jar>
[INFO] Copying commons-logging-1.1.1.jar to <https://builds.apache.org/job/Crunch-master-integration/ws/crunch-hbase/target/lib/commons-logging-1.1.1.jar>
[INFO] Copying slf4j-api-1.4.3.jar to <https://builds.apache.org/job/Crunch-master-integration/ws/crunch-hbase/target/lib/slf4j-api-1.4.3.jar>
[INFO] Copying jsp-2.1-6.1.14.jar to <https://builds.apache.org/job/Crunch-master-integration/ws/crunch-hbase/target/lib/jsp-2.1-6.1.14.jar>
[INFO] Copying hadoop-core-1.0.3.jar to <https://builds.apache.org/job/Crunch-master-integration/ws/crunch-hbase/target/lib/hadoop-core-1.0.3.jar>
[INFO] Copying mockito-all-1.9.0.jar to <https://builds.apache.org/job/Crunch-master-integration/ws/crunch-hbase/target/lib/mockito-all-1.9.0.jar>
[INFO] Copying commons-beanutils-1.7.0.jar to <https://builds.apache.org/job/Crunch-master-integration/ws/crunch-hbase/target/lib/commons-beanutils-1.7.0.jar>
[INFO] Copying jackson-mapper-asl-1.8.8.jar to <https://builds.apache.org/job/Crunch-master-integration/ws/crunch-hbase/target/lib/jackson-mapper-asl-1.8.8.jar>
[INFO] Copying commons-io-2.1.jar to <https://builds.apache.org/job/Crunch-master-integration/ws/crunch-hbase/target/lib/commons-io-2.1.jar>
[INFO] Copying crunch-test-0.6.0-SNAPSHOT.jar to <https://builds.apache.org/job/Crunch-master-integration/ws/crunch-hbase/target/lib/crunch-test-0.6.0-SNAPSHOT.jar>
[INFO] Copying jetty-util-6.1.26.jar to <https://builds.apache.org/job/Crunch-master-integration/ws/crunch-hbase/target/lib/jetty-util-6.1.26.jar>
[INFO] Copying hadoop-client-1.0.3.jar to <https://builds.apache.org/job/Crunch-master-integration/ws/crunch-hbase/target/lib/hadoop-client-1.0.3.jar>
[INFO] Copying jackson-jaxrs-1.5.5.jar to <https://builds.apache.org/job/Crunch-master-integration/ws/crunch-hbase/target/lib/jackson-jaxrs-1.5.5.jar>
[INFO] Copying junit-4.10.jar to <https://builds.apache.org/job/Crunch-master-integration/ws/crunch-hbase/target/lib/junit-4.10.jar>
[INFO] Copying guava-11.0.2.jar to <https://builds.apache.org/job/Crunch-master-integration/ws/crunch-hbase/target/lib/guava-11.0.2.jar>
[INFO] Copying commons-digester-1.8.jar to <https://builds.apache.org/job/Crunch-master-integration/ws/crunch-hbase/target/lib/commons-digester-1.8.jar>
[INFO] Copying paranamer-2.3.jar to <https://builds.apache.org/job/Crunch-master-integration/ws/crunch-hbase/target/lib/paranamer-2.3.jar>
[INFO] Copying activation-1.1.jar to <https://builds.apache.org/job/Crunch-master-integration/ws/crunch-hbase/target/lib/activation-1.1.jar>
[INFO] Copying xmlenc-0.52.jar to <https://builds.apache.org/job/Crunch-master-integration/ws/crunch-hbase/target/lib/xmlenc-0.52.jar>
[INFO] Copying mina-core-2.0.0-M5.jar to <https://builds.apache.org/job/Crunch-master-integration/ws/crunch-hbase/target/lib/mina-core-2.0.0-M5.jar>
[INFO] Copying commons-beanutils-core-1.8.0.jar to <https://builds.apache.org/job/Crunch-master-integration/ws/crunch-hbase/target/lib/commons-beanutils-core-1.8.0.jar>
[INFO] Copying ftpserver-core-1.0.0.jar to <https://builds.apache.org/job/Crunch-master-integration/ws/crunch-hbase/target/lib/ftpserver-core-1.0.0.jar>
[INFO] Copying hadoop-test-1.0.3.jar to <https://builds.apache.org/job/Crunch-master-integration/ws/crunch-hbase/target/lib/hadoop-test-1.0.3.jar>
[INFO] Copying hbase-0.90.4-tests.jar to <https://builds.apache.org/job/Crunch-master-integration/ws/crunch-hbase/target/lib/hbase-0.90.4-tests.jar>
[INFO] Copying jsr311-api-1.1.1.jar to <https://builds.apache.org/job/Crunch-master-integration/ws/crunch-hbase/target/lib/jsr311-api-1.1.1.jar>
[INFO] Copying jersey-server-1.4.jar to <https://builds.apache.org/job/Crunch-master-integration/ws/crunch-hbase/target/lib/jersey-server-1.4.jar>
[INFO] Copying commons-cli-1.2.jar to <https://builds.apache.org/job/Crunch-master-integration/ws/crunch-hbase/target/lib/commons-cli-1.2.jar>
[INFO] Copying jersey-core-1.4.jar to <https://builds.apache.org/job/Crunch-master-integration/ws/crunch-hbase/target/lib/jersey-core-1.4.jar>
[INFO] Copying hsqldb-1.8.0.10.jar to <https://builds.apache.org/job/Crunch-master-integration/ws/crunch-hbase/target/lib/hsqldb-1.8.0.10.jar>
[INFO] Copying jaxb-impl-2.1.12.jar to <https://builds.apache.org/job/Crunch-master-integration/ws/crunch-hbase/target/lib/jaxb-impl-2.1.12.jar>
[INFO] Copying jsr305-1.3.9.jar to <https://builds.apache.org/job/Crunch-master-integration/ws/crunch-hbase/target/lib/jsr305-1.3.9.jar>
[INFO] Copying jasper-compiler-5.5.23.jar to <https://builds.apache.org/job/Crunch-master-integration/ws/crunch-hbase/target/lib/jasper-compiler-5.5.23.jar>
[INFO] Copying servlet-api-2.5-6.1.14.jar to <https://builds.apache.org/job/Crunch-master-integration/ws/crunch-hbase/target/lib/servlet-api-2.5-6.1.14.jar>
[INFO] Copying ftplet-api-1.0.0.jar to <https://builds.apache.org/job/Crunch-master-integration/ws/crunch-hbase/target/lib/ftplet-api-1.0.0.jar>
[INFO] Copying jettison-1.1.jar to <https://builds.apache.org/job/Crunch-master-integration/ws/crunch-hbase/target/lib/jettison-1.1.jar>
[INFO] Copying commons-httpclient-3.0.1.jar to <https://builds.apache.org/job/Crunch-master-integration/ws/crunch-hbase/target/lib/commons-httpclient-3.0.1.jar>
[INFO] Copying jsp-api-2.1-6.1.14.jar to <https://builds.apache.org/job/Crunch-master-integration/ws/crunch-hbase/target/lib/jsp-api-2.1-6.1.14.jar>
[INFO] Copying commons-lang-2.4.jar to <https://builds.apache.org/job/Crunch-master-integration/ws/crunch-hbase/target/lib/commons-lang-2.4.jar>
[INFO] Copying javassist-3.16.1-GA.jar to <https://builds.apache.org/job/Crunch-master-integration/ws/crunch-hbase/target/lib/javassist-3.16.1-GA.jar>
[INFO] Copying zookeeper-3.3.2.jar to <https://builds.apache.org/job/Crunch-master-integration/ws/crunch-hbase/target/lib/zookeeper-3.3.2.jar>
[INFO] Copying jackson-core-asl-1.8.8.jar to <https://builds.apache.org/job/Crunch-master-integration/ws/crunch-hbase/target/lib/jackson-core-asl-1.8.8.jar>
[INFO] Copying crunch-0.6.0-SNAPSHOT.jar to <https://builds.apache.org/job/Crunch-master-integration/ws/crunch-hbase/target/lib/crunch-0.6.0-SNAPSHOT.jar>
[INFO] Copying commons-codec-1.4.jar to <https://builds.apache.org/job/Crunch-master-integration/ws/crunch-hbase/target/lib/commons-codec-1.4.jar>
[INFO] Copying avro-mapred-1.7.0.jar to <https://builds.apache.org/job/Crunch-master-integration/ws/crunch-hbase/target/lib/avro-mapred-1.7.0.jar>
[INFO] Copying commons-collections-3.2.1.jar to <https://builds.apache.org/job/Crunch-master-integration/ws/crunch-hbase/target/lib/commons-collections-3.2.1.jar>
[INFO] Copying thrift-0.2.0.jar to <https://builds.apache.org/job/Crunch-master-integration/ws/crunch-hbase/target/lib/thrift-0.2.0.jar>
[INFO] Copying avro-1.7.0.jar to <https://builds.apache.org/job/Crunch-master-integration/ws/crunch-hbase/target/lib/avro-1.7.0.jar>
[INFO] Copying jersey-json-1.4.jar to <https://builds.apache.org/job/Crunch-master-integration/ws/crunch-hbase/target/lib/jersey-json-1.4.jar>
[INFO] Copying jaxb-api-2.1.jar to <https://builds.apache.org/job/Crunch-master-integration/ws/crunch-hbase/target/lib/jaxb-api-2.1.jar>
[INFO] Copying log4j-1.2.15.jar to <https://builds.apache.org/job/Crunch-master-integration/ws/crunch-hbase/target/lib/log4j-1.2.15.jar>
[INFO] Copying commons-configuration-1.6.jar to <https://builds.apache.org/job/Crunch-master-integration/ws/crunch-hbase/target/lib/commons-configuration-1.6.jar>
[INFO] Copying commons-math-2.1.jar to <https://builds.apache.org/job/Crunch-master-integration/ws/crunch-hbase/target/lib/commons-math-2.1.jar>
[INFO] Copying jasper-runtime-5.5.23.jar to <https://builds.apache.org/job/Crunch-master-integration/ws/crunch-hbase/target/lib/jasper-runtime-5.5.23.jar>
[INFO] Copying jruby-complete-1.6.0.jar to <https://builds.apache.org/job/Crunch-master-integration/ws/crunch-hbase/target/lib/jruby-complete-1.6.0.jar>
[INFO] Copying commons-el-1.0.jar to <https://builds.apache.org/job/Crunch-master-integration/ws/crunch-hbase/target/lib/commons-el-1.0.jar>
[INFO] Copying snappy-java-1.0.4.1.jar to <https://builds.apache.org/job/Crunch-master-integration/ws/crunch-hbase/target/lib/snappy-java-1.0.4.1.jar>
[INFO] Copying jetty-6.1.26.jar to <https://builds.apache.org/job/Crunch-master-integration/ws/crunch-hbase/target/lib/jetty-6.1.26.jar>
[INFO] Copying asm-3.1.jar to <https://builds.apache.org/job/Crunch-master-integration/ws/crunch-hbase/target/lib/asm-3.1.jar>
[INFO] Copying protobuf-java-2.3.0.jar to <https://builds.apache.org/job/Crunch-master-integration/ws/crunch-hbase/target/lib/protobuf-java-2.3.0.jar>
[INFO] [INFO] Failsafe report directory: <https://builds.apache.org/job/Crunch-master-integration/ws/crunch-hbase/target/failsafe-reports>

-------------------------------------------------------
 T E S T S
-------------------------------------------------------

[INFO] --- maven-failsafe-plugin:2.12:integration-test (default) @ crunch-hbase ---
Running org.apache.crunch.io.hbase.WordCountHBaseIT
log4j:WARN No appenders could be found for logger (org.apache.hadoop.conf.Configuration).
log4j:WARN Please initialize the log4j system properly.
SLF4J: Failed to load class "org.slf4j.impl.StaticLoggerBinder".
SLF4J: See http://www.slf4j.org/codes.html#StaticLoggerBinder for further details.
2013-04-20 13:00:47.557:INFO::Logging to STDERR via org.mortbay.log.StdErrLog
2013-04-20 13:00:47.635:INFO::jetty-6.1.26
2013-04-20 13:00:47.670:INFO::Extract jar:file:/home/jenkins/jenkins-slave/maven-repositories/1/org/apache/hadoop/hadoop-core/1.0.3/hadoop-core-1.0.3.jar!/webapps/hdfs
to /tmp/Jetty_localhost_57718_hdfs____uf0hnq/webapp
2013-04-20 13:00:47.951:INFO::Started SelectChannelConnector@localhost:57718
Starting DataNode 0 with dfs.data.dir: <https://builds.apache.org/job/Crunch-master-integration/ws/crunch-hbase/target/test-data/07ae5196-6629-4c5f-bee7-d85339e33646/dfs/data/data1,/home/jenkins/jenkins-slave/workspace/Crunch-master-integration/crunch-hbase/target/test-data/07ae5196-6629-4c5f-bee7-d85339e33646/dfs/data/data2>
2013-04-20 13:00:48.676:INFO::jetty-6.1.26
2013-04-20 13:00:48.689:INFO::Extract jar:file:/home/jenkins/jenkins-slave/maven-repositories/1/org/apache/hadoop/hadoop-core/1.0.3/hadoop-core-1.0.3.jar!/webapps/datanode
to /tmp/Jetty_localhost_33550_datanode____.mqvtnt/webapp
2013-04-20 13:00:48.872:INFO::Started SelectChannelConnector@localhost:33550
Generating rack names for tasktrackers
Generating host names for tasktrackers
2013-04-20 13:00:59.901:INFO::jetty-6.1.26
2013-04-20 13:00:59.912:INFO::Extract jar:file:/home/jenkins/jenkins-slave/maven-repositories/1/org/apache/hadoop/hadoop-core/1.0.3/hadoop-core-1.0.3.jar!/webapps/job
to /tmp/Jetty_localhost_52122_job____6b3g62/webapp
2013-04-20 13:01:00.091:INFO::Started SelectChannelConnector@localhost:52122
2013-04-20 13:01:00.985:INFO::jetty-6.1.26
2013-04-20 13:01:00.997:INFO::Extract jar:file:/home/jenkins/jenkins-slave/maven-repositories/1/org/apache/hadoop/hadoop-core/1.0.3/hadoop-core-1.0.3.jar!/webapps/task
to /tmp/Jetty_0_0_0_0_59074_task____.zg0e0p/webapp
2013-04-20 13:01:01.186:INFO::Started SelectChannelConnector@0.0.0.0:59074
26631 [main] INFO  org.apache.crunch.io.hbase.HBaseTarget  - HBaseTarget ignores checks for
existing outputs...
26634 [main] INFO  org.apache.crunch.io.hbase.HBaseTarget  - HBaseTarget ignores checks for
existing outputs...
27254 [main] INFO  org.apache.crunch.impl.mr.collect.PGroupedTableImpl  - Setting num reduce
tasks to 2
30593 [Thread-194] INFO  org.apache.crunch.hadoop.mapreduce.lib.jobcontrol.CrunchControlledJob
 - Running job "org.apache.crunch.io.hbase.WordCountHBaseIT: HBaseTable(crunch_words_98218518)+S0+Aggregate.count+GBK+combine+convert
to put+[[HBaseTable(crunch_other_98218518)]/[HBaseTable(crunch_counts_98218518)]]"
30594 [Thread-194] INFO  org.apache.crunch.hadoop.mapreduce.lib.jobcontrol.CrunchControlledJob
 - Job status available at: http://localhost:52122/jobdetails.jsp?jobid=job_20130420130059841_0001
69640 [main] INFO  org.apache.crunch.impl.mr.collect.PGroupedTableImpl  - Setting num reduce
tasks to 3
73527 [Thread-335] INFO  org.apache.crunch.hadoop.mapreduce.lib.jobcontrol.CrunchControlledJob
 - Running job "org.apache.crunch.io.hbase.WordCountHBaseIT: [[HBaseTable(crunch_words_98218518)+joinTagLeft]/[HBaseTable(crunch_join_words_98218518)+joinTagRight]]+GBK+innerJoinGBK+S1+SeqFile(/tmp/crunch-33969031/p2)"
73528 [Thread-335] INFO  org.apache.crunch.hadoop.mapreduce.lib.jobcontrol.CrunchControlledJob
 - Job status available at: http://localhost:52122/jobdetails.jsp?jobid=job_20130420130059841_0002
115292 [main] INFO  org.apache.crunch.io.hbase.HBaseTarget  - HBaseTarget ignores checks for
existing outputs...
118176 [Thread-491] INFO  org.apache.crunch.hadoop.mapreduce.lib.jobcontrol.CrunchControlledJob
 - Running job "org.apache.crunch.io.hbase.WordCountHBaseIT: HBaseTable(crunch_counts_98218518)+convert
to delete+HBaseTable(crunch_counts_98218518)"
118176 [Thread-491] INFO  org.apache.crunch.hadoop.mapreduce.lib.jobcontrol.CrunchControlledJob
 - Job status available at: http://localhost:52122/jobdetails.jsp?jobid=job_20130420130059841_0003
2013-04-20 13:03:04.447:INFO::Stopped SelectChannelConnector@0.0.0.0:0
2013-04-20 13:03:04.552:INFO::Stopped SelectChannelConnector@localhost:0
Shutting down the Mini HDFS Cluster
Shutting down DataNode 0
2013-04-20 13:03:09.600:INFO::Stopped SelectChannelConnector@localhost:0
2013-04-20 13:03:10.703:INFO::Stopped SelectChannelConnector@localhost:0
Tests run: 1, Failures: 0, Errors: 0, Skipped: 0, Time elapsed: 146.705 sec

Results :

Tests run: 1, Failures: 0, Errors: 0, Skipped: 0

[INFO] ------------------------------------------------------------------------
[INFO] Reactor Summary:
[INFO] 
[INFO] Apache Crunch ..................................... SUCCESS [25.143s]
[INFO] Apache Crunch Test ................................ SUCCESS [16.845s]
[INFO] Apache Crunch Core ................................ SUCCESS [22:08.226s]
[INFO] Apache Crunch HBase Support ....................... FAILURE [2:33.866s]
[INFO] Apache Crunch Contrib ............................. SKIPPED
[INFO] Apache Crunch Examples ............................ SKIPPED
[INFO] Apache Crunch Archetype ........................... SKIPPED
[INFO] Apache Crunch for Scala ........................... SKIPPED
[INFO] Apache Crunch Distribution ........................ SKIPPED
[INFO] ------------------------------------------------------------------------
[INFO] BUILD FAILURE
[INFO] ------------------------------------------------------------------------
[INFO] Total time: 25:27.752s
[INFO] Finished at: Sat Apr 20 13:03:11 UTC 2013
[INFO] Final Memory: 28M/85M
[INFO] ------------------------------------------------------------------------
[JENKINS] Archiving <https://builds.apache.org/job/Crunch-master-integration/ws/crunch-dist/pom.xml>
to /home/hudson/hudson/jobs/Crunch-master-integration/modules/org.apache.crunch$crunch-dist/builds/2013-04-20_12-37-27/archive/org.apache.crunch/crunch-dist/0.6.0-SNAPSHOT/crunch-dist-0.6.0-SNAPSHOT.pom
[JENKINS] Archiving <https://builds.apache.org/job/Crunch-master-integration/ws/crunch-hbase/pom.xml>
to /home/hudson/hudson/jobs/Crunch-master-integration/modules/org.apache.crunch$crunch-hbase/builds/2013-04-20_12-37-27/archive/org.apache.crunch/crunch-hbase/0.6.0-SNAPSHOT/crunch-hbase-0.6.0-SNAPSHOT.pom
[JENKINS] Archiving <https://builds.apache.org/job/Crunch-master-integration/ws/crunch-hbase/target/crunch-hbase-0.6.0-SNAPSHOT.jar>
to /home/hudson/hudson/jobs/Crunch-master-integration/modules/org.apache.crunch$crunch-hbase/builds/2013-04-20_12-37-27/archive/org.apache.crunch/crunch-hbase/0.6.0-SNAPSHOT/crunch-hbase-0.6.0-SNAPSHOT.jar
[JENKINS] Archiving <https://builds.apache.org/job/Crunch-master-integration/ws/crunch-scrunch/pom.xml>
to /home/hudson/hudson/jobs/Crunch-master-integration/modules/org.apache.crunch$crunch-scrunch/builds/2013-04-20_12-37-27/archive/org.apache.crunch/crunch-scrunch/0.6.0-SNAPSHOT/crunch-scrunch-0.6.0-SNAPSHOT.pom
[JENKINS] Archiving <https://builds.apache.org/job/Crunch-master-integration/ws/crunch/pom.xml>
to /home/hudson/hudson/jobs/Crunch-master-integration/modules/org.apache.crunch$crunch/builds/2013-04-20_12-37-27/archive/org.apache.crunch/crunch/0.6.0-SNAPSHOT/crunch-0.6.0-SNAPSHOT.pom
[JENKINS] Archiving <https://builds.apache.org/job/Crunch-master-integration/ws/crunch/target/crunch-0.6.0-SNAPSHOT.jar>
to /home/hudson/hudson/jobs/Crunch-master-integration/modules/org.apache.crunch$crunch/builds/2013-04-20_12-37-27/archive/org.apache.crunch/crunch/0.6.0-SNAPSHOT/crunch-0.6.0-SNAPSHOT.jar
[JENKINS] Archiving <https://builds.apache.org/job/Crunch-master-integration/ws/crunch-contrib/pom.xml>
to /home/hudson/hudson/jobs/Crunch-master-integration/modules/org.apache.crunch$crunch-contrib/builds/2013-04-20_12-37-27/archive/org.apache.crunch/crunch-contrib/0.6.0-SNAPSHOT/crunch-contrib-0.6.0-SNAPSHOT.pom
[JENKINS] Archiving <https://builds.apache.org/job/Crunch-master-integration/ws/crunch-archetype/pom.xml>
to /home/hudson/hudson/jobs/Crunch-master-integration/modules/org.apache.crunch$crunch-archetype/builds/2013-04-20_12-37-27/archive/org.apache.crunch/crunch-archetype/0.6.0-SNAPSHOT/crunch-archetype-0.6.0-SNAPSHOT.pom
[JENKINS] Archiving <https://builds.apache.org/job/Crunch-master-integration/ws/pom.xml>
to /home/hudson/hudson/jobs/Crunch-master-integration/modules/org.apache.crunch$crunch-parent/builds/2013-04-20_12-37-27/archive/org.apache.crunch/crunch-parent/0.6.0-SNAPSHOT/crunch-parent-0.6.0-SNAPSHOT.pom
[JENKINS] Archiving <https://builds.apache.org/job/Crunch-master-integration/ws/target/crunch-parent-0.6.0-SNAPSHOT-site.xml>
to /home/hudson/hudson/jobs/Crunch-master-integration/modules/org.apache.crunch$crunch-parent/builds/2013-04-20_12-37-27/archive/org.apache.crunch/crunch-parent/0.6.0-SNAPSHOT/crunch-parent-0.6.0-SNAPSHOT-site.xml
[JENKINS] Archiving <https://builds.apache.org/job/Crunch-master-integration/ws/crunch-examples/pom.xml>
to /home/hudson/hudson/jobs/Crunch-master-integration/modules/org.apache.crunch$crunch-examples/builds/2013-04-20_12-37-27/archive/org.apache.crunch/crunch-examples/0.6.0-SNAPSHOT/crunch-examples-0.6.0-SNAPSHOT.pom
[JENKINS] Archiving <https://builds.apache.org/job/Crunch-master-integration/ws/crunch-test/pom.xml>
to /home/hudson/hudson/jobs/Crunch-master-integration/modules/org.apache.crunch$crunch-test/builds/2013-04-20_12-37-27/archive/org.apache.crunch/crunch-test/0.6.0-SNAPSHOT/crunch-test-0.6.0-SNAPSHOT.pom
[JENKINS] Archiving <https://builds.apache.org/job/Crunch-master-integration/ws/crunch-test/target/crunch-test-0.6.0-SNAPSHOT.jar>
to /home/hudson/hudson/jobs/Crunch-master-integration/modules/org.apache.crunch$crunch-test/builds/2013-04-20_12-37-27/archive/org.apache.crunch/crunch-test/0.6.0-SNAPSHOT/crunch-test-0.6.0-SNAPSHOT.jar
Waiting for Jenkins to finish collecting data
mavenExecutionResult exceptions not empty
message : Internal error: java.lang.reflect.UndeclaredThrowableException
cause : null
Stack trace : 
org.apache.maven.InternalErrorException: Internal error: java.lang.reflect.UndeclaredThrowableException
	at org.apache.maven.lifecycle.internal.BuilderCommon.handleBuildError(BuilderCommon.java:128)
	at org.apache.maven.lifecycle.internal.LifecycleModuleBuilder.buildProject(LifecycleModuleBuilder.java:95)
	at org.apache.maven.lifecycle.internal.LifecycleModuleBuilder.buildProject(LifecycleModuleBuilder.java:59)
	at org.apache.maven.lifecycle.internal.LifecycleStarter.singleThreadedBuild(LifecycleStarter.java:183)
	at org.apache.maven.lifecycle.internal.LifecycleStarter.execute(LifecycleStarter.java:161)
	at org.apache.maven.DefaultMaven.doExecute(DefaultMaven.java:320)
	at org.apache.maven.DefaultMaven.execute(DefaultMaven.java:156)
	at org.jvnet.hudson.maven3.launcher.Maven3Launcher.main(Maven3Launcher.java:79)
	at sun.reflect.NativeMethodAccessorImpl.invoke0(Native Method)
	at sun.reflect.NativeMethodAccessorImpl.invoke(NativeMethodAccessorImpl.java:39)
	at sun.reflect.DelegatingMethodAccessorImpl.invoke(DelegatingMethodAccessorImpl.java:25)
	at java.lang.reflect.Method.invoke(Method.java:597)
	at org.codehaus.plexus.classworlds.launcher.Launcher.launchStandard(Launcher.java:329)
	at org.codehaus.plexus.classworlds.launcher.Launcher.launch(Launcher.java:239)
	at org.jvnet.hudson.maven3.agent.Maven3Main.launch(Maven3Main.java:158)
	at hudson.maven.Maven3Builder.call(Maven3Builder.java:100)
	at hudson.maven.Maven3Builder.call(Maven3Builder.java:66)
	at hudson.remoting.UserRequest.perform(UserRequest.java:118)
	at hudson.remoting.UserRequest.perform(UserRequest.java:48)
	at hudson.remoting.Request$2.run(Request.java:326)
	at hudson.remoting.InterceptingExecutorService$1.call(InterceptingExecutorService.java:72)
	at java.util.concurrent.FutureTask$Sync.innerRun(FutureTask.java:303)
	at java.util.concurrent.FutureTask.run(FutureTask.java:138)
	at java.util.concurrent.ThreadPoolExecutor$Worker.runTask(ThreadPoolExecutor.java:886)
	at java.util.concurrent.ThreadPoolExecutor$Worker.run(ThreadPoolExecutor.java:908)
	at java.lang.Thread.run(Thread.java:662)
Caused by: java.lang.reflect.UndeclaredThrowableException
	at $Proxy2.setExecutedMojos(Unknown Source)
	at hudson.maven.MavenBuildProxy$Filter.setExecutedMojos(MavenBuildProxy.java:243)
	at hudson.maven.Maven3Builder$MavenExecutionListener.recordMojoEnded(Maven3Builder.java:439)
	at hudson.maven.Maven3Builder$MavenExecutionListener.mojoSucceeded(Maven3Builder.java:425)
	at org.apache.maven.lifecycle.internal.DefaultExecutionEventCatapult.fire(DefaultExecutionEventCatapult.java:87)
	at org.apache.maven.lifecycle.internal.DefaultExecutionEventCatapult.fire(DefaultExecutionEventCatapult.java:42)
	at org.apache.maven.lifecycle.internal.MojoExecutor.execute(MojoExecutor.java:228)
	at org.apache.maven.lifecycle.internal.MojoExecutor.execute(MojoExecutor.java:153)
	at org.apache.maven.lifecycle.internal.MojoExecutor.execute(MojoExecutor.java:145)
	at org.apache.maven.lifecycle.internal.LifecycleModuleBuilder.buildProject(LifecycleModuleBuilder.java:84)
	... 24 more
Caused by: java.io.UTFDataFormatException
	at java.io.ObjectInputStream$BlockDataInputStream.readUTFSpan(ObjectInputStream.java:3105)
	at java.io.ObjectInputStream$BlockDataInputStream.readUTFBody(ObjectInputStream.java:3030)
	at java.io.ObjectInputStream$BlockDataInputStream.readUTF(ObjectInputStream.java:2843)
	at java.io.ObjectInputStream.readUTF(ObjectInputStream.java:1069)
	at java.io.ObjectStreamClass.readNonProxy(ObjectStreamClass.java:691)
	at java.io.ObjectInputStream.readClassDescriptor(ObjectInputStream.java:827)
	at java.io.ObjectInputStream.readNonProxyDesc(ObjectInputStream.java:1583)
	at java.io.ObjectInputStream.readClassDesc(ObjectInputStream.java:1514)
	at java.io.ObjectInputStream.readArray(ObjectInputStream.java:1642)
	at java.io.ObjectInputStream.readObject0(ObjectInputStream.java:1341)
	at java.io.ObjectInputStream.defaultReadFields(ObjectInputStream.java:1970)
	at java.io.ObjectInputStream.readSerialData(ObjectInputStream.java:1894)
	at java.io.ObjectInputStream.readOrdinaryObject(ObjectInputStream.java:1777)
	at java.io.ObjectInputStream.readObject0(ObjectInputStream.java:1347)
	at java.io.ObjectInputStream.readObject(ObjectInputStream.java:369)
	at hudson.remoting.UserRequest.deserialize(UserRequest.java:182)
	at hudson.remoting.UserRequest.perform(UserRequest.java:98)
	at hudson.remoting.UserRequest.perform(UserRequest.java:48)
	at hudson.remoting.Request$2.run(Request.java:326)
	at hudson.remoting.InterceptingExecutorService$1.call(InterceptingExecutorService.java:72)
	at java.util.concurrent.FutureTask$Sync.innerRun(FutureTask.java:334)
	at java.util.concurrent.FutureTask.run(FutureTask.java:166)
	at java.util.concurrent.ThreadPoolExecutor.runWorker(ThreadPoolExecutor.java:1145)
	at java.util.concurrent.ThreadPoolExecutor$Worker.run(ThreadPoolExecutor.java:615)
	at java.lang.Thread.run(Thread.java:722)
channel stopped
[locks-and-latches] Releasing all the locks
[locks-and-latches] All the locks released

Mime
View raw message