crunch-dev mailing list archives

Site index · List index
Message view « Date » · « Thread »
Top « Date » · « Thread »
From Matthias Friedrich <m...@mafr.de>
Subject Re: Build failed in Jenkins: Crunch-master-integration #240
Date Tue, 26 Mar 2013 17:18:07 GMT
I think it's an infrastructure problem again. I restarted the job
and now it seems fine. The previous build claimed there was a test
failure in scrunch but I didn't see a failure anywhere in the log.

Regards,
  Matthias

On Tuesday, 2013-03-26, Chao Shi wrote:
> The test seems unstable. It can pass locally. Let's wait for another run on
> Jenkins.
> 
> On Tue, Mar 26, 2013 at 9:20 AM, Apache Jenkins Server <
> jenkins@builds.apache.org> wrote:
> 
> > See <https://builds.apache.org/job/Crunch-master-integration/240/changes>
> >
> > Changes:
> >
> > [greid] CRUNCH-183 Correct initialization of value PType
> >
> > [chaoshi] CRUNCH-182: Remove CrunchJob and merge its logic into
> > CrunchControlledJob
> >
> > ------------------------------------------
> > [...truncated 2388 lines...]
> > 347630 [Thread-898] WARN  org.apache.hadoop.mapred.JobClient  - No job jar
> > file set.  User classes may not be found. See JobConf(Class) or
> > JobConf#setJar(String).
> > 347666 [Thread-898] INFO
> >  org.apache.crunch.hadoop.mapreduce.lib.jobcontrol.CrunchControlledJob  -
> > Running job "org.apache.crunch.scrunch.PageRankTest:
> > Avro(/tmp/junit942100372429130277/tmp-crunch.tmp.dir/crunch-2144047948
> > /p26)+GBK+combine+PTables.values+Avro(/tmp/junit942100372429130277/tmp-crunch.tmp.dir/crunch-2144047948/p25)"
> > 347666 [Thread-898] INFO
> >  org.apache.crunch.hadoop.mapreduce.lib.jobcontrol.CrunchControlledJob  -
> > Job status available at: http://localhost:8080/
> > Tests run: 1, Failures: 0, Errors: 0, Skipped: 0, Time elapsed: 103.797 sec
> > Running org.apache.crunch.scrunch.PipelineClosureAppTest
> > 355722 [main] WARN  org.apache.crunch.scrunch.Pipeline  - Could not locate
> > Scrunch jar file, so could not add Scrunch jars to the job(s) about to be
> > run.
> > 355783 [main] INFO  org.apache.crunch.impl.mr.collect.PGroupedTableImpl  -
> > Setting num reduce tasks to 1
> > 356310 [Thread-957] WARN  org.apache.hadoop.mapred.JobClient  - No job jar
> > file set.  User classes may not be found. See JobConf(Class) or
> > JobConf#setJar(String).
> > 356350 [Thread-957] INFO
> >  org.apache.crunch.hadoop.mapreduce.lib.jobcontrol.CrunchControlledJob  -
> > Running job "org.apache.crunch.scrunch.PipelineClosureAppTest$Divider$:
> > Text(/tmp/junit7225455127696081051/tens.txt)+S0+Aggregate.count+GBK+combine+S1+Avro(/tmp/crunch-1115778712/p1)"
> > 356350 [Thread-957] INFO
> >  org.apache.crunch.hadoop.mapreduce.lib.jobcontrol.CrunchControlledJob  -
> > Job status available at: http://localhost:8080/
> > Tests run: 1, Failures: 0, Errors: 0, Skipped: 0, Time elapsed: 8.288 sec
> > Running org.apache.crunch.scrunch.PipelineAppTest
> > 364018 [main] WARN  org.apache.crunch.scrunch.Pipeline  - Could not locate
> > Scrunch jar file, so could not add Scrunch jars to the job(s) about to be
> > run.
> > 364034 [main] INFO  org.apache.crunch.io.impl.FileTargetImpl  - Will write
> > output files to new path: /tmp/junit1178269964545288982/output
> > 364060 [main] INFO  org.apache.crunch.impl.mr.collect.PGroupedTableImpl  -
> > Setting num reduce tasks to 1
> > 364065 [main] INFO  org.apache.crunch.impl.mr.collect.PGroupedTableImpl  -
> > Setting num reduce tasks to 1
> > 364068 [main] INFO  org.apache.crunch.impl.mr.collect.PGroupedTableImpl  -
> > Setting num reduce tasks to 1
> > 364576 [Thread-976] WARN  org.apache.hadoop.mapred.JobClient  - No job jar
> > file set.  User classes may not be found. See JobConf(Class) or
> > JobConf#setJar(String).
> > 364617 [Thread-976] INFO
> >  org.apache.crunch.hadoop.mapreduce.lib.jobcontrol.CrunchControlledJob  -
> > Running job "org.apache.crunch.scrunch.WordCount$:
> > Text(/tmp/junit1178269964545288982/maugham.txt)+S2+Aggregate.count+GBK+combine+S3+coGroupTag2+Avro(/tmp/crunch-774626842/p1)"
> > 364617 [Thread-976] INFO
> >  org.apache.crunch.hadoop.mapreduce.lib.jobcontrol.CrunchControlledJob  -
> > Job status available at: http://localhost:8080/
> > 365007 [Thread-976] WARN  org.apache.hadoop.mapred.JobClient  - No job jar
> > file set.  User classes may not be found. See JobConf(Class) or
> > JobConf#setJar(String).
> > 365062 [Thread-976] INFO
> >  org.apache.crunch.hadoop.mapreduce.lib.jobcontrol.CrunchControlledJob  -
> > Running job "org.apache.crunch.scrunch.WordCount$:
> > Text(/tmp/junit1178269964545288982/shakes.txt)+S0+Aggregate.count+GBK+combine+S1+coGroupTag1+Avro(/tmp/crunch-774626842/p2)"
> > 365062 [Thread-976] INFO
> >  org.apache.crunch.hadoop.mapreduce.lib.jobcontrol.CrunchControlledJob  -
> > Job status available at: http://localhost:8080/
> > 374418 [Thread-976] WARN  org.apache.hadoop.mapred.JobClient  - No job jar
> > file set.  User classes may not be found. See JobConf(Class) or
> > JobConf#setJar(String).
> > 374470 [Thread-976] INFO
> >  org.apache.crunch.hadoop.mapreduce.lib.jobcontrol.CrunchControlledJob  -
> > Running job "org.apache.crunch.scrunch.WordCount$:
> > [[Avro(/tmp/crunch-774626842/p1)]/[Avro(/tmp/crunch-774626842/p2)]]+GBK+cogroup+S4+Text(/tmp/junit1178269964545288982/output)"
> > 374470 [Thread-976] INFO
> >  org.apache.crunch.hadoop.mapreduce.lib.jobcontrol.CrunchControlledJob  -
> > Job status available at: http://localhost:8080/
> > Tests run: 1, Failures: 0, Errors: 0, Skipped: 0, Time elapsed: 21.474 sec
> > Running org.apache.crunch.scrunch.UnionTest
> > 385509 [main] WARN  org.apache.crunch.scrunch.Pipeline  - Could not locate
> > Scrunch jar file, so could not add Scrunch jars to the job(s) about to be
> > run.
> > 385557 [main] INFO  org.apache.crunch.impl.mr.collect.PGroupedTableImpl  -
> > Setting num reduce tasks to 1
> > 385591 [Thread-1027] WARN  org.apache.hadoop.mapred.JobClient  - Use
> > GenericOptionsParser for parsing the arguments. Applications should
> > implement Tool for the same.
> > 386186 [Thread-1027] WARN  org.apache.hadoop.mapred.JobClient  - No job
> > jar file set.  User classes may not be found. See JobConf(Class) or
> > JobConf#setJar(String).
> > 386274 [Thread-1027] INFO
> >  org.apache.crunch.hadoop.mapreduce.lib.jobcontrol.CrunchControlledJob  -
> > Running job "org.apache.crunch.scrunch.UnionTest:
> > [[Text(/tmp/junit2043835387782147490/shakes.txt)+S1+Aggregate.count]/[Text(/tmp/junit2043835387782147490/maugham.txt)+S0+S1+Aggregate.count]]+GBK+combine+S2+Avro(/tmp/junit2043835387782147490/tmp-crunch.tmp.dir/crunch-975732254/p1)"
> > 386274 [Thread-1027] INFO
> >  org.apache.crunch.hadoop.mapreduce.lib.jobcontrol.CrunchControlledJob  -
> > Job status available at: http://localhost:8080/
> > 396426 [main] WARN  org.apache.crunch.scrunch.Pipeline  - Could not locate
> > Scrunch jar file, so could not add Scrunch jars to the job(s) about to be
> > run.
> > 396456 [main] INFO  org.apache.crunch.impl.mr.collect.PGroupedTableImpl  -
> > Setting num reduce tasks to 1
> > 396461 [main] INFO  org.apache.crunch.impl.mr.collect.PGroupedTableImpl  -
> > Setting num reduce tasks to 1
> > 396465 [main] INFO  org.apache.crunch.impl.mr.collect.PGroupedTableImpl  -
> > Setting num reduce tasks to 1
> > 396500 [Thread-1053] WARN  org.apache.hadoop.mapred.JobClient  - Use
> > GenericOptionsParser for parsing the arguments. Applications should
> > implement Tool for the same.
> > 397290 [Thread-1053] WARN  org.apache.hadoop.mapred.JobClient  - No job
> > jar file set.  User classes may not be found. See JobConf(Class) or
> > JobConf#setJar(String).
> > 397322 [Thread-1053] INFO
> >  org.apache.crunch.hadoop.mapreduce.lib.jobcontrol.CrunchControlledJob  -
> > Running job "org.apache.crunch.scrunch.UnionTest:
> > Text(/tmp/junit8928389473543920922/shakes.txt)+S0+Aggregate.count+GBK+combine+S1+Avro(/tmp/junit8928389473543920922/tmp-crunch.tmp.dir/crunch-563140315/p3)"
> > 397323 [Thread-1053] INFO
> >  org.apache.crunch.hadoop.mapreduce.lib.jobcontrol.CrunchControlledJob  -
> > Job status available at: http://localhost:8080/
> > 397324 [Thread-1053] WARN  org.apache.hadoop.mapred.JobClient  - Use
> > GenericOptionsParser for parsing the arguments. Applications should
> > implement Tool for the same.
> > 398800 [Thread-1053] WARN  org.apache.hadoop.mapred.JobClient  - No job
> > jar file set.  User classes may not be found. See JobConf(Class) or
> > JobConf#setJar(String).
> > 398854 [Thread-1053] INFO
> >  org.apache.crunch.hadoop.mapreduce.lib.jobcontrol.CrunchControlledJob  -
> > Running job "org.apache.crunch.scrunch.UnionTest:
> > Text(/tmp/junit8928389473543920922/maugham.txt)+S2+Aggregate.count+GBK+combine+S3+Avro(/tmp/junit8928389473543920922/tmp-crunch.tmp.dir/crunch-563140315/p2)"
> > 398855 [Thread-1053] INFO
> >  org.apache.crunch.hadoop.mapreduce.lib.jobcontrol.CrunchControlledJob  -
> > Job status available at: http://localhost:8080/
> > 405656 [Thread-1053] WARN  org.apache.hadoop.mapred.JobClient  - Use
> > GenericOptionsParser for parsing the arguments. Applications should
> > implement Tool for the same.
> > 406270 [Thread-1053] WARN  org.apache.hadoop.mapred.JobClient  - No job
> > jar file set.  User classes may not be found. See JobConf(Class) or
> > JobConf#setJar(String).
> > 406350 [Thread-1053] INFO
> >  org.apache.crunch.hadoop.mapreduce.lib.jobcontrol.CrunchControlledJob  -
> > Running job "org.apache.crunch.scrunch.UnionTest:
> > [[Avro(/tmp/junit8928389473543920922/tmp-crunch.tmp.dir/crunch-563140315/p3)]/[Avro(/tmp/junit8928389473543920922/tmp-crunch.tmp.dir/crunch-563140315/p2)]]+GBK+combine+Avro(/tmp/junit8928389473543920922/tmp-crunch.tmp.dir/crunch-563140315/p1)"
> > 406350 [Thread-1053] INFO
> >  org.apache.crunch.hadoop.mapreduce.lib.jobcontrol.CrunchControlledJob  -
> > Job status available at: http://localhost:8080/
> > Tests run: 2, Failures: 0, Errors: 0, Skipped: 0, Time elapsed: 31.478 sec
> > Running org.apache.crunch.scrunch.TopTest
> > 417027 [main] WARN  org.apache.crunch.scrunch.Pipeline  - Could not locate
> > Scrunch jar file, so could not add Scrunch jars to the job(s) about to be
> > run.
> > 417057 [main] INFO  org.apache.crunch.impl.mr.collect.PGroupedTableImpl  -
> > Setting num reduce tasks to 1
> > 417103 [Thread-1127] WARN  org.apache.hadoop.mapred.JobClient  - Use
> > GenericOptionsParser for parsing the arguments. Applications should
> > implement Tool for the same.
> > 417340 [Thread-1127] WARN  org.apache.hadoop.mapred.JobClient  - No job
> > jar file set.  User classes may not be found. See JobConf(Class) or
> > JobConf#setJar(String).
> > 417382 [Thread-1127] INFO
> >  org.apache.crunch.hadoop.mapreduce.lib.jobcontrol.CrunchControlledJob  -
> > Running job "org.apache.crunch.scrunch.TopTest:
> > Text(/tmp/junit4173908673391512217/shakes.txt)+S0+S1+Aggregate.count+GBK+combine+S2+top10map+Avro(/tmp/junit4173908673391512217/tmp-crunch.tmp.dir/crunch-1087358712/p2)"
> > 417382 [Thread-1127] INFO
> >  org.apache.crunch.hadoop.mapreduce.lib.jobcontrol.CrunchControlledJob  -
> > Job status available at: http://localhost:8080/
> > 424360 [Thread-1127] WARN  org.apache.hadoop.mapred.JobClient  - Use
> > GenericOptionsParser for parsing the arguments. Applications should
> > implement Tool for the same.
> > 424674 [Thread-1127] WARN  org.apache.hadoop.mapred.JobClient  - No job
> > jar file set.  User classes may not be found. See JobConf(Class) or
> > JobConf#setJar(String).
> > 424710 [Thread-1127] INFO
> >  org.apache.crunch.hadoop.mapreduce.lib.jobcontrol.CrunchControlledJob  -
> > Running job "org.apache.crunch.scrunch.TopTest:
> > Avro(/tmp/junit4173908673391512217/tmp-crunch.tmp.dir/crunch-1087358712/p2)+GBK+combine+top10reduce+Avro(/tmp/junit4173908673391512217/tmp-crunch.tmp.dir/crunch-1087358712/p1)"
> > 424710 [Thread-1127] INFO
> >  org.apache.crunch.hadoop.mapreduce.lib.jobcontrol.CrunchControlledJob  -
> > Job status available at: http://localhost:8080/
> > Tests run: 2, Failures: 0, Errors: 0, Skipped: 0, Time elapsed: 15.757 sec
> > Running org.apache.crunch.scrunch.CrossJoinTest
> > Tests run: 2, Failures: 0, Errors: 0, Skipped: 0, Time elapsed: 1.425 sec
> > Running org.apache.crunch.scrunch.CogroupTest
> > 434171 [main] WARN  org.apache.crunch.scrunch.Pipeline  - Could not locate
> > Scrunch jar file, so could not add Scrunch jars to the job(s) about to be
> > run.
> > 434189 [main] INFO  org.apache.crunch.impl.mr.collect.PGroupedTableImpl  -
> > Setting num reduce tasks to 1
> > 434194 [main] INFO  org.apache.crunch.impl.mr.collect.PGroupedTableImpl  -
> > Setting num reduce tasks to 1
> > 434204 [main] INFO  org.apache.crunch.impl.mr.collect.PGroupedTableImpl  -
> > Setting num reduce tasks to 1
> > 434212 [Thread-1176] WARN  org.apache.hadoop.mapred.JobClient  - Use
> > GenericOptionsParser for parsing the arguments. Applications should
> > implement Tool for the same.
> > 434598 [Thread-1176] WARN  org.apache.hadoop.mapred.JobClient  - No job
> > jar file set.  User classes may not be found. See JobConf(Class) or
> > JobConf#setJar(String).
> > 434638 [Thread-1176] INFO
> >  org.apache.crunch.hadoop.mapreduce.lib.jobcontrol.CrunchControlledJob  -
> > Running job "org.apache.crunch.scrunch.CogroupTest:
> > Text(/tmp/junit7270868524613309536/maugham.txt)+S2+Aggregate.count+GBK+combine+S3+coGroupTag2+Avro(/tmp/junit7270868524613309536/tmp-crunch.tmp.dir/crunch-378219315/p2)"
> > 434638 [Thread-1176] INFO
> >  org.apache.crunch.hadoop.mapreduce.lib.jobcontrol.CrunchControlledJob  -
> > Job status available at: http://localhost:8080/
> > 434655 [Thread-1176] WARN  org.apache.hadoop.mapred.JobClient  - Use
> > GenericOptionsParser for parsing the arguments. Applications should
> > implement Tool for the same.
> > 435974 [Thread-1176] WARN  org.apache.hadoop.mapred.JobClient  - No job
> > jar file set.  User classes may not be found. See JobConf(Class) or
> > JobConf#setJar(String).
> > 436034 [Thread-1176] INFO
> >  org.apache.crunch.hadoop.mapreduce.lib.jobcontrol.CrunchControlledJob  -
> > Running job "org.apache.crunch.scrunch.CogroupTest:
> > Text(/tmp/junit7270868524613309536/shakes.txt)+S0+Aggregate.count+GBK+combine+S1+coGroupTag1+Avro(/tmp/junit7270868524613309536/tmp-crunch.tmp.dir/crunch-378219315/p3)"
> > 436034 [Thread-1176] INFO
> >  org.apache.crunch.hadoop.mapreduce.lib.jobcontrol.CrunchControlledJob  -
> > Job status available at: http://localhost:8080/
> > 444038 [Thread-1176] WARN  org.apache.hadoop.mapred.JobClient  - Use
> > GenericOptionsParser for parsing the arguments. Applications should
> > implement Tool for the same.
> > 444350 [Thread-1176] WARN  org.apache.hadoop.mapred.JobClient  - No job
> > jar file set.  User classes may not be found. See JobConf(Class) or
> > JobConf#setJar(String).
> > 444395 [Thread-1176] INFO
> >  org.apache.crunch.hadoop.mapreduce.lib.jobcontrol.CrunchControlledJob  -
> > Running job "org.apache.crunch.scrunch.CogroupTest:
> > [[Avro(/tmp/junit7270868524613309536/tmp-crunch.tmp.dir/crunch-378219315/p3)]/[Avro(/tmp/junit7270868524613309536/tmp-crunch.tmp.dir/crunch-378219315/p2)]]+GBK+cogroup+S4+S5+Avro(/tmp/junit7270868524613309536/tmp-crunch.tmp.dir/crunch-378219315/p1)"
> > 444398 [Thread-1176] INFO
> >  org.apache.crunch.hadoop.mapreduce.lib.jobcontrol.CrunchControlledJob  -
> > Job status available at: http://localhost:8080/
> > Tests run: 1, Failures: 0, Errors: 0, Skipped: 0, Time elapsed: 21.334 sec
> > Running org.apache.crunch.scrunch.PTableTest
> > 455481 [main] WARN  org.apache.crunch.scrunch.Pipeline  - Could not locate
> > Scrunch jar file, so could not add Scrunch jars to the job(s) about to be
> > run.
> > 455518 [main] INFO  org.apache.crunch.impl.mr.collect.PGroupedTableImpl  -
> > Setting num reduce tasks to 1
> > 455552 [Thread-1243] WARN  org.apache.hadoop.mapred.JobClient  - Use
> > GenericOptionsParser for parsing the arguments. Applications should
> > implement Tool for the same.
> > 455803 [Thread-1243] WARN  org.apache.hadoop.mapred.JobClient  - No job
> > jar file set.  User classes may not be found. See JobConf(Class) or
> > JobConf#setJar(String).
> > 455833 [Thread-1243] INFO
> >  org.apache.crunch.hadoop.mapreduce.lib.jobcontrol.CrunchControlledJob  -
> > Running job "org.apache.crunch.scrunch.PTableTest:
> > Text(/tmp/junit4369468018025678110/tens.txt)+S0+Aggregate.count+GBK+combine+S1+Avro(/tmp/junit4369468018025678110/tmp-crunch.tmp.dir/crunch-1914848578/p1)"
> > 455846 [Thread-1243] INFO
> >  org.apache.crunch.hadoop.mapreduce.lib.jobcontrol.CrunchControlledJob  -
> > Job status available at: http://localhost:8080/
> > Tests run: 1, Failures: 0, Errors: 0, Skipped: 0, Time elapsed: 7.948 sec
> > Running org.apache.crunch.scrunch.WordCountTest
> > 463440 [main] WARN  org.apache.crunch.scrunch.Pipeline  - Could not locate
> > Scrunch jar file, so could not add Scrunch jars to the job(s) about to be
> > run.
> > 463441 [main] INFO  org.apache.crunch.io.impl.FileTargetImpl  - Will write
> > output files to new path: /tmp/junit591099541693247381/output
> > 463452 [main] INFO  org.apache.crunch.impl.mr.collect.PGroupedTableImpl  -
> > Setting num reduce tasks to 1
> > 463465 [main] INFO  org.apache.crunch.impl.mr.collect.PGroupedTableImpl  -
> > Setting num reduce tasks to 1
> > 463476 [Thread-1268] WARN  org.apache.hadoop.mapred.JobClient  - Use
> > GenericOptionsParser for parsing the arguments. Applications should
> > implement Tool for the same.
> > 463966 [Thread-1268] WARN  org.apache.hadoop.mapred.JobClient  - No job
> > jar file set.  User classes may not be found. See JobConf(Class) or
> > JobConf#setJar(String).
> > 464010 [Thread-1268] INFO
> >  org.apache.crunch.hadoop.mapreduce.lib.jobcontrol.CrunchControlledJob  -
> > Running job "org.apache.crunch.scrunch.WordCountTest:
> > Text(/tmp/junit591099541693247381/shakes.txt)+S0+S1+Aggregate.count+GBK+combine+S2+[[S3+Avro(/tmp/junit591099541693247381/tmp-crunch.tmp.dir/crunch-254818957/p2)]/[Text(/tmp/junit591099541693247381/output)]]"
> > 464010 [Thread-1268] INFO
> >  org.apache.crunch.hadoop.mapreduce.lib.jobcontrol.CrunchControlledJob  -
> > Job status available at: http://localhost:8080/
> > 470066 [Thread-1268] WARN  org.apache.hadoop.mapred.JobClient  - Use
> > GenericOptionsParser for parsing the arguments. Applications should
> > implement Tool for the same.
> > 470266 [Thread-1268] WARN  org.apache.hadoop.mapred.JobClient  - No job
> > jar file set.  User classes may not be found. See JobConf(Class) or
> > JobConf#setJar(String).
> > 470303 [Thread-1268] INFO
> >  org.apache.crunch.hadoop.mapreduce.lib.jobcontrol.CrunchControlledJob  -
> > Running job "org.apache.crunch.scrunch.WordCountTest:
> > Avro(/tmp/junit591099541693247381/tmp-crunch.tmp.dir/crunch-254818957/p2)+GBK+combine+Avro(/tmp/junit591099541693247381/tmp-crunch.tmp.dir/crunch-254818957/p1)"
> > 470303 [Thread-1268] INFO
> >  org.apache.crunch.hadoop.mapreduce.lib.jobcontrol.CrunchControlledJob  -
> > Job status available at: http://localhost:8080/
> > Tests run: 1, Failures: 0, Errors: 0, Skipped: 0, Time elapsed: 14.911 sec
> > Running org.apache.crunch.scrunch.PCollectionTest
> > 478347 [main] WARN  org.apache.crunch.scrunch.Pipeline  - Could not locate
> > Scrunch jar file, so could not add Scrunch jars to the job(s) about to be
> > run.
> > 478458 [main] WARN  org.apache.crunch.scrunch.Pipeline  - Could not locate
> > Scrunch jar file, so could not add Scrunch jars to the job(s) about to be
> > run.
> > 478555 [Thread-1318] WARN  org.apache.hadoop.mapred.JobClient  - Use
> > GenericOptionsParser for parsing the arguments. Applications should
> > implement Tool for the same.
> > 478892 [Thread-1318] WARN  org.apache.hadoop.mapred.JobClient  - No job
> > jar file set.  User classes may not be found. See JobConf(Class) or
> > JobConf#setJar(String).
> > 478923 [Thread-1318] INFO
> >  org.apache.crunch.hadoop.mapreduce.lib.jobcontrol.CrunchControlledJob  -
> > Running job "org.apache.crunch.scrunch.PCollectionTest:
> > Text(/tmp/junit8773392975421402729/shakes.txt)+Aggregate.count+GBK+combine+PTables.values+SeqFile(/tmp/junit8773392975421402729/tmp-crunch.tmp.dir/crunch-1956870432/p1)"
> > 478923 [Thread-1318] INFO
> >  org.apache.crunch.hadoop.mapreduce.lib.jobcontrol.CrunchControlledJob  -
> > Job status available at: http://localhost:8080/
> > 486556 [main] WARN  org.apache.crunch.scrunch.Pipeline  - Could not locate
> > Scrunch jar file, so could not add Scrunch jars to the job(s) about to be
> > run.
> > 486623 [Thread-1343] WARN  org.apache.hadoop.mapred.JobClient  - Use
> > GenericOptionsParser for parsing the arguments. Applications should
> > implement Tool for the same.
> > 486878 [Thread-1343] WARN  org.apache.hadoop.mapred.JobClient  - No job
> > jar file set.  User classes may not be found. See JobConf(Class) or
> > JobConf#setJar(String).
> > 486914 [Thread-1343] INFO
> >  org.apache.crunch.hadoop.mapreduce.lib.jobcontrol.CrunchControlledJob  -
> > Running job "org.apache.crunch.scrunch.PCollectionTest:
> > Text(/tmp/junit1558236847476849668/shakes.txt)+sample(0.10)+Aggregate.count+GBK+combine+PTables.values+SeqFile(/tmp/junit1558236847476849668/tmp-crunch.tmp.dir/crunch-574499579/p1)"
> > 486915 [Thread-1343] INFO
> >  org.apache.crunch.hadoop.mapreduce.lib.jobcontrol.CrunchControlledJob  -
> > Job status available at: http://localhost:8080/
> > 494491 [main] WARN  org.apache.crunch.scrunch.Pipeline  - Could not locate
> > Scrunch jar file, so could not add Scrunch jars to the job(s) about to be
> > run.
> > 494516 [Thread-1368] WARN  org.apache.hadoop.mapred.JobClient  - Use
> > GenericOptionsParser for parsing the arguments. Applications should
> > implement Tool for the same.
> > 494780 [Thread-1368] WARN  org.apache.hadoop.mapred.JobClient  - No job
> > jar file set.  User classes may not be found. See JobConf(Class) or
> > JobConf#setJar(String).
> > 494822 [Thread-1368] INFO
> >  org.apache.crunch.hadoop.mapreduce.lib.jobcontrol.CrunchControlledJob  -
> > Running job "org.apache.crunch.scrunch.PCollectionTest:
> > Text(/tmp/junit7378418721672398631/shakes.txt)+sample(0.10)+Aggregate.count+GBK+combine+PTables.values+SeqFile(/tmp/junit7378418721672398631/tmp-crunch.tmp.dir/crunch-2023388251/p1)"
> > 494822 [Thread-1368] INFO
> >  org.apache.crunch.hadoop.mapreduce.lib.jobcontrol.CrunchControlledJob  -
> > Job status available at: http://localhost:8080/
> > Tests run: 4, Failures: 0, Errors: 0, Skipped: 0, Time elapsed: 24.054 sec
> >
> > Results :
> >
> > Tests run: 31, Failures: 0, Errors: 0, Skipped: 0
> >
> > [INFO]
> > ------------------------------------------------------------------------
> > [INFO] Reactor Summary:
> > [INFO]
> > [INFO] Apache Crunch ..................................... SUCCESS
> > [33.583s]
> > [INFO] Apache Crunch Test ................................ SUCCESS
> > [19.904s]
> > [INFO] Apache Crunch Core ................................ SUCCESS
> > [23:34.244s]
> > [INFO] Apache Crunch HBase Support ....................... SUCCESS
> > [3:16.788s]
> > [INFO] Apache Crunch Contrib ............................. SUCCESS
> > [23.764s]
> > [INFO] Apache Crunch Examples ............................ SUCCESS
> > [13.449s]
> > [INFO] Apache Crunch Archetype ........................... SUCCESS
> > [17.372s]
> > [INFO] Apache Crunch for Scala ........................... FAILURE
> > [9:39.953s]
> > [INFO] Apache Crunch Distribution ........................ SKIPPED
> > [INFO]
> > ------------------------------------------------------------------------
> > [INFO] BUILD FAILURE
> > [INFO]
> > ------------------------------------------------------------------------
> > [INFO] Total time: 38:24.322s
> > [INFO] Finished at: Tue Mar 26 01:17:09 UTC 2013
> > [INFO] Final Memory: 43M/216M
> > [INFO]
> > ------------------------------------------------------------------------
> > [JENKINS] Archiving <
> > https://builds.apache.org/job/Crunch-master-integration/ws/crunch-dist/pom.xml>
> > to
> > /home/hudson/hudson/jobs/Crunch-master-integration/modules/org.apache.crunch$crunch-dist/builds/2013-03-26_00-38-29/archive/org.apache.crunch/crunch-dist/0.6.0-SNAPSHOT/crunch-dist-0.6.0-SNAPSHOT.pom
> > [JENKINS] Archiving <
> > https://builds.apache.org/job/Crunch-master-integration/ws/crunch-hbase/pom.xml>
> > to
> > /home/hudson/hudson/jobs/Crunch-master-integration/modules/org.apache.crunch$crunch-hbase/builds/2013-03-26_00-38-29/archive/org.apache.crunch/crunch-hbase/0.6.0-SNAPSHOT/crunch-hbase-0.6.0-SNAPSHOT.pom
> > [JENKINS] Archiving <
> > https://builds.apache.org/job/Crunch-master-integration/ws/crunch-hbase/target/crunch-hbase-0.6.0-SNAPSHOT.jar>
> > to
> > /home/hudson/hudson/jobs/Crunch-master-integration/modules/org.apache.crunch$crunch-hbase/builds/2013-03-26_00-38-29/archive/org.apache.crunch/crunch-hbase/0.6.0-SNAPSHOT/crunch-hbase-0.6.0-SNAPSHOT.jar
> > [JENKINS] Archiving <
> > https://builds.apache.org/job/Crunch-master-integration/ws/crunch-scrunch/pom.xml>
> > to
> > /home/hudson/hudson/jobs/Crunch-master-integration/modules/org.apache.crunch$crunch-scrunch/builds/2013-03-26_00-38-29/archive/org.apache.crunch/crunch-scrunch/0.6.0-SNAPSHOT/crunch-scrunch-0.6.0-SNAPSHOT.pom
> > [JENKINS] Archiving <
> > https://builds.apache.org/job/Crunch-master-integration/ws/crunch-scrunch/target/crunch-scrunch-0.6.0-SNAPSHOT.jar>
> > to
> > /home/hudson/hudson/jobs/Crunch-master-integration/modules/org.apache.crunch$crunch-scrunch/builds/2013-03-26_00-38-29/archive/org.apache.crunch/crunch-scrunch/0.6.0-SNAPSHOT/crunch-scrunch-0.6.0-SNAPSHOT.jar
> > [JENKINS] Archiving <
> > https://builds.apache.org/job/Crunch-master-integration/ws/crunch/pom.xml>
> > to
> > /home/hudson/hudson/jobs/Crunch-master-integration/modules/org.apache.crunch$crunch/builds/2013-03-26_00-38-29/archive/org.apache.crunch/crunch/0.6.0-SNAPSHOT/crunch-0.6.0-SNAPSHOT.pom
> > [JENKINS] Archiving <
> > https://builds.apache.org/job/Crunch-master-integration/ws/crunch/target/crunch-0.6.0-SNAPSHOT.jar>
> > to
> > /home/hudson/hudson/jobs/Crunch-master-integration/modules/org.apache.crunch$crunch/builds/2013-03-26_00-38-29/archive/org.apache.crunch/crunch/0.6.0-SNAPSHOT/crunch-0.6.0-SNAPSHOT.jar
> > [JENKINS] Archiving <
> > https://builds.apache.org/job/Crunch-master-integration/ws/crunch-contrib/pom.xml>
> > to
> > /home/hudson/hudson/jobs/Crunch-master-integration/modules/org.apache.crunch$crunch-contrib/builds/2013-03-26_00-38-29/archive/org.apache.crunch/crunch-contrib/0.6.0-SNAPSHOT/crunch-contrib-0.6.0-SNAPSHOT.pom
> > [JENKINS] Archiving <
> > https://builds.apache.org/job/Crunch-master-integration/ws/crunch-contrib/target/crunch-contrib-0.6.0-SNAPSHOT.jar>
> > to
> > /home/hudson/hudson/jobs/Crunch-master-integration/modules/org.apache.crunch$crunch-contrib/builds/2013-03-26_00-38-29/archive/org.apache.crunch/crunch-contrib/0.6.0-SNAPSHOT/crunch-contrib-0.6.0-SNAPSHOT.jar
> > [JENKINS] Archiving <
> > https://builds.apache.org/job/Crunch-master-integration/ws/crunch-archetype/pom.xml>
> > to
> > /home/hudson/hudson/jobs/Crunch-master-integration/modules/org.apache.crunch$crunch-archetype/builds/2013-03-26_00-38-29/archive/org.apache.crunch/crunch-archetype/0.6.0-SNAPSHOT/crunch-archetype-0.6.0-SNAPSHOT.pom
> > [JENKINS] Archiving <
> > https://builds.apache.org/job/Crunch-master-integration/ws/crunch-archetype/target/crunch-archetype-0.6.0-SNAPSHOT.jar>
> > to
> > /home/hudson/hudson/jobs/Crunch-master-integration/modules/org.apache.crunch$crunch-archetype/builds/2013-03-26_00-38-29/archive/org.apache.crunch/crunch-archetype/0.6.0-SNAPSHOT/crunch-archetype-0.6.0-SNAPSHOT.jar
> > [JENKINS] Archiving <
> > https://builds.apache.org/job/Crunch-master-integration/ws/pom.xml> to
> > /home/hudson/hudson/jobs/Crunch-master-integration/modules/org.apache.crunch$crunch-parent/builds/2013-03-26_00-38-29/archive/org.apache.crunch/crunch-parent/0.6.0-SNAPSHOT/crunch-parent-0.6.0-SNAPSHOT.pom
> > [JENKINS] Archiving <
> > https://builds.apache.org/job/Crunch-master-integration/ws/target/crunch-parent-0.6.0-SNAPSHOT-site.xml>
> > to
> > /home/hudson/hudson/jobs/Crunch-master-integration/modules/org.apache.crunch$crunch-parent/builds/2013-03-26_00-38-29/archive/org.apache.crunch/crunch-parent/0.6.0-SNAPSHOT/crunch-parent-0.6.0-SNAPSHOT-site.xml
> > [JENKINS] Archiving <
> > https://builds.apache.org/job/Crunch-master-integration/ws/crunch-examples/pom.xml>
> > to
> > /home/hudson/hudson/jobs/Crunch-master-integration/modules/org.apache.crunch$crunch-examples/builds/2013-03-26_00-38-29/archive/org.apache.crunch/crunch-examples/0.6.0-SNAPSHOT/crunch-examples-0.6.0-SNAPSHOT.pom
> > [JENKINS] Archiving <
> > https://builds.apache.org/job/Crunch-master-integration/ws/crunch-examples/target/crunch-examples-0.6.0-SNAPSHOT.jar>
> > to
> > /home/hudson/hudson/jobs/Crunch-master-integration/modules/org.apache.crunch$crunch-examples/builds/2013-03-26_00-38-29/archive/org.apache.crunch/crunch-examples/0.6.0-SNAPSHOT/crunch-examples-0.6.0-SNAPSHOT.jar
> > [JENKINS] Archiving <
> > https://builds.apache.org/job/Crunch-master-integration/ws/crunch-examples/target/crunch-examples-0.6.0-SNAPSHOT-job.jar>
> > to
> > /home/hudson/hudson/jobs/Crunch-master-integration/modules/org.apache.crunch$crunch-examples/builds/2013-03-26_00-38-29/archive/org.apache.crunch/crunch-examples/0.6.0-SNAPSHOT/crunch-examples-0.6.0-SNAPSHOT-job.jar
> > [JENKINS] Archiving <
> > https://builds.apache.org/job/Crunch-master-integration/ws/crunch-test/pom.xml>
> > to
> > /home/hudson/hudson/jobs/Crunch-master-integration/modules/org.apache.crunch$crunch-test/builds/2013-03-26_00-38-29/archive/org.apache.crunch/crunch-test/0.6.0-SNAPSHOT/crunch-test-0.6.0-SNAPSHOT.pom
> > [JENKINS] Archiving <
> > https://builds.apache.org/job/Crunch-master-integration/ws/crunch-test/target/crunch-test-0.6.0-SNAPSHOT.jar>
> > to
> > /home/hudson/hudson/jobs/Crunch-master-integration/modules/org.apache.crunch$crunch-test/builds/2013-03-26_00-38-29/archive/org.apache.crunch/crunch-test/0.6.0-SNAPSHOT/crunch-test-0.6.0-SNAPSHOT.jar
> > Waiting for Jenkins to finish collecting data
> > mavenExecutionResult exceptions not empty
> > message : Internal error: java.lang.reflect.UndeclaredThrowableException
> > cause : null
> > Stack trace :
> > org.apache.maven.InternalErrorException: Internal error:
> > java.lang.reflect.UndeclaredThrowableException
> >         at
> > org.apache.maven.lifecycle.internal.BuilderCommon.handleBuildError(BuilderCommon.java:128)
> >         at
> > org.apache.maven.lifecycle.internal.LifecycleModuleBuilder.buildProject(LifecycleModuleBuilder.java:95)
> >         at
> > org.apache.maven.lifecycle.internal.LifecycleModuleBuilder.buildProject(LifecycleModuleBuilder.java:59)
> >         at
> > org.apache.maven.lifecycle.internal.LifecycleStarter.singleThreadedBuild(LifecycleStarter.java:183)
> >         at
> > org.apache.maven.lifecycle.internal.LifecycleStarter.execute(LifecycleStarter.java:161)
> >         at org.apache.maven.DefaultMaven.doExecute(DefaultMaven.java:320)
> >         at org.apache.maven.DefaultMaven.execute(DefaultMaven.java:156)
> >         at
> > org.jvnet.hudson.maven3.launcher.Maven3Launcher.main(Maven3Launcher.java:79)
> >         at sun.reflect.NativeMethodAccessorImpl.invoke0(Native Method)
> >         at
> > sun.reflect.NativeMethodAccessorImpl.invoke(NativeMethodAccessorImpl.java:39)
> >         at
> > sun.reflect.DelegatingMethodAccessorImpl.invoke(DelegatingMethodAccessorImpl.java:25)
> >         at java.lang.reflect.Method.invoke(Method.java:597)
> >         at
> > org.codehaus.plexus.classworlds.launcher.Launcher.launchStandard(Launcher.java:329)
> >         at
> > org.codehaus.plexus.classworlds.launcher.Launcher.launch(Launcher.java:239)
> >         at
> > org.jvnet.hudson.maven3.agent.Maven3Main.launch(Maven3Main.java:158)
> >         at hudson.maven.Maven3Builder.call(Maven3Builder.java:100)
> >         at hudson.maven.Maven3Builder.call(Maven3Builder.java:66)
> >         at hudson.remoting.UserRequest.perform(UserRequest.java:118)
> >         at hudson.remoting.UserRequest.perform(UserRequest.java:48)
> >         at hudson.remoting.Request$2.run(Request.java:326)
> >         at
> > hudson.remoting.InterceptingExecutorService$1.call(InterceptingExecutorService.java:72)
> >         at
> > java.util.concurrent.FutureTask$Sync.innerRun(FutureTask.java:303)
> >         at java.util.concurrent.FutureTask.run(FutureTask.java:138)
> >         at
> > java.util.concurrent.ThreadPoolExecutor$Worker.runTask(ThreadPoolExecutor.java:886)
> >         at
> > java.util.concurrent.ThreadPoolExecutor$Worker.run(ThreadPoolExecutor.java:908)
> >         at java.lang.Thread.run(Thread.java:662)
> > Caused by: java.lang.reflect.UndeclaredThrowableException
> >         at $Proxy2.setExecutedMojos(Unknown Source)
> >         at
> > hudson.maven.MavenBuildProxy$Filter.setExecutedMojos(MavenBuildProxy.java:243)
> >         at
> > hudson.maven.Maven3Builder$MavenExecutionListener.recordMojoEnded(Maven3Builder.java:439)
> >         at
> > hudson.maven.Maven3Builder$MavenExecutionListener.mojoSucceeded(Maven3Builder.java:425)
> >         at
> > org.apache.maven.lifecycle.internal.DefaultExecutionEventCatapult.fire(DefaultExecutionEventCatapult.java:87)
> >         at
> > org.apache.maven.lifecycle.internal.DefaultExecutionEventCatapult.fire(DefaultExecutionEventCatapult.java:42)
> >         at
> > org.apache.maven.lifecycle.internal.MojoExecutor.execute(MojoExecutor.java:228)
> >         at
> > org.apache.maven.lifecycle.internal.MojoExecutor.execute(MojoExecutor.java:153)
> >         at
> > org.apache.maven.lifecycle.internal.MojoExecutor.execute(MojoExecutor.java:145)
> >         at
> > org.apache.maven.lifecycle.internal.LifecycleModuleBuilder.buildProject(LifecycleModuleBuilder.java:84)
> >         ... 24 more
> > Caused by: java.io.UTFDataFormatException
> >         at
> > java.io.ObjectInputStream$BlockDataInputStream.readUTFSpan(ObjectInputStream.java:3105)
> >         at
> > java.io.ObjectInputStream$BlockDataInputStream.readUTFBody(ObjectInputStream.java:3030)
> >         at
> > java.io.ObjectInputStream$BlockDataInputStream.readUTF(ObjectInputStream.java:2843)
> >         at java.io.ObjectInputStream.readUTF(ObjectInputStream.java:1069)
> >         at
> > java.io.ObjectStreamClass.readNonProxy(ObjectStreamClass.java:691)
> >         at
> > java.io.ObjectInputStream.readClassDescriptor(ObjectInputStream.java:827)
> >         at
> > java.io.ObjectInputStream.readNonProxyDesc(ObjectInputStream.java:1583)
> >         at
> > java.io.ObjectInputStream.readClassDesc(ObjectInputStream.java:1514)
> >         at
> > java.io.ObjectInputStream.readOrdinaryObject(ObjectInputStream.java:1750)
> >         at
> > java.io.ObjectInputStream.readObject0(ObjectInputStream.java:1347)
> >         at java.io.ObjectInputStream.readObject(ObjectInputStream.java:369)
> >         at
> > java.util.concurrent.CopyOnWriteArrayList.readObject(CopyOnWriteArrayList.java:879)
> >         at sun.reflect.GeneratedMethodAccessor16734.invoke(Unknown Source)
> >         at
> > sun.reflect.DelegatingMethodAccessorImpl.invoke(DelegatingMethodAccessorImpl.java:43)
> >         at java.lang.reflect.Method.invoke(Method.java:601)
> >         at
> > java.io.ObjectStreamClass.invokeReadObject(ObjectStreamClass.java:1004)
> >         at
> > java.io.ObjectInputStream.readSerialData(ObjectInputStream.java:1872)
> >         at
> > java.io.ObjectInputStream.readOrdinaryObject(ObjectInputStream.java:1777)
> >         at
> > java.io.ObjectInputStream.readObject0(ObjectInputStream.java:1347)
> >         at java.io.ObjectInputStream.readArray(ObjectInputStream.java:1685)
> >         at
> > java.io.ObjectInputStream.readObject0(ObjectInputStream.java:1341)
> >         at
> > java.io.ObjectInputStream.defaultReadFields(ObjectInputStream.java:1970)
> >         at
> > java.io.ObjectInputStream.readSerialData(ObjectInputStream.java:1894)
> >         at
> > java.io.ObjectInputStream.readOrdinaryObject(ObjectInputStream.java:1777)
> >         at
> > java.io.ObjectInputStream.readObject0(ObjectInputStream.java:1347)
> >         at java.io.ObjectInputStream.readObject(ObjectInputStream.java:369)
> >         at hudson.remoting.UserRequest.deserialize(UserRequest.java:182)
> >         at hudson.remoting.UserRequest.perform(UserRequest.java:98)
> >         at hudson.remoting.UserRequest.perform(UserRequest.java:48)
> >         at hudson.remoting.Request$2.run(Request.java:326)
> >         at
> > hudson.remoting.InterceptingExecutorService$1.call(InterceptingExecutorService.java:72)
> >         at
> > java.util.concurrent.FutureTask$Sync.innerRun(FutureTask.java:334)
> >         at java.util.concurrent.FutureTask.run(FutureTask.java:166)
> >         at
> > java.util.concurrent.ThreadPoolExecutor.runWorker(ThreadPoolExecutor.java:1145)
> >         at
> > java.util.concurrent.ThreadPoolExecutor$Worker.run(ThreadPoolExecutor.java:615)
> >         at java.lang.Thread.run(Thread.java:722)
> > channel stopped
> > [locks-and-latches] Releasing all the locks
> > [locks-and-latches] All the locks released
> >
> >

Mime
View raw message