crunch-dev mailing list archives

Site index · List index
Message view « Date » · « Thread »
Top « Date » · « Thread »
From Apache Jenkins Server <jenk...@builds.apache.org>
Subject Build failed in Jenkins: Crunch-master-integration #229
Date Fri, 15 Mar 2013 07:49:36 GMT
See <https://builds.apache.org/job/Crunch-master-integration/229/>

------------------------------------------
[...truncated 2380 lines...]
344976 [Thread-898] INFO  org.apache.crunch.impl.mr.exec.CrunchJob  - Job status available
at: http://localhost:8080/
351598 [Thread-898] WARN  org.apache.hadoop.mapred.JobClient  - Use GenericOptionsParser for
parsing the arguments. Applications should implement Tool for the same.
352132 [Thread-898] WARN  org.apache.hadoop.mapred.JobClient  - No job jar file set.  User
classes may not be found. See JobConf(Class) or JobConf#setJar(String).
352170 [Thread-898] INFO  org.apache.crunch.impl.mr.exec.CrunchJob  - Running job "org.apache.crunch.scrunch.PageRankTest:
Avro(/tmp/junit1438531483109993091/tmp-crunch.tmp.dir/crunch-1245398824/p26)+[[S18+coGroupTag2]/[coGroupTag1]]+GBK+cogroup+S19+S20+PTables.values+S21+max+Avro(/tmp/junit1438531483109993091/tmp-crunch.tmp.dir/crunch-1245398824/p27)"
352170 [Thread-898] INFO  org.apache.crunch.impl.mr.exec.CrunchJob  - Job status available
at: http://localhost:8080/
356173 [Thread-898] WARN  org.apache.hadoop.mapred.JobClient  - Use GenericOptionsParser for
parsing the arguments. Applications should implement Tool for the same.
356827 [Thread-898] WARN  org.apache.hadoop.mapred.JobClient  - No job jar file set.  User
classes may not be found. See JobConf(Class) or JobConf#setJar(String).
356860 [Thread-898] INFO  org.apache.crunch.impl.mr.exec.CrunchJob  - Running job "org.apache.crunch.scrunch.PageRankTest:
Avro(/tmp/junit1438531483109993091/tmp-crunch.tmp.dir/crunch-1245398824/p27)+GBK+combine+PTables.values+Avro(/tmp/junit1438531483109993091/tmp-crunch.tmp.dir/crunch-1245398824/p25)"
356861 [Thread-898] INFO  org.apache.crunch.impl.mr.exec.CrunchJob  - Job status available
at: http://localhost:8080/
Tests run: 1, Failures: 0, Errors: 0, Skipped: 0, Time elapsed: 109.508 sec
Running org.apache.crunch.scrunch.PipelineClosureAppTest
364914 [main] WARN  org.apache.crunch.scrunch.Pipeline  - Could not locate Scrunch jar file,
so could not add Scrunch jars to the job(s) about to be run.
365025 [main] INFO  org.apache.crunch.impl.mr.collect.PGroupedTableImpl  - Setting num reduce
tasks to 1
365591 [Thread-957] WARN  org.apache.hadoop.mapred.JobClient  - No job jar file set.  User
classes may not be found. See JobConf(Class) or JobConf#setJar(String).
365646 [Thread-957] INFO  org.apache.crunch.impl.mr.exec.CrunchJob  - Running job "org.apache.crunch.scrunch.PipelineClosureAppTest$Divider$:
Text(/tmp/junit2691740496548299964/tens.txt)+S0+Aggregate.count+GBK+combine+S1+Avro(/tmp/crunch-1548925146/p1)"
365646 [Thread-957] INFO  org.apache.crunch.impl.mr.exec.CrunchJob  - Job status available
at: http://localhost:8080/
Tests run: 1, Failures: 0, Errors: 0, Skipped: 0, Time elapsed: 8.314 sec
Running org.apache.crunch.scrunch.PipelineAppTest
373229 [main] WARN  org.apache.crunch.scrunch.Pipeline  - Could not locate Scrunch jar file,
so could not add Scrunch jars to the job(s) about to be run.
373251 [main] INFO  org.apache.crunch.io.impl.FileTargetImpl  - Will write output files to
new path: /tmp/junit3365581747806143304/output
373272 [main] INFO  org.apache.crunch.impl.mr.collect.PGroupedTableImpl  - Setting num reduce
tasks to 1
373277 [main] INFO  org.apache.crunch.impl.mr.collect.PGroupedTableImpl  - Setting num reduce
tasks to 1
373286 [main] INFO  org.apache.crunch.impl.mr.collect.PGroupedTableImpl  - Setting num reduce
tasks to 1
373771 [Thread-976] WARN  org.apache.hadoop.mapred.JobClient  - No job jar file set.  User
classes may not be found. See JobConf(Class) or JobConf#setJar(String).
373808 [Thread-976] INFO  org.apache.crunch.impl.mr.exec.CrunchJob  - Running job "org.apache.crunch.scrunch.WordCount$:
Text(/tmp/junit3365581747806143304/shakes.txt)+S0+Aggregate.count+GBK+combine+S1+coGroupTag1+Avro(/tmp/crunch-654843719/p1)"
373808 [Thread-976] INFO  org.apache.crunch.impl.mr.exec.CrunchJob  - Job status available
at: http://localhost:8080/
374411 [Thread-976] WARN  org.apache.hadoop.mapred.JobClient  - No job jar file set.  User
classes may not be found. See JobConf(Class) or JobConf#setJar(String).
374463 [Thread-976] INFO  org.apache.crunch.impl.mr.exec.CrunchJob  - Running job "org.apache.crunch.scrunch.WordCount$:
Text(/tmp/junit3365581747806143304/maugham.txt)+S2+Aggregate.count+GBK+combine+S3+coGroupTag2+Avro(/tmp/crunch-654843719/p2)"
374463 [Thread-976] INFO  org.apache.crunch.impl.mr.exec.CrunchJob  - Job status available
at: http://localhost:8080/
384377 [Thread-976] WARN  org.apache.hadoop.mapred.JobClient  - No job jar file set.  User
classes may not be found. See JobConf(Class) or JobConf#setJar(String).
384422 [Thread-976] INFO  org.apache.crunch.impl.mr.exec.CrunchJob  - Running job "org.apache.crunch.scrunch.WordCount$:
[[Avro(/tmp/crunch-654843719/p1)]/[Avro(/tmp/crunch-654843719/p2)]]+GBK+cogroup+S4+Text(/tmp/junit3365581747806143304/output)"
384422 [Thread-976] INFO  org.apache.crunch.impl.mr.exec.CrunchJob  - Job status available
at: http://localhost:8080/
Tests run: 1, Failures: 0, Errors: 0, Skipped: 0, Time elapsed: 22.222 sec
Running org.apache.crunch.scrunch.UnionTest
395467 [main] WARN  org.apache.crunch.scrunch.Pipeline  - Could not locate Scrunch jar file,
so could not add Scrunch jars to the job(s) about to be run.
395506 [main] INFO  org.apache.crunch.impl.mr.collect.PGroupedTableImpl  - Setting num reduce
tasks to 1
395521 [Thread-1027] WARN  org.apache.hadoop.mapred.JobClient  - Use GenericOptionsParser
for parsing the arguments. Applications should implement Tool for the same.
396155 [Thread-1027] WARN  org.apache.hadoop.mapred.JobClient  - No job jar file set.  User
classes may not be found. See JobConf(Class) or JobConf#setJar(String).
396222 [Thread-1027] INFO  org.apache.crunch.impl.mr.exec.CrunchJob  - Running job "org.apache.crunch.scrunch.UnionTest:
[[Text(/tmp/junit5077910602200264183/shakes.txt)+S1+Aggregate.count]/[Text(/tmp/junit5077910602200264183/maugham.txt)+S0+S1+Aggregate.count]]+GBK+combine+S2+Avro(/tmp/junit5077910602200264183/tmp-crunch.tmp.dir/crunch-160036821/p1)"
396223 [Thread-1027] INFO  org.apache.crunch.impl.mr.exec.CrunchJob  - Job status available
at: http://localhost:8080/
406639 [main] WARN  org.apache.crunch.scrunch.Pipeline  - Could not locate Scrunch jar file,
so could not add Scrunch jars to the job(s) about to be run.
406651 [main] INFO  org.apache.crunch.impl.mr.collect.PGroupedTableImpl  - Setting num reduce
tasks to 1
406655 [main] INFO  org.apache.crunch.impl.mr.collect.PGroupedTableImpl  - Setting num reduce
tasks to 1
406661 [main] INFO  org.apache.crunch.impl.mr.collect.PGroupedTableImpl  - Setting num reduce
tasks to 1
406664 [Thread-1053] WARN  org.apache.hadoop.mapred.JobClient  - Use GenericOptionsParser
for parsing the arguments. Applications should implement Tool for the same.
407799 [Thread-1053] WARN  org.apache.hadoop.mapred.JobClient  - No job jar file set.  User
classes may not be found. See JobConf(Class) or JobConf#setJar(String).
407847 [Thread-1053] INFO  org.apache.crunch.impl.mr.exec.CrunchJob  - Running job "org.apache.crunch.scrunch.UnionTest:
Text(/tmp/junit4476032779147629097/maugham.txt)+S2+Aggregate.count+GBK+combine+S3+Avro(/tmp/junit4476032779147629097/tmp-crunch.tmp.dir/crunch-1632877616/p3)"
407861 [Thread-1053] INFO  org.apache.crunch.impl.mr.exec.CrunchJob  - Job status available
at: http://localhost:8080/
407862 [Thread-1053] WARN  org.apache.hadoop.mapred.JobClient  - Use GenericOptionsParser
for parsing the arguments. Applications should implement Tool for the same.
408994 [Thread-1053] WARN  org.apache.hadoop.mapred.JobClient  - No job jar file set.  User
classes may not be found. See JobConf(Class) or JobConf#setJar(String).
409073 [Thread-1053] INFO  org.apache.crunch.impl.mr.exec.CrunchJob  - Running job "org.apache.crunch.scrunch.UnionTest:
Text(/tmp/junit4476032779147629097/shakes.txt)+S0+Aggregate.count+GBK+combine+S1+Avro(/tmp/junit4476032779147629097/tmp-crunch.tmp.dir/crunch-1632877616/p2)"
409073 [Thread-1053] INFO  org.apache.crunch.impl.mr.exec.CrunchJob  - Job status available
at: http://localhost:8080/
417847 [Thread-1053] WARN  org.apache.hadoop.mapred.JobClient  - Use GenericOptionsParser
for parsing the arguments. Applications should implement Tool for the same.
418422 [Thread-1053] WARN  org.apache.hadoop.mapred.JobClient  - No job jar file set.  User
classes may not be found. See JobConf(Class) or JobConf#setJar(String).
418471 [Thread-1053] INFO  org.apache.crunch.impl.mr.exec.CrunchJob  - Running job "org.apache.crunch.scrunch.UnionTest:
[[Avro(/tmp/junit4476032779147629097/tmp-crunch.tmp.dir/crunch-1632877616/p2)]/[Avro(/tmp/junit4476032779147629097/tmp-crunch.tmp.dir/crunch-1632877616/p3)]]+GBK+combine+Avro(/tmp/junit4476032779147629097/tmp-crunch.tmp.dir/crunch-1632877616/p1)"
418471 [Thread-1053] INFO  org.apache.crunch.impl.mr.exec.CrunchJob  - Job status available
at: http://localhost:8080/
Tests run: 2, Failures: 0, Errors: 0, Skipped: 0, Time elapsed: 34.105 sec
Running org.apache.crunch.scrunch.TopTest
429640 [main] WARN  org.apache.crunch.scrunch.Pipeline  - Could not locate Scrunch jar file,
so could not add Scrunch jars to the job(s) about to be run.
429707 [main] INFO  org.apache.crunch.impl.mr.collect.PGroupedTableImpl  - Setting num reduce
tasks to 1
429776 [Thread-1127] WARN  org.apache.hadoop.mapred.JobClient  - Use GenericOptionsParser
for parsing the arguments. Applications should implement Tool for the same.
430988 [Thread-1127] WARN  org.apache.hadoop.mapred.JobClient  - No job jar file set.  User
classes may not be found. See JobConf(Class) or JobConf#setJar(String).
431026 [Thread-1127] INFO  org.apache.crunch.impl.mr.exec.CrunchJob  - Running job "org.apache.crunch.scrunch.TopTest:
Text(/tmp/junit3017013982964668544/shakes.txt)+S0+S1+Aggregate.count+GBK+combine+S2+top10map+Avro(/tmp/junit3017013982964668544/tmp-crunch.tmp.dir/crunch-52751346/p2)"
431026 [Thread-1127] INFO  org.apache.crunch.impl.mr.exec.CrunchJob  - Job status available
at: http://localhost:8080/
437633 [Thread-1127] WARN  org.apache.hadoop.mapred.JobClient  - Use GenericOptionsParser
for parsing the arguments. Applications should implement Tool for the same.
438395 [Thread-1127] WARN  org.apache.hadoop.mapred.JobClient  - No job jar file set.  User
classes may not be found. See JobConf(Class) or JobConf#setJar(String).
438439 [Thread-1127] INFO  org.apache.crunch.impl.mr.exec.CrunchJob  - Running job "org.apache.crunch.scrunch.TopTest:
Avro(/tmp/junit3017013982964668544/tmp-crunch.tmp.dir/crunch-52751346/p2)+GBK+combine+top10reduce+Avro(/tmp/junit3017013982964668544/tmp-crunch.tmp.dir/crunch-52751346/p1)"
438439 [Thread-1127] INFO  org.apache.crunch.impl.mr.exec.CrunchJob  - Job status available
at: http://localhost:8080/
Tests run: 2, Failures: 0, Errors: 0, Skipped: 0, Time elapsed: 13.915 sec
Running org.apache.crunch.scrunch.CrossJoinTest
Tests run: 2, Failures: 0, Errors: 0, Skipped: 0, Time elapsed: 1.656 sec
Running org.apache.crunch.scrunch.CogroupTest
445137 [main] WARN  org.apache.crunch.scrunch.Pipeline  - Could not locate Scrunch jar file,
so could not add Scrunch jars to the job(s) about to be run.
445158 [main] INFO  org.apache.crunch.impl.mr.collect.PGroupedTableImpl  - Setting num reduce
tasks to 1
445174 [main] INFO  org.apache.crunch.impl.mr.collect.PGroupedTableImpl  - Setting num reduce
tasks to 1
445178 [main] INFO  org.apache.crunch.impl.mr.collect.PGroupedTableImpl  - Setting num reduce
tasks to 1
445244 [Thread-1176] WARN  org.apache.hadoop.mapred.JobClient  - Use GenericOptionsParser
for parsing the arguments. Applications should implement Tool for the same.
446023 [Thread-1176] WARN  org.apache.hadoop.mapred.JobClient  - No job jar file set.  User
classes may not be found. See JobConf(Class) or JobConf#setJar(String).
446059 [Thread-1176] INFO  org.apache.crunch.impl.mr.exec.CrunchJob  - Running job "org.apache.crunch.scrunch.CogroupTest:
Text(/tmp/junit7688537623034487371/maugham.txt)+S2+Aggregate.count+GBK+combine+S3+coGroupTag2+Avro(/tmp/junit7688537623034487371/tmp-crunch.tmp.dir/crunch-1754037190/p3)"
446059 [Thread-1176] INFO  org.apache.crunch.impl.mr.exec.CrunchJob  - Job status available
at: http://localhost:8080/
446068 [Thread-1176] WARN  org.apache.hadoop.mapred.JobClient  - Use GenericOptionsParser
for parsing the arguments. Applications should implement Tool for the same.
447407 [Thread-1176] WARN  org.apache.hadoop.mapred.JobClient  - No job jar file set.  User
classes may not be found. See JobConf(Class) or JobConf#setJar(String).
447446 [Thread-1176] INFO  org.apache.crunch.impl.mr.exec.CrunchJob  - Running job "org.apache.crunch.scrunch.CogroupTest:
Text(/tmp/junit7688537623034487371/shakes.txt)+S0+Aggregate.count+GBK+combine+S1+coGroupTag1+Avro(/tmp/junit7688537623034487371/tmp-crunch.tmp.dir/crunch-1754037190/p2)"
447446 [Thread-1176] INFO  org.apache.crunch.impl.mr.exec.CrunchJob  - Job status available
at: http://localhost:8080/
454209 [Thread-1176] WARN  org.apache.hadoop.mapred.JobClient  - Use GenericOptionsParser
for parsing the arguments. Applications should implement Tool for the same.
454315 [Thread-1176] WARN  org.apache.hadoop.mapred.JobClient  - No job jar file set.  User
classes may not be found. See JobConf(Class) or JobConf#setJar(String).
454375 [Thread-1176] INFO  org.apache.crunch.impl.mr.exec.CrunchJob  - Running job "org.apache.crunch.scrunch.CogroupTest:
[[Avro(/tmp/junit7688537623034487371/tmp-crunch.tmp.dir/crunch-1754037190/p2)]/[Avro(/tmp/junit7688537623034487371/tmp-crunch.tmp.dir/crunch-1754037190/p3)]]+GBK+cogroup+S4+S5+Avro(/tmp/junit7688537623034487371/tmp-crunch.tmp.dir/crunch-1754037190/p1)"
454375 [Thread-1176] INFO  org.apache.crunch.impl.mr.exec.CrunchJob  - Job status available
at: http://localhost:8080/
Tests run: 1, Failures: 0, Errors: 0, Skipped: 0, Time elapsed: 20.328 sec
Running org.apache.crunch.scrunch.PTableTest
465484 [main] WARN  org.apache.crunch.scrunch.Pipeline  - Could not locate Scrunch jar file,
so could not add Scrunch jars to the job(s) about to be run.
465506 [main] INFO  org.apache.crunch.impl.mr.collect.PGroupedTableImpl  - Setting num reduce
tasks to 1
465544 [Thread-1243] WARN  org.apache.hadoop.mapred.JobClient  - Use GenericOptionsParser
for parsing the arguments. Applications should implement Tool for the same.
466195 [Thread-1243] WARN  org.apache.hadoop.mapred.JobClient  - No job jar file set.  User
classes may not be found. See JobConf(Class) or JobConf#setJar(String).
466255 [Thread-1243] INFO  org.apache.crunch.impl.mr.exec.CrunchJob  - Running job "org.apache.crunch.scrunch.PTableTest:
Text(/tmp/junit4636458291219495794/tens.txt)+S0+Aggregate.count+GBK+combine+S1+Avro(/tmp/junit4636458291219495794/tmp-crunch.tmp.dir/crunch-1411535556/p1)"
466255 [Thread-1243] INFO  org.apache.crunch.impl.mr.exec.CrunchJob  - Job status available
at: http://localhost:8080/
Tests run: 1, Failures: 0, Errors: 0, Skipped: 0, Time elapsed: 8.428 sec
Running org.apache.crunch.scrunch.WordCountTest
473900 [main] WARN  org.apache.crunch.scrunch.Pipeline  - Could not locate Scrunch jar file,
so could not add Scrunch jars to the job(s) about to be run.
473902 [main] INFO  org.apache.crunch.io.impl.FileTargetImpl  - Will write output files to
new path: /tmp/junit8982345877659350182/output
473925 [main] INFO  org.apache.crunch.impl.mr.collect.PGroupedTableImpl  - Setting num reduce
tasks to 1
473931 [main] INFO  org.apache.crunch.impl.mr.collect.PGroupedTableImpl  - Setting num reduce
tasks to 1
473936 [Thread-1268] WARN  org.apache.hadoop.mapred.JobClient  - Use GenericOptionsParser
for parsing the arguments. Applications should implement Tool for the same.
474727 [Thread-1268] WARN  org.apache.hadoop.mapred.JobClient  - No job jar file set.  User
classes may not be found. See JobConf(Class) or JobConf#setJar(String).
474775 [Thread-1268] INFO  org.apache.crunch.impl.mr.exec.CrunchJob  - Running job "org.apache.crunch.scrunch.WordCountTest:
Text(/tmp/junit8982345877659350182/shakes.txt)+S0+S1+Aggregate.count+GBK+combine+S2+[[Text(/tmp/junit8982345877659350182/output)]/[S3+Avro(/tmp/junit8982345877659350182/tmp-crunch.tmp.dir/crunch-199937570/p2)]]"
474775 [Thread-1268] INFO  org.apache.crunch.impl.mr.exec.CrunchJob  - Job status available
at: http://localhost:8080/
481423 [Thread-1268] WARN  org.apache.hadoop.mapred.JobClient  - Use GenericOptionsParser
for parsing the arguments. Applications should implement Tool for the same.
482107 [Thread-1268] WARN  org.apache.hadoop.mapred.JobClient  - No job jar file set.  User
classes may not be found. See JobConf(Class) or JobConf#setJar(String).
482138 [Thread-1268] INFO  org.apache.crunch.impl.mr.exec.CrunchJob  - Running job "org.apache.crunch.scrunch.WordCountTest:
Avro(/tmp/junit8982345877659350182/tmp-crunch.tmp.dir/crunch-199937570/p2)+GBK+combine+Avro(/tmp/junit8982345877659350182/tmp-crunch.tmp.dir/crunch-199937570/p1)"
482144 [Thread-1268] INFO  org.apache.crunch.impl.mr.exec.CrunchJob  - Job status available
at: http://localhost:8080/
Tests run: 1, Failures: 0, Errors: 0, Skipped: 0, Time elapsed: 16.286 sec
Running org.apache.crunch.scrunch.PCollectionTest
490180 [main] WARN  org.apache.crunch.scrunch.Pipeline  - Could not locate Scrunch jar file,
so could not add Scrunch jars to the job(s) about to be run.
490266 [main] WARN  org.apache.crunch.scrunch.Pipeline  - Could not locate Scrunch jar file,
so could not add Scrunch jars to the job(s) about to be run.
490328 [Thread-1318] WARN  org.apache.hadoop.mapred.JobClient  - Use GenericOptionsParser
for parsing the arguments. Applications should implement Tool for the same.
490726 [Thread-1318] WARN  org.apache.hadoop.mapred.JobClient  - No job jar file set.  User
classes may not be found. See JobConf(Class) or JobConf#setJar(String).
490747 [Thread-1318] INFO  org.apache.crunch.impl.mr.exec.CrunchJob  - Running job "org.apache.crunch.scrunch.PCollectionTest:
Text(/tmp/junit5966169298023106945/shakes.txt)+Aggregate.count+GBK+combine+PTables.values+SeqFile(/tmp/junit5966169298023106945/tmp-crunch.tmp.dir/crunch-943717992/p1)"
490747 [Thread-1318] INFO  org.apache.crunch.impl.mr.exec.CrunchJob  - Job status available
at: http://localhost:8080/
495389 [main] WARN  org.apache.crunch.scrunch.Pipeline  - Could not locate Scrunch jar file,
so could not add Scrunch jars to the job(s) about to be run.
495472 [Thread-1343] WARN  org.apache.hadoop.mapred.JobClient  - Use GenericOptionsParser
for parsing the arguments. Applications should implement Tool for the same.
496051 [Thread-1343] WARN  org.apache.hadoop.mapred.JobClient  - No job jar file set.  User
classes may not be found. See JobConf(Class) or JobConf#setJar(String).
496098 [Thread-1343] INFO  org.apache.crunch.impl.mr.exec.CrunchJob  - Running job "org.apache.crunch.scrunch.PCollectionTest:
Text(/tmp/junit6404697959108082088/shakes.txt)+sample(0.10)+Aggregate.count+GBK+combine+PTables.values+SeqFile(/tmp/junit6404697959108082088/tmp-crunch.tmp.dir/crunch-28355901/p1)"
496098 [Thread-1343] INFO  org.apache.crunch.impl.mr.exec.CrunchJob  - Job status available
at: http://localhost:8080/
503767 [main] WARN  org.apache.crunch.scrunch.Pipeline  - Could not locate Scrunch jar file,
so could not add Scrunch jars to the job(s) about to be run.
503816 [Thread-1368] WARN  org.apache.hadoop.mapred.JobClient  - Use GenericOptionsParser
for parsing the arguments. Applications should implement Tool for the same.
504695 [Thread-1368] WARN  org.apache.hadoop.mapred.JobClient  - No job jar file set.  User
classes may not be found. See JobConf(Class) or JobConf#setJar(String).
504750 [Thread-1368] INFO  org.apache.crunch.impl.mr.exec.CrunchJob  - Running job "org.apache.crunch.scrunch.PCollectionTest:
Text(/tmp/junit2150684026898251906/shakes.txt)+sample(0.10)+Aggregate.count+GBK+combine+PTables.values+SeqFile(/tmp/junit2150684026898251906/tmp-crunch.tmp.dir/crunch-221986290/p1)"
504750 [Thread-1368] INFO  org.apache.crunch.impl.mr.exec.CrunchJob  - Job status available
at: http://localhost:8080/
Tests run: 4, Failures: 0, Errors: 0, Skipped: 0, Time elapsed: 19.217 sec

Results :

Tests run: 31, Failures: 0, Errors: 0, Skipped: 0

[INFO] ------------------------------------------------------------------------
[INFO] Reactor Summary:
[INFO] 
[INFO] Apache Crunch ..................................... SUCCESS [51.873s]
[INFO] Apache Crunch Test ................................ SUCCESS [30.965s]
[INFO] Apache Crunch Core ................................ SUCCESS [23:14.705s]
[INFO] Apache Crunch HBase Support ....................... SUCCESS [3:20.269s]
[INFO] Apache Crunch Contrib ............................. SUCCESS [24.697s]
[INFO] Apache Crunch Examples ............................ SUCCESS [14.316s]
[INFO] Apache Crunch Archetype ........................... SUCCESS [18.200s]
[INFO] Apache Crunch for Scala ........................... FAILURE [9:45.699s]
[INFO] Apache Crunch Distribution ........................ SKIPPED
[INFO] ------------------------------------------------------------------------
[INFO] BUILD FAILURE
[INFO] ------------------------------------------------------------------------
[INFO] Total time: 38:47.142s
[INFO] Finished at: Fri Mar 15 07:46:33 UTC 2013
[INFO] Final Memory: 43M/214M
[INFO] ------------------------------------------------------------------------
[JENKINS] Archiving <https://builds.apache.org/job/Crunch-master-integration/ws/crunch-dist/pom.xml>
to /home/hudson/hudson/jobs/Crunch-master-integration/modules/org.apache.crunch$crunch-dist/builds/2013-03-15_07-07-28/archive/org.apache.crunch/crunch-dist/0.6.0-SNAPSHOT/crunch-dist-0.6.0-SNAPSHOT.pom
[JENKINS] Archiving <https://builds.apache.org/job/Crunch-master-integration/ws/crunch-hbase/pom.xml>
to /home/hudson/hudson/jobs/Crunch-master-integration/modules/org.apache.crunch$crunch-hbase/builds/2013-03-15_07-07-28/archive/org.apache.crunch/crunch-hbase/0.6.0-SNAPSHOT/crunch-hbase-0.6.0-SNAPSHOT.pom
[JENKINS] Archiving <https://builds.apache.org/job/Crunch-master-integration/ws/crunch-hbase/target/crunch-hbase-0.6.0-SNAPSHOT.jar>
to /home/hudson/hudson/jobs/Crunch-master-integration/modules/org.apache.crunch$crunch-hbase/builds/2013-03-15_07-07-28/archive/org.apache.crunch/crunch-hbase/0.6.0-SNAPSHOT/crunch-hbase-0.6.0-SNAPSHOT.jar
[JENKINS] Archiving <https://builds.apache.org/job/Crunch-master-integration/ws/crunch-scrunch/pom.xml>
to /home/hudson/hudson/jobs/Crunch-master-integration/modules/org.apache.crunch$crunch-scrunch/builds/2013-03-15_07-07-28/archive/org.apache.crunch/crunch-scrunch/0.6.0-SNAPSHOT/crunch-scrunch-0.6.0-SNAPSHOT.pom
[JENKINS] Archiving <https://builds.apache.org/job/Crunch-master-integration/ws/crunch-scrunch/target/crunch-scrunch-0.6.0-SNAPSHOT.jar>
to /home/hudson/hudson/jobs/Crunch-master-integration/modules/org.apache.crunch$crunch-scrunch/builds/2013-03-15_07-07-28/archive/org.apache.crunch/crunch-scrunch/0.6.0-SNAPSHOT/crunch-scrunch-0.6.0-SNAPSHOT.jar
[JENKINS] Archiving <https://builds.apache.org/job/Crunch-master-integration/ws/crunch/pom.xml>
to /home/hudson/hudson/jobs/Crunch-master-integration/modules/org.apache.crunch$crunch/builds/2013-03-15_07-07-28/archive/org.apache.crunch/crunch/0.6.0-SNAPSHOT/crunch-0.6.0-SNAPSHOT.pom
[JENKINS] Archiving <https://builds.apache.org/job/Crunch-master-integration/ws/crunch/target/crunch-0.6.0-SNAPSHOT.jar>
to /home/hudson/hudson/jobs/Crunch-master-integration/modules/org.apache.crunch$crunch/builds/2013-03-15_07-07-28/archive/org.apache.crunch/crunch/0.6.0-SNAPSHOT/crunch-0.6.0-SNAPSHOT.jar
[JENKINS] Archiving <https://builds.apache.org/job/Crunch-master-integration/ws/crunch-contrib/pom.xml>
to /home/hudson/hudson/jobs/Crunch-master-integration/modules/org.apache.crunch$crunch-contrib/builds/2013-03-15_07-07-28/archive/org.apache.crunch/crunch-contrib/0.6.0-SNAPSHOT/crunch-contrib-0.6.0-SNAPSHOT.pom
[JENKINS] Archiving <https://builds.apache.org/job/Crunch-master-integration/ws/crunch-contrib/target/crunch-contrib-0.6.0-SNAPSHOT.jar>
to /home/hudson/hudson/jobs/Crunch-master-integration/modules/org.apache.crunch$crunch-contrib/builds/2013-03-15_07-07-28/archive/org.apache.crunch/crunch-contrib/0.6.0-SNAPSHOT/crunch-contrib-0.6.0-SNAPSHOT.jar
[JENKINS] Archiving <https://builds.apache.org/job/Crunch-master-integration/ws/crunch-archetype/pom.xml>
to /home/hudson/hudson/jobs/Crunch-master-integration/modules/org.apache.crunch$crunch-archetype/builds/2013-03-15_07-07-28/archive/org.apache.crunch/crunch-archetype/0.6.0-SNAPSHOT/crunch-archetype-0.6.0-SNAPSHOT.pom
[JENKINS] Archiving <https://builds.apache.org/job/Crunch-master-integration/ws/crunch-archetype/target/crunch-archetype-0.6.0-SNAPSHOT.jar>
to /home/hudson/hudson/jobs/Crunch-master-integration/modules/org.apache.crunch$crunch-archetype/builds/2013-03-15_07-07-28/archive/org.apache.crunch/crunch-archetype/0.6.0-SNAPSHOT/crunch-archetype-0.6.0-SNAPSHOT.jar
[JENKINS] Archiving <https://builds.apache.org/job/Crunch-master-integration/ws/pom.xml>
to /home/hudson/hudson/jobs/Crunch-master-integration/modules/org.apache.crunch$crunch-parent/builds/2013-03-15_07-07-28/archive/org.apache.crunch/crunch-parent/0.6.0-SNAPSHOT/crunch-parent-0.6.0-SNAPSHOT.pom
[JENKINS] Archiving <https://builds.apache.org/job/Crunch-master-integration/ws/target/crunch-parent-0.6.0-SNAPSHOT-site.xml>
to /home/hudson/hudson/jobs/Crunch-master-integration/modules/org.apache.crunch$crunch-parent/builds/2013-03-15_07-07-28/archive/org.apache.crunch/crunch-parent/0.6.0-SNAPSHOT/crunch-parent-0.6.0-SNAPSHOT-site.xml
[JENKINS] Archiving <https://builds.apache.org/job/Crunch-master-integration/ws/crunch-examples/pom.xml>
to /home/hudson/hudson/jobs/Crunch-master-integration/modules/org.apache.crunch$crunch-examples/builds/2013-03-15_07-07-28/archive/org.apache.crunch/crunch-examples/0.6.0-SNAPSHOT/crunch-examples-0.6.0-SNAPSHOT.pom
[JENKINS] Archiving <https://builds.apache.org/job/Crunch-master-integration/ws/crunch-examples/target/crunch-examples-0.6.0-SNAPSHOT.jar>
to /home/hudson/hudson/jobs/Crunch-master-integration/modules/org.apache.crunch$crunch-examples/builds/2013-03-15_07-07-28/archive/org.apache.crunch/crunch-examples/0.6.0-SNAPSHOT/crunch-examples-0.6.0-SNAPSHOT.jar
[JENKINS] Archiving <https://builds.apache.org/job/Crunch-master-integration/ws/crunch-examples/target/crunch-examples-0.6.0-SNAPSHOT-job.jar>
to /home/hudson/hudson/jobs/Crunch-master-integration/modules/org.apache.crunch$crunch-examples/builds/2013-03-15_07-07-28/archive/org.apache.crunch/crunch-examples/0.6.0-SNAPSHOT/crunch-examples-0.6.0-SNAPSHOT-job.jar
[JENKINS] Archiving <https://builds.apache.org/job/Crunch-master-integration/ws/crunch-test/pom.xml>
to /home/hudson/hudson/jobs/Crunch-master-integration/modules/org.apache.crunch$crunch-test/builds/2013-03-15_07-07-28/archive/org.apache.crunch/crunch-test/0.6.0-SNAPSHOT/crunch-test-0.6.0-SNAPSHOT.pom
[JENKINS] Archiving <https://builds.apache.org/job/Crunch-master-integration/ws/crunch-test/target/crunch-test-0.6.0-SNAPSHOT.jar>
to /home/hudson/hudson/jobs/Crunch-master-integration/modules/org.apache.crunch$crunch-test/builds/2013-03-15_07-07-28/archive/org.apache.crunch/crunch-test/0.6.0-SNAPSHOT/crunch-test-0.6.0-SNAPSHOT.jar
Waiting for Jenkins to finish collecting data
mavenExecutionResult exceptions not empty
message : Internal error: java.lang.reflect.UndeclaredThrowableException
cause : null
Stack trace : 
org.apache.maven.InternalErrorException: Internal error: java.lang.reflect.UndeclaredThrowableException
	at org.apache.maven.lifecycle.internal.BuilderCommon.handleBuildError(BuilderCommon.java:128)
	at org.apache.maven.lifecycle.internal.LifecycleModuleBuilder.buildProject(LifecycleModuleBuilder.java:95)
	at org.apache.maven.lifecycle.internal.LifecycleModuleBuilder.buildProject(LifecycleModuleBuilder.java:59)
	at org.apache.maven.lifecycle.internal.LifecycleStarter.singleThreadedBuild(LifecycleStarter.java:183)
	at org.apache.maven.lifecycle.internal.LifecycleStarter.execute(LifecycleStarter.java:161)
	at org.apache.maven.DefaultMaven.doExecute(DefaultMaven.java:320)
	at org.apache.maven.DefaultMaven.execute(DefaultMaven.java:156)
	at org.jvnet.hudson.maven3.launcher.Maven3Launcher.main(Maven3Launcher.java:79)
	at sun.reflect.NativeMethodAccessorImpl.invoke0(Native Method)
	at sun.reflect.NativeMethodAccessorImpl.invoke(NativeMethodAccessorImpl.java:39)
	at sun.reflect.DelegatingMethodAccessorImpl.invoke(DelegatingMethodAccessorImpl.java:25)
	at java.lang.reflect.Method.invoke(Method.java:597)
	at org.codehaus.plexus.classworlds.launcher.Launcher.launchStandard(Launcher.java:329)
	at org.codehaus.plexus.classworlds.launcher.Launcher.launch(Launcher.java:239)
	at org.jvnet.hudson.maven3.agent.Maven3Main.launch(Maven3Main.java:158)
	at hudson.maven.Maven3Builder.call(Maven3Builder.java:100)
	at hudson.maven.Maven3Builder.call(Maven3Builder.java:66)
	at hudson.remoting.UserRequest.perform(UserRequest.java:118)
	at hudson.remoting.UserRequest.perform(UserRequest.java:48)
	at hudson.remoting.Request$2.run(Request.java:326)
	at hudson.remoting.InterceptingExecutorService$1.call(InterceptingExecutorService.java:72)
	at java.util.concurrent.FutureTask$Sync.innerRun(FutureTask.java:303)
	at java.util.concurrent.FutureTask.run(FutureTask.java:138)
	at java.util.concurrent.ThreadPoolExecutor$Worker.runTask(ThreadPoolExecutor.java:886)
	at java.util.concurrent.ThreadPoolExecutor$Worker.run(ThreadPoolExecutor.java:908)
	at java.lang.Thread.run(Thread.java:662)
Caused by: java.lang.reflect.UndeclaredThrowableException
	at $Proxy2.setExecutedMojos(Unknown Source)
	at hudson.maven.MavenBuildProxy$Filter.setExecutedMojos(MavenBuildProxy.java:243)
	at hudson.maven.Maven3Builder$MavenExecutionListener.recordMojoEnded(Maven3Builder.java:439)
	at hudson.maven.Maven3Builder$MavenExecutionListener.mojoSucceeded(Maven3Builder.java:425)
	at org.apache.maven.lifecycle.internal.DefaultExecutionEventCatapult.fire(DefaultExecutionEventCatapult.java:87)
	at org.apache.maven.lifecycle.internal.DefaultExecutionEventCatapult.fire(DefaultExecutionEventCatapult.java:42)
	at org.apache.maven.lifecycle.internal.MojoExecutor.execute(MojoExecutor.java:228)
	at org.apache.maven.lifecycle.internal.MojoExecutor.execute(MojoExecutor.java:153)
	at org.apache.maven.lifecycle.internal.MojoExecutor.execute(MojoExecutor.java:145)
	at org.apache.maven.lifecycle.internal.LifecycleModuleBuilder.buildProject(LifecycleModuleBuilder.java:84)
	... 24 more
Caused by: java.io.StreamCorruptedException: invalid handle value: 000B0000
	at java.io.ObjectInputStream.readHandle(ObjectInputStream.java:1451)
	at java.io.ObjectInputStream.readClassDesc(ObjectInputStream.java:1508)
	at java.io.ObjectInputStream.readOrdinaryObject(ObjectInputStream.java:1750)
	at java.io.ObjectInputStream.readObject0(ObjectInputStream.java:1347)
	at java.io.ObjectInputStream.readObject(ObjectInputStream.java:369)
	at java.util.concurrent.CopyOnWriteArrayList.readObject(CopyOnWriteArrayList.java:879)
	at sun.reflect.GeneratedMethodAccessor10547.invoke(Unknown Source)
	at sun.reflect.DelegatingMethodAccessorImpl.invoke(DelegatingMethodAccessorImpl.java:43)
	at java.lang.reflect.Method.invoke(Method.java:601)
	at java.io.ObjectStreamClass.invokeReadObject(ObjectStreamClass.java:1004)
	at java.io.ObjectInputStream.readSerialData(ObjectInputStream.java:1872)
	at java.io.ObjectInputStream.readOrdinaryObject(ObjectInputStream.java:1777)
	at java.io.ObjectInputStream.readObject0(ObjectInputStream.java:1347)
	at java.io.ObjectInputStream.readArray(ObjectInputStream.java:1685)
	at java.io.ObjectInputStream.readObject0(ObjectInputStream.java:1341)
	at java.io.ObjectInputStream.defaultReadFields(ObjectInputStream.java:1970)
	at java.io.ObjectInputStream.readSerialData(ObjectInputStream.java:1894)
	at java.io.ObjectInputStream.readOrdinaryObject(ObjectInputStream.java:1777)
	at java.io.ObjectInputStream.readObject0(ObjectInputStream.java:1347)
	at java.io.ObjectInputStream.readObject(ObjectInputStream.java:369)
	at hudson.remoting.UserRequest.deserialize(UserRequest.java:182)
	at hudson.remoting.UserRequest.perform(UserRequest.java:98)
	at hudson.remoting.UserRequest.perform(UserRequest.java:48)
	at hudson.remoting.Request$2.run(Request.java:326)
	at hudson.remoting.InterceptingExecutorService$1.call(InterceptingExecutorService.java:72)
	at java.util.concurrent.FutureTask$Sync.innerRun(FutureTask.java:334)
	at java.util.concurrent.FutureTask.run(FutureTask.java:166)
	at java.util.concurrent.ThreadPoolExecutor.runWorker(ThreadPoolExecutor.java:1145)
	at java.util.concurrent.ThreadPoolExecutor$Worker.run(ThreadPoolExecutor.java:615)
	at java.lang.Thread.run(Thread.java:722)
channel stopped
[locks-and-latches] Releasing all the locks
[locks-and-latches] All the locks released

Mime
View raw message