crunch-dev mailing list archives

Site index · List index
Message view « Date » · « Thread »
Top « Date » · « Thread »
From Apache Jenkins Server <jenk...@builds.apache.org>
Subject Build failed in Jenkins: Crunch-master-integration #40
Date Sun, 09 Sep 2012 00:27:00 GMT
See <https://builds.apache.org/job/Crunch-master-integration/40/>

------------------------------------------
[...truncated 1192 lines...]
900997 [Thread-2685] INFO  org.apache.crunch.impl.mr.exec.CrunchJob  - Job status available
at: http://localhost:8080/
907966 [main] INFO  org.apache.crunch.impl.mr.collect.UnionCollectionIT  - Saved Union: [a,
a, b, c, c, d, e]
907973 [Thread-2695] WARN  org.apache.hadoop.mapred.JobClient  - Use GenericOptionsParser
for parsing the arguments. Applications should implement Tool for the same.
907989 [Thread-2695] WARN  org.apache.hadoop.mapred.JobClient  - No job jar file set.  User
classes may not be found. See JobConf(Class) or JobConf#setJar(String).
908005 [Thread-2695] INFO  org.apache.crunch.impl.mr.exec.CrunchJob  - Running job "org.apache.crunch.PTableKeyValueIT:
Text(/tmp/junit2427336617493142961/output3)+SeqFile(/tmp/junit2427336617493142961/tmp-crunch.tmp.dir/crunch-1557708608/p12)"
908005 [Thread-2695] INFO  org.apache.crunch.impl.mr.exec.CrunchJob  - Job status available
at: http://localhost:8080/
914974 [main] INFO  org.apache.crunch.impl.mr.collect.UnionCollectionIT  - Saved Union: [a,
a, b, c, c, d, e]
914983 [main] INFO  org.apache.crunch.impl.mr.collect.UnionCollectionIT  - Test fixture: [MemPipeline
: WritableTypeFamily]  First: [b, c, a, e], Second: [c, d, a]
914983 [main] INFO  org.apache.crunch.impl.mr.collect.UnionCollectionIT  - Materialized union:
[a, a, b, c, c, d, e]
914983 [main] INFO  org.apache.crunch.impl.mr.collect.UnionCollectionIT  - Materialized union:
[a, a, b, c, c, d, e]
914985 [main] INFO  org.apache.crunch.impl.mr.collect.UnionCollectionIT  - Test fixture: [MemPipeline
: WritableTypeFamily]  First: [b, c, a, e], Second: [c, d, a]
914986 [main] INFO  org.apache.crunch.impl.mr.collect.UnionCollectionIT  - Saved Union: [a,
a, b, c, c, d, e]
914987 [main] INFO  org.apache.crunch.impl.mr.collect.UnionCollectionIT  - Saved Union: [a,
a, b, c, c, d, e]
914987 [main] INFO  org.apache.crunch.impl.mr.collect.UnionCollectionIT  - Saved Union: [a,
a, b, c, c, d, e]
915000 [Thread-2705] WARN  org.apache.hadoop.mapred.JobClient  - Use GenericOptionsParser
for parsing the arguments. Applications should implement Tool for the same.
915016 [Thread-2705] WARN  org.apache.hadoop.mapred.JobClient  - No job jar file set.  User
classes may not be found. See JobConf(Class) or JobConf#setJar(String).
915032 [Thread-2705] INFO  org.apache.crunch.impl.mr.exec.CrunchJob  - Running job "org.apache.crunch.PTableKeyValueIT:
Text(/tmp/junit2135865035088521923/set1.txt)+Avro(/tmp/junit2135865035088521923/tmp-crunch.tmp.dir/crunch-2015081935/p1)"
915032 [Thread-2705] INFO  org.apache.crunch.impl.mr.exec.CrunchJob  - Job status available
at: http://localhost:8080/
919007 [Thread-2715] WARN  org.apache.hadoop.mapred.JobClient  - Use GenericOptionsParser
for parsing the arguments. Applications should implement Tool for the same.
919022 [Thread-2715] WARN  org.apache.hadoop.mapred.JobClient  - No job jar file set.  User
classes may not be found. See JobConf(Class) or JobConf#setJar(String).
919037 [Thread-2715] INFO  org.apache.crunch.impl.mr.exec.CrunchJob  - Running job "org.apache.crunch.PTableKeyValueIT:
Text(/tmp/junit2135865035088521923/set2.txt)+Avro(/tmp/junit2135865035088521923/tmp-crunch.tmp.dir/crunch-2015081935/p3)"
919038 [Thread-2715] INFO  org.apache.crunch.impl.mr.exec.CrunchJob  - Job status available
at: http://localhost:8080/
923007 [main] INFO  org.apache.crunch.impl.mr.collect.UnionCollectionIT  - Test fixture: [MRPipeline
: AvroTypeFamily]  First: [b, c, a, e], Second: [c, d, a]
923015 [Thread-2725] WARN  org.apache.hadoop.mapred.JobClient  - Use GenericOptionsParser
for parsing the arguments. Applications should implement Tool for the same.
923031 [Thread-2725] WARN  org.apache.hadoop.mapred.JobClient  - No job jar file set.  User
classes may not be found. See JobConf(Class) or JobConf#setJar(String).
923047 [Thread-2725] INFO  org.apache.crunch.impl.mr.exec.CrunchJob  - Running job "org.apache.crunch.PTableKeyValueIT:
[[Avro(/tmp/junit2135865035088521923/tmp-crunch.tmp.dir/crunch-2015081935/p3)+UnionCollectionWrapper+Avro(/tmp/junit2135865035088521923/tmp-crunch.tmp.dir/crunch-2015081935/p5)]/[Avro(/tmp/junit2135865035088521923/tmp-crunch.tmp.dir/crunch-2015081935/p1)+UnionCollectionWrapper+Avro(/tmp/junit2135865035088521923/tmp-crunch.tmp.dir/crunch-2015081935/p5)]]"
923048 [Thread-2725] INFO  org.apache.crunch.impl.mr.exec.CrunchJob  - Job status available
at: http://localhost:8080/
930016 [main] INFO  org.apache.crunch.impl.mr.collect.UnionCollectionIT  - Materialized union:
[a, a, b, c, c, d, e]
930024 [Thread-2735] WARN  org.apache.hadoop.mapred.JobClient  - Use GenericOptionsParser
for parsing the arguments. Applications should implement Tool for the same.
930040 [Thread-2735] WARN  org.apache.hadoop.mapred.JobClient  - No job jar file set.  User
classes may not be found. See JobConf(Class) or JobConf#setJar(String).
930057 [Thread-2735] INFO  org.apache.crunch.impl.mr.exec.CrunchJob  - Running job "org.apache.crunch.PTableKeyValueIT:
[[Avro(/tmp/junit2135865035088521923/tmp-crunch.tmp.dir/crunch-2015081935/p3)+UnionCollectionWrapper+Avro(/tmp/junit2135865035088521923/tmp-crunch.tmp.dir/crunch-2015081935/p7)]/[Avro(/tmp/junit2135865035088521923/tmp-crunch.tmp.dir/crunch-2015081935/p1)+UnionCollectionWrapper+Avro(/tmp/junit2135865035088521923/tmp-crunch.tmp.dir/crunch-2015081935/p7)]]"
930057 [Thread-2735] INFO  org.apache.crunch.impl.mr.exec.CrunchJob  - Job status available
at: http://localhost:8080/
937025 [main] INFO  org.apache.crunch.impl.mr.collect.UnionCollectionIT  - Materialized union:
[a, a, b, c, c, d, e]
937041 [Thread-2745] WARN  org.apache.hadoop.mapred.JobClient  - Use GenericOptionsParser
for parsing the arguments. Applications should implement Tool for the same.
937057 [Thread-2745] WARN  org.apache.hadoop.mapred.JobClient  - No job jar file set.  User
classes may not be found. See JobConf(Class) or JobConf#setJar(String).
937072 [Thread-2745] INFO  org.apache.crunch.impl.mr.exec.CrunchJob  - Running job "org.apache.crunch.PTableKeyValueIT:
Text(/tmp/junit2984862775661204801/set1.txt)+Avro(/tmp/junit2984862775661204801/tmp-crunch.tmp.dir/crunch-1045946758/p1)"
937072 [Thread-2745] INFO  org.apache.crunch.impl.mr.exec.CrunchJob  - Job status available
at: http://localhost:8080/
941048 [Thread-2755] WARN  org.apache.hadoop.mapred.JobClient  - Use GenericOptionsParser
for parsing the arguments. Applications should implement Tool for the same.
941063 [Thread-2755] WARN  org.apache.hadoop.mapred.JobClient  - No job jar file set.  User
classes may not be found. See JobConf(Class) or JobConf#setJar(String).
941079 [Thread-2755] INFO  org.apache.crunch.impl.mr.exec.CrunchJob  - Running job "org.apache.crunch.PTableKeyValueIT:
Text(/tmp/junit2984862775661204801/set2.txt)+Avro(/tmp/junit2984862775661204801/tmp-crunch.tmp.dir/crunch-1045946758/p3)"
941079 [Thread-2755] INFO  org.apache.crunch.impl.mr.exec.CrunchJob  - Job status available
at: http://localhost:8080/
945048 [main] INFO  org.apache.crunch.impl.mr.collect.UnionCollectionIT  - Test fixture: [MRPipeline
: AvroTypeFamily]  First: [b, c, a, e], Second: [c, d, a]
945058 [Thread-2765] WARN  org.apache.hadoop.mapred.JobClient  - Use GenericOptionsParser
for parsing the arguments. Applications should implement Tool for the same.
945073 [Thread-2765] WARN  org.apache.hadoop.mapred.JobClient  - No job jar file set.  User
classes may not be found. See JobConf(Class) or JobConf#setJar(String).
945090 [Thread-2765] INFO  org.apache.crunch.impl.mr.exec.CrunchJob  - Running job "org.apache.crunch.PTableKeyValueIT:
[[Avro(/tmp/junit2984862775661204801/tmp-crunch.tmp.dir/crunch-1045946758/p1)+UnionCollectionWrapper+Avro(/tmp/junit2984862775661204801/output2)]/[Avro(/tmp/junit2984862775661204801/tmp-crunch.tmp.dir/crunch-1045946758/p3)+UnionCollectionWrapper+Avro(/tmp/junit2984862775661204801/output2)]]"
945090 [Thread-2765] INFO  org.apache.crunch.impl.mr.exec.CrunchJob  - Job status available
at: http://localhost:8080/
945091 [Thread-2765] WARN  org.apache.hadoop.mapred.JobClient  - Use GenericOptionsParser
for parsing the arguments. Applications should implement Tool for the same.
945107 [Thread-2765] WARN  org.apache.hadoop.mapred.JobClient  - No job jar file set.  User
classes may not be found. See JobConf(Class) or JobConf#setJar(String).
945125 [Thread-2765] INFO  org.apache.crunch.impl.mr.exec.CrunchJob  - Running job "org.apache.crunch.PTableKeyValueIT:
[[Avro(/tmp/junit2984862775661204801/tmp-crunch.tmp.dir/crunch-1045946758/p1)+UnionCollectionWrapper+Avro(/tmp/junit2984862775661204801/output1)]/[Avro(/tmp/junit2984862775661204801/tmp-crunch.tmp.dir/crunch-1045946758/p3)+UnionCollectionWrapper+Avro(/tmp/junit2984862775661204801/output1)]]"
945125 [Thread-2765] INFO  org.apache.crunch.impl.mr.exec.CrunchJob  - Job status available
at: http://localhost:8080/
952064 [Thread-2784] WARN  org.apache.hadoop.mapred.JobClient  - Use GenericOptionsParser
for parsing the arguments. Applications should implement Tool for the same.
952082 [Thread-2784] WARN  org.apache.hadoop.mapred.JobClient  - No job jar file set.  User
classes may not be found. See JobConf(Class) or JobConf#setJar(String).
952098 [Thread-2784] INFO  org.apache.crunch.impl.mr.exec.CrunchJob  - Running job "org.apache.crunch.PTableKeyValueIT:
Avro(/tmp/junit2984862775661204801/output1)+Avro(/tmp/junit2984862775661204801/tmp-crunch.tmp.dir/crunch-1045946758/p7)"
952098 [Thread-2784] INFO  org.apache.crunch.impl.mr.exec.CrunchJob  - Job status available
at: http://localhost:8080/
959065 [main] INFO  org.apache.crunch.impl.mr.collect.UnionCollectionIT  - Saved Union: [a,
a, b, c, c, d, e]
959073 [Thread-2794] WARN  org.apache.hadoop.mapred.JobClient  - Use GenericOptionsParser
for parsing the arguments. Applications should implement Tool for the same.
959089 [Thread-2794] WARN  org.apache.hadoop.mapred.JobClient  - No job jar file set.  User
classes may not be found. See JobConf(Class) or JobConf#setJar(String).
959105 [Thread-2794] INFO  org.apache.crunch.impl.mr.exec.CrunchJob  - Running job "org.apache.crunch.PTableKeyValueIT:
Avro(/tmp/junit2984862775661204801/output2)+Avro(/tmp/junit2984862775661204801/tmp-crunch.tmp.dir/crunch-1045946758/p9)"
959105 [Thread-2794] INFO  org.apache.crunch.impl.mr.exec.CrunchJob  - Job status available
at: http://localhost:8080/
966074 [main] INFO  org.apache.crunch.impl.mr.collect.UnionCollectionIT  - Saved Union: [a,
a, b, c, c, d, e]
966081 [main] INFO  org.apache.crunch.impl.mr.collect.UnionCollectionIT  - Test fixture: [MemPipeline
: AvroTypeFamily]  First: [b, c, a, e], Second: [c, d, a]
966081 [main] INFO  org.apache.crunch.impl.mr.collect.UnionCollectionIT  - Materialized union:
[a, a, b, c, c, d, e]
966081 [main] INFO  org.apache.crunch.impl.mr.collect.UnionCollectionIT  - Materialized union:
[a, a, b, c, c, d, e]
966082 [main] INFO  org.apache.crunch.impl.mr.collect.UnionCollectionIT  - Test fixture: [MemPipeline
: AvroTypeFamily]  First: [b, c, a, e], Second: [c, d, a]
966084 [main] INFO  org.apache.crunch.impl.mr.collect.UnionCollectionIT  - Saved Union: [a,
a, b, c, c, d, e]
966084 [main] INFO  org.apache.crunch.impl.mr.collect.UnionCollectionIT  - Saved Union: [a,
a, b, c, c, d, e]
Tests run: 8, Failures: 0, Errors: 0, Skipped: 0, Time elapsed: 109.217 sec
Running org.apache.crunch.TfIdfIT
966098 [main] INFO  org.apache.crunch.impl.mr.collect.PGroupedTableImpl  - Setting num reduce
tasks to 1
966102 [main] INFO  org.apache.crunch.impl.mr.collect.PGroupedTableImpl  - Setting num reduce
tasks to 1
966106 [main] INFO  org.apache.crunch.impl.mr.collect.PGroupedTableImpl  - Setting num reduce
tasks to 1
966110 [Thread-2804] WARN  org.apache.hadoop.mapred.JobClient  - Use GenericOptionsParser
for parsing the arguments. Applications should implement Tool for the same.
966153 [Thread-2804] WARN  org.apache.hadoop.mapred.JobClient  - No job jar file set.  User
classes may not be found. See JobConf(Class) or JobConf#setJar(String).
966175 [Thread-2804] INFO  org.apache.crunch.impl.mr.exec.CrunchJob  - Running job "org.apache.crunch.TfIdfIT:
Text(/tmp/junit7447197738176980516/docs.txt)+term document frequency+Aggregate.count+GBK+combine+SeqFile(/tmp/junit7447197738176980516/termfreq)"
966175 [Thread-2804] INFO  org.apache.crunch.impl.mr.exec.CrunchJob  - Job status available
at: http://localhost:8080/
972678 [Thread-2804] WARN  org.apache.hadoop.mapred.JobClient  - Use GenericOptionsParser
for parsing the arguments. Applications should implement Tool for the same.
972723 [Thread-2804] WARN  org.apache.hadoop.mapred.JobClient  - No job jar file set.  User
classes may not be found. See JobConf(Class) or JobConf#setJar(String).
972745 [Thread-2804] INFO  org.apache.crunch.impl.mr.exec.CrunchJob  - Running job "org.apache.crunch.TfIdfIT:
SeqFile(/tmp/junit7447197738176980516/termfreq)+little n (# of docs contain word)+Aggregate.count+GBK+combine+joinTagLeft+SeqFile(/tmp/junit7447197738176980516/tmp-crunch.tmp.dir/crunch-245624413/p3)"
972745 [Thread-2804] INFO  org.apache.crunch.impl.mr.exec.CrunchJob  - Job status available
at: http://localhost:8080/
979248 [Thread-2804] WARN  org.apache.hadoop.mapred.JobClient  - Use GenericOptionsParser
for parsing the arguments. Applications should implement Tool for the same.
979353 [Thread-2804] WARN  org.apache.hadoop.mapred.JobClient  - No job jar file set.  User
classes may not be found. See JobConf(Class) or JobConf#setJar(String).
979373 [Thread-2804] INFO  org.apache.crunch.impl.mr.exec.CrunchJob  - Running job "org.apache.crunch.TfIdfIT:
[[SeqFile(/tmp/junit7447197738176980516/termfreq)+transform wordDocumentPairCount+joinTagRight]/[SeqFile(/tmp/junit7447197738176980516/tmp-crunch.tmp.dir/crunch-245624413/p3)]]+GBK+innerJoinGBK+calculate
tfidf+[[S0+asText+Text(/tmp/junit7447197738176980516/output2)]/[asText+Text(/tmp/junit7447197738176980516/output1)]]"
979373 [Thread-2804] INFO  org.apache.crunch.impl.mr.exec.CrunchJob  - Job status available
at: http://localhost:8080/
989129 [main] INFO  org.apache.crunch.impl.mr.collect.PGroupedTableImpl  - Setting num reduce
tasks to 1
989132 [main] INFO  org.apache.crunch.impl.mr.collect.PGroupedTableImpl  - Setting num reduce
tasks to 1
989134 [main] INFO  org.apache.crunch.impl.mr.collect.PGroupedTableImpl  - Setting num reduce
tasks to 1
989137 [Thread-2871] WARN  org.apache.hadoop.mapred.JobClient  - Use GenericOptionsParser
for parsing the arguments. Applications should implement Tool for the same.
989181 [Thread-2871] WARN  org.apache.hadoop.mapred.JobClient  - No job jar file set.  User
classes may not be found. See JobConf(Class) or JobConf#setJar(String).
989203 [Thread-2871] INFO  org.apache.crunch.impl.mr.exec.CrunchJob  - Running job "org.apache.crunch.TfIdfIT:
Text(/tmp/junit22262432611179596/docs.txt)+term document frequency+Aggregate.count+GBK+combine+SeqFile(/tmp/junit22262432611179596/termfreq)"
989203 [Thread-2871] INFO  org.apache.crunch.impl.mr.exec.CrunchJob  - Job status available
at: http://localhost:8080/
995706 [Thread-2871] WARN  org.apache.hadoop.mapred.JobClient  - Use GenericOptionsParser
for parsing the arguments. Applications should implement Tool for the same.
995749 [Thread-2871] WARN  org.apache.hadoop.mapred.JobClient  - No job jar file set.  User
classes may not be found. See JobConf(Class) or JobConf#setJar(String).
995774 [Thread-2871] INFO  org.apache.crunch.impl.mr.exec.CrunchJob  - Running job "org.apache.crunch.TfIdfIT:
SeqFile(/tmp/junit22262432611179596/termfreq)+little n (# of docs contain word)+Aggregate.count+GBK+combine+joinTagLeft+SeqFile(/tmp/junit22262432611179596/tmp-crunch.tmp.dir/crunch-1105832493/p3)"
995775 [Thread-2871] INFO  org.apache.crunch.impl.mr.exec.CrunchJob  - Job status available
at: http://localhost:8080/
1002278 [Thread-2871] WARN  org.apache.hadoop.mapred.JobClient  - Use GenericOptionsParser
for parsing the arguments. Applications should implement Tool for the same.
1002308 [Thread-2871] WARN  org.apache.hadoop.mapred.JobClient  - No job jar file set.  User
classes may not be found. See JobConf(Class) or JobConf#setJar(String).
1002327 [Thread-2871] INFO  org.apache.crunch.impl.mr.exec.CrunchJob  - Running job "org.apache.crunch.TfIdfIT:
[[SeqFile(/tmp/junit22262432611179596/termfreq)+transform wordDocumentPairCount+joinTagRight]/[SeqFile(/tmp/junit22262432611179596/tmp-crunch.tmp.dir/crunch-1105832493/p3)]]+GBK+innerJoinGBK+calculate
tfidf+asText+Text(/tmp/junit22262432611179596/output1)"
1002328 [Thread-2871] INFO  org.apache.crunch.impl.mr.exec.CrunchJob  - Job status available
at: http://localhost:8080/
1012144 [main] INFO  org.apache.crunch.impl.mr.collect.PGroupedTableImpl  - Setting num reduce
tasks to 1
1012147 [Thread-2938] WARN  org.apache.hadoop.mapred.JobClient  - Use GenericOptionsParser
for parsing the arguments. Applications should implement Tool for the same.
1012240 [Thread-2938] WARN  org.apache.hadoop.mapred.JobClient  - No job jar file set.  User
classes may not be found. See JobConf(Class) or JobConf#setJar(String).
1012259 [Thread-2938] INFO  org.apache.crunch.impl.mr.exec.CrunchJob  - Running job "org.apache.crunch.TfIdfIT:
[[SeqFile(/tmp/junit22262432611179596/termfreq)+transform wordDocumentPairCount+joinTagRight]/[SeqFile(/tmp/junit22262432611179596/tmp-crunch.tmp.dir/crunch-1105832493/p3)]]+GBK+innerJoinGBK+calculate
tfidf+S0+asText+Text(/tmp/junit22262432611179596/output2)"
1012260 [Thread-2938] INFO  org.apache.crunch.impl.mr.exec.CrunchJob  - Job status available
at: http://localhost:8080/
Tests run: 2, Failures: 0, Errors: 0, Skipped: 0, Time elapsed: 56.069 sec
Running org.apache.crunch.MapsIT
1022169 [main] INFO  org.apache.crunch.impl.mr.collect.PGroupedTableImpl  - Setting num reduce
tasks to 1
1022172 [Thread-2957] WARN  org.apache.hadoop.mapred.JobClient  - Use GenericOptionsParser
for parsing the arguments. Applications should implement Tool for the same.
1022215 [Thread-2957] WARN  org.apache.hadoop.mapred.JobClient  - No job jar file set.  User
classes may not be found. See JobConf(Class) or JobConf#setJar(String).
1022237 [Thread-2957] INFO  org.apache.crunch.impl.mr.exec.CrunchJob  - Running job "org.apache.crunch.MapsIT:
Text(/tmp/junit652603207468021605/shakes.txt)+S0+GBK+combine+SeqFile(/tmp/junit652603207468021605/tmp-crunch.tmp.dir/crunch-1069759469/p1)"
1022237 [Thread-2957] INFO  org.apache.crunch.impl.mr.exec.CrunchJob  - Job status available
at: http://localhost:8080/
1029189 [main] INFO  org.apache.crunch.impl.mr.collect.PGroupedTableImpl  - Setting num reduce
tasks to 1
1029192 [Thread-2982] WARN  org.apache.hadoop.mapred.JobClient  - Use GenericOptionsParser
for parsing the arguments. Applications should implement Tool for the same.
1029237 [Thread-2982] WARN  org.apache.hadoop.mapred.JobClient  - No job jar file set.  User
classes may not be found. See JobConf(Class) or JobConf#setJar(String).
1029259 [Thread-2982] INFO  org.apache.crunch.impl.mr.exec.CrunchJob  - Running job "org.apache.crunch.MapsIT:
Text(/tmp/junit6077083556174389526/shakes.txt)+S0+GBK+combine+Avro(/tmp/junit6077083556174389526/tmp-crunch.tmp.dir/crunch-2117152405/p1)"
1029259 [Thread-2982] INFO  org.apache.crunch.impl.mr.exec.CrunchJob  - Job status available
at: http://localhost:8080/
Tests run: 2, Failures: 0, Errors: 0, Skipped: 0, Time elapsed: 14.041 sec
Running org.apache.crunch.TermFrequencyIT
1036208 [main] INFO  org.apache.crunch.impl.mr.collect.PGroupedTableImpl  - Setting num reduce
tasks to 1
1036212 [Thread-3007] WARN  org.apache.hadoop.mapred.JobClient  - Use GenericOptionsParser
for parsing the arguments. Applications should implement Tool for the same.
1036257 [Thread-3007] WARN  org.apache.hadoop.mapred.JobClient  - No job jar file set.  User
classes may not be found. See JobConf(Class) or JobConf#setJar(String).
1036279 [Thread-3007] INFO  org.apache.crunch.impl.mr.exec.CrunchJob  - Running job "org.apache.crunch.TermFrequencyIT:
Text(/tmp/junit785602497791483691/docs.txt)+term document frequency+Aggregate.count+GBK+combine+Text(/tmp/junit785602497791483691/tf-output)"
1036279 [Thread-3007] INFO  org.apache.crunch.impl.mr.exec.CrunchJob  - Job status available
at: http://localhost:8080/
1043231 [main] INFO  org.apache.crunch.impl.mr.collect.PGroupedTableImpl  - Setting num reduce
tasks to 1
1043233 [Thread-3032] WARN  org.apache.hadoop.mapred.JobClient  - Use GenericOptionsParser
for parsing the arguments. Applications should implement Tool for the same.
1043276 [Thread-3032] WARN  org.apache.hadoop.mapred.JobClient  - No job jar file set.  User
classes may not be found. See JobConf(Class) or JobConf#setJar(String).
1043298 [Thread-3032] INFO  org.apache.crunch.impl.mr.exec.CrunchJob  - Running job "org.apache.crunch.TermFrequencyIT:
Text(/tmp/junit6694205757886187740/docs.txt)+term document frequency+Aggregate.count+GBK+combine+[[Text(/tmp/junit6694205757886187740/tf-output)]/[transform
wordDocumentPairCount+asText+Text(/tmp/junit6694205757886187740/transformed-output)]]"
1043298 [Thread-3032] INFO  org.apache.crunch.impl.mr.exec.CrunchJob  - Job status available
at: http://localhost:8080/
Tests run: 4, Failures: 0, Errors: 0, Skipped: 0, Time elapsed: 14.044 sec
Running org.apache.crunch.MaterializeToMapIT
0 a a
1 b b
2 c c
3 e e
1050256 [Thread-3057] WARN  org.apache.hadoop.mapred.JobClient  - Use GenericOptionsParser
for parsing the arguments. Applications should implement Tool for the same.
1050274 [Thread-3057] WARN  org.apache.hadoop.mapred.JobClient  - No job jar file set.  User
classes may not be found. See JobConf(Class) or JobConf#setJar(String).
1050290 [Thread-3057] INFO  org.apache.crunch.impl.mr.exec.CrunchJob  - Running job "org.apache.crunch.MaterializeToMapIT:
Text(/tmp/junit2697544715577359326/set1.txt)+S0+SeqFile(/tmp/junit2697544715577359326/tmp-crunch.tmp.dir/crunch-322076171/p1)"
1050290 [Thread-3057] INFO  org.apache.crunch.impl.mr.exec.CrunchJob  - Job status available
at: http://localhost:8080/
0 a a
1 b b
2 c c
3 e e
Tests run: 2, Failures: 0, Errors: 0, Skipped: 0, Time elapsed: 4.015 sec
Running org.apache.crunch.TupleNClassCastBugIT
1054270 [main] INFO  org.apache.crunch.impl.mr.collect.PGroupedTableImpl  - Setting num reduce
tasks to 1
1054273 [Thread-3067] WARN  org.apache.hadoop.mapred.JobClient  - Use GenericOptionsParser
for parsing the arguments. Applications should implement Tool for the same.
1054303 [Thread-3067] WARN  org.apache.hadoop.mapred.JobClient  - No job jar file set.  User
classes may not be found. See JobConf(Class) or JobConf#setJar(String).
1054322 [Thread-3067] INFO  org.apache.crunch.impl.mr.exec.CrunchJob  - Running job "org.apache.crunch.TupleNClassCastBugIT:
Text(/tmp/junit833059640667205134/docs.txt)+S0+GBK+S1+asText+Text(/tmp/junit833059640667205134/output)"
1054322 [Thread-3067] INFO  org.apache.crunch.impl.mr.exec.CrunchJob  - Job status available
at: http://localhost:8080/
1061286 [main] INFO  org.apache.crunch.impl.mr.collect.PGroupedTableImpl  - Setting num reduce
tasks to 1
1061288 [Thread-3085] WARN  org.apache.hadoop.mapred.JobClient  - Use GenericOptionsParser
for parsing the arguments. Applications should implement Tool for the same.
1061322 [Thread-3085] WARN  org.apache.hadoop.mapred.JobClient  - No job jar file set.  User
classes may not be found. See JobConf(Class) or JobConf#setJar(String).
1061341 [Thread-3085] INFO  org.apache.crunch.impl.mr.exec.CrunchJob  - Running job "org.apache.crunch.TupleNClassCastBugIT:
Text(/tmp/junit4542303973300432033/docs.txt)+S0+GBK+S1+asText+Text(/tmp/junit4542303973300432033/output)"
1061341 [Thread-3085] INFO  org.apache.crunch.impl.mr.exec.CrunchJob  - Job status available
at: http://localhost:8080/
Tests run: 2, Failures: 0, Errors: 0, Skipped: 0, Time elapsed: 14.032 sec

Results :

Failed tests:   toTextShouldWriteAvroDataAsDatumText(org.apache.crunch.io.avro.AvroPipelineIT)

Tests run: 117, Failures: 1, Errors: 0, Skipped: 2

mojoSucceeded org.apache.maven.plugins:maven-failsafe-plugin:2.12(default)
[JENKINS] Recording test results
mojoStarted org.apache.maven.plugins:maven-failsafe-plugin:2.12(default)[INFO] Failsafe report
directory: <https://builds.apache.org/job/Crunch-master-integration/ws/crunch/target/failsafe-reports>

[INFO] 
[INFO] --- maven-failsafe-plugin:2.12:verify (default) @ crunch ---
mojoFailed org.apache.maven.plugins:maven-failsafe-plugin:2.12(default)
projectFailed org.apache.crunch:crunch:0.4.0-incubating-SNAPSHOT
sessionEnded
[INFO] ------------------------------------------------------------------------
[INFO] Reactor Summary:
[INFO] 
[INFO] Apache Crunch ..................................... SUCCESS [21.137s]
[INFO] Apache Crunch Test ................................ SUCCESS [14.197s]
[INFO] Apache Crunch Core ................................ FAILURE [18:03.258s]
[INFO] Apache Crunch HBase Support ....................... SKIPPED
[INFO] Apache Crunch Examples ............................ SKIPPED
[INFO] Apache Crunch for Scala ........................... SKIPPED
[INFO] ------------------------------------------------------------------------
[INFO] BUILD FAILURE
[INFO] ------------------------------------------------------------------------
[INFO] Total time: 18:40.616s
[INFO] Finished at: Sun Sep 09 00:26:50 UTC 2012
[INFO] Final Memory: 20M/89M
[INFO] ------------------------------------------------------------------------
Projects to build: [MavenProject: org.apache.crunch:crunch-parent:0.4.0-incubating-SNAPSHOT
@ <https://builds.apache.org/job/Crunch-master-integration/ws/pom.xml,> MavenProject:
org.apache.crunch:crunch-test:0.4.0-incubating-SNAPSHOT @ <https://builds.apache.org/job/Crunch-master-integration/ws/crunch-test/pom.xml,>
MavenProject: org.apache.crunch:crunch:0.4.0-incubating-SNAPSHOT @ <https://builds.apache.org/job/Crunch-master-integration/ws/crunch/pom.xml,>
MavenProject: org.apache.crunch:crunch-hbase:0.4.0-incubating-SNAPSHOT @ <https://builds.apache.org/job/Crunch-master-integration/ws/crunch-hbase/pom.xml,>
MavenProject: org.apache.crunch:crunch-examples:0.4.0-incubating-SNAPSHOT @ <https://builds.apache.org/job/Crunch-master-integration/ws/crunch-examples/pom.xml,>
MavenProject: org.apache.crunch:crunch-scrunch:0.4.0-incubating-SNAPSHOT @ <https://builds.apache.org/job/Crunch-master-integration/ws/crunch-scrunch/pom.xml]>
[JENKINS] Archiving <https://builds.apache.org/job/Crunch-master-integration/ws/crunch-hbase/pom.xml>
to /home/hudson/hudson/jobs/Crunch-master-integration/modules/org.apache.crunch$crunch-hbase/builds/2012-09-09_00-07-57/archive/org.apache.crunch/crunch-hbase/0.4.0-incubating-SNAPSHOT/crunch-hbase-0.4.0-incubating-SNAPSHOT.pom
[JENKINS] Archiving <https://builds.apache.org/job/Crunch-master-integration/ws/crunch-scrunch/pom.xml>
to /home/hudson/hudson/jobs/Crunch-master-integration/modules/org.apache.crunch$crunch-scrunch/builds/2012-09-09_00-07-57/archive/org.apache.crunch/crunch-scrunch/0.4.0-incubating-SNAPSHOT/crunch-scrunch-0.4.0-incubating-SNAPSHOT.pom
[JENKINS] Archiving <https://builds.apache.org/job/Crunch-master-integration/ws/crunch/pom.xml>
to /home/hudson/hudson/jobs/Crunch-master-integration/modules/org.apache.crunch$crunch/builds/2012-09-09_00-07-57/archive/org.apache.crunch/crunch/0.4.0-incubating-SNAPSHOT/crunch-0.4.0-incubating-SNAPSHOT.pom
[JENKINS] Archiving <https://builds.apache.org/job/Crunch-master-integration/ws/crunch/target/apache-crunch-0.4.0-incubating-SNAPSHOT.jar>
to /home/hudson/hudson/jobs/Crunch-master-integration/modules/org.apache.crunch$crunch/builds/2012-09-09_00-07-57/archive/org.apache.crunch/crunch/0.4.0-incubating-SNAPSHOT/crunch-0.4.0-incubating-SNAPSHOT.jar
[JENKINS] Archiving <https://builds.apache.org/job/Crunch-master-integration/ws/pom.xml>
to /home/hudson/hudson/jobs/Crunch-master-integration/modules/org.apache.crunch$crunch-parent/builds/2012-09-09_00-07-57/archive/org.apache.crunch/crunch-parent/0.4.0-incubating-SNAPSHOT/crunch-parent-0.4.0-incubating-SNAPSHOT.pom
[JENKINS] Archiving <https://builds.apache.org/job/Crunch-master-integration/ws/target/crunch-parent-0.4.0-incubating-SNAPSHOT-site.xml>
to /home/hudson/hudson/jobs/Crunch-master-integration/modules/org.apache.crunch$crunch-parent/builds/2012-09-09_00-07-57/archive/org.apache.crunch/crunch-parent/0.4.0-incubating-SNAPSHOT/crunch-parent-0.4.0-incubating-SNAPSHOT-site.xml
[JENKINS] Archiving <https://builds.apache.org/job/Crunch-master-integration/ws/crunch-examples/pom.xml>
to /home/hudson/hudson/jobs/Crunch-master-integration/modules/org.apache.crunch$crunch-examples/builds/2012-09-09_00-07-57/archive/org.apache.crunch/crunch-examples/0.4.0-incubating-SNAPSHOT/crunch-examples-0.4.0-incubating-SNAPSHOT.pom
[JENKINS] Archiving <https://builds.apache.org/job/Crunch-master-integration/ws/crunch-test/pom.xml>
to /home/hudson/hudson/jobs/Crunch-master-integration/modules/org.apache.crunch$crunch-test/builds/2012-09-09_00-07-57/archive/org.apache.crunch/crunch-test/0.4.0-incubating-SNAPSHOT/crunch-test-0.4.0-incubating-SNAPSHOT.pom
[JENKINS] Archiving <https://builds.apache.org/job/Crunch-master-integration/ws/crunch-test/target/apache-crunch-0.4.0-incubating-SNAPSHOT.jar>
to /home/hudson/hudson/jobs/Crunch-master-integration/modules/org.apache.crunch$crunch-test/builds/2012-09-09_00-07-57/archive/org.apache.crunch/crunch-test/0.4.0-incubating-SNAPSHOT/crunch-test-0.4.0-incubating-SNAPSHOT.jar
Waiting for Jenkins to finish collecting data
mavenExecutionResult exceptions not empty
message : Failed to execute goal org.apache.maven.plugins:maven-failsafe-plugin:2.12:verify
(default) on project crunch: There are test failures.

Please refer to <https://builds.apache.org/job/Crunch-master-integration/ws/crunch/target/failsafe-reports>
for the individual test results.
cause : There are test failures.

Please refer to <https://builds.apache.org/job/Crunch-master-integration/ws/crunch/target/failsafe-reports>
for the individual test results.
Stack trace : 
org.apache.maven.lifecycle.LifecycleExecutionException: Failed to execute goal org.apache.maven.plugins:maven-failsafe-plugin:2.12:verify
(default) on project crunch: There are test failures.

Please refer to <https://builds.apache.org/job/Crunch-master-integration/ws/crunch/target/failsafe-reports>
for the individual test results.
	at org.apache.maven.lifecycle.internal.MojoExecutor.execute(MojoExecutor.java:213)
	at org.apache.maven.lifecycle.internal.MojoExecutor.execute(MojoExecutor.java:153)
	at org.apache.maven.lifecycle.internal.MojoExecutor.execute(MojoExecutor.java:145)
	at org.apache.maven.lifecycle.internal.LifecycleModuleBuilder.buildProject(LifecycleModuleBuilder.java:84)
	at org.apache.maven.lifecycle.internal.LifecycleModuleBuilder.buildProject(LifecycleModuleBuilder.java:59)
	at org.apache.maven.lifecycle.internal.LifecycleStarter.singleThreadedBuild(LifecycleStarter.java:183)
	at org.apache.maven.lifecycle.internal.LifecycleStarter.execute(LifecycleStarter.java:161)
	at org.apache.maven.DefaultMaven.doExecute(DefaultMaven.java:319)
	at org.apache.maven.DefaultMaven.execute(DefaultMaven.java:156)
	at org.jvnet.hudson.maven3.launcher.Maven3Launcher.main(Maven3Launcher.java:79)
	at sun.reflect.NativeMethodAccessorImpl.invoke0(Native Method)
	at sun.reflect.NativeMethodAccessorImpl.invoke(NativeMethodAccessorImpl.java:39)
	at sun.reflect.DelegatingMethodAccessorImpl.invoke(DelegatingMethodAccessorImpl.java:25)
	at java.lang.reflect.Method.invoke(Method.java:597)
	at org.codehaus.plexus.classworlds.launcher.Launcher.launchStandard(Launcher.java:329)
	at org.codehaus.plexus.classworlds.launcher.Launcher.launch(Launcher.java:239)
	at org.jvnet.hudson.maven3.agent.Maven3Main.launch(Maven3Main.java:158)
	at hudson.maven.Maven3Builder.call(Maven3Builder.java:98)
	at hudson.maven.Maven3Builder.call(Maven3Builder.java:64)
	at hudson.remoting.UserRequest.perform(UserRequest.java:118)
	at hudson.remoting.UserRequest.perform(UserRequest.java:48)
	at hudson.remoting.Request$2.run(Request.java:326)
	at hudson.remoting.InterceptingExecutorService$1.call(InterceptingExecutorService.java:72)
	at java.util.concurrent.FutureTask$Sync.innerRun(FutureTask.java:303)
	at java.util.concurrent.FutureTask.run(FutureTask.java:138)
	at java.util.concurrent.ThreadPoolExecutor$Worker.runTask(ThreadPoolExecutor.java:886)
	at java.util.concurrent.ThreadPoolExecutor$Worker.run(ThreadPoolExecutor.java:908)
	at java.lang.Thread.run(Thread.java:662)
Caused by: org.apache.maven.plugin.MojoFailureException: There are test failures.

Please refer to <https://builds.apache.org/job/Crunch-master-integration/ws/crunch/target/failsafe-reports>
for the individual test results.
	at org.apache.maven.plugin.surefire.SurefireHelper.reportExecution(SurefireHelper.java:121)
	at org.apache.maven.plugin.failsafe.VerifyMojo.execute(VerifyMojo.java:208)
	at org.apache.maven.plugin.DefaultBuildPluginManager.executeMojo(DefaultBuildPluginManager.java:101)
	at org.apache.maven.lifecycle.internal.MojoExecutor.execute(MojoExecutor.java:209)
	... 27 more
Maven failed with error.
Sending e-mails to: crunch-dev@incubator.apache.org
channel stopped
[locks-and-latches] Releasing all the locks
[locks-and-latches] All the locks released

Mime
View raw message