creadur-dev mailing list archives

Site index · List index
Message view « Date » · « Thread »
Top « Date » · « Thread »
From Jochen Wiedmann <jochen.wiedm...@gmail.com>
Subject Re: Build failed in Jenkins: Creadur-Rat-Site #218
Date Thu, 25 Aug 2016 08:56:28 GMT
Can anyone explain to me, what's wrong here? Okay, I did some changes
(like updating dependencies). But nothing, that remotely reminds me of
a reason for that.

Caused by: org.apache.maven.plugin.PluginExecutionException: Execution
enforce-bytecode-version of goal
org.apache.maven.plugins:maven-enforcer-plugin:1.4.1:enforce failed.
        at org.apache.maven.plugin.DefaultBuildPluginManager.executeMojo(DefaultBuildPluginManager.java:110)
        at org.apache.maven.lifecycle.internal.MojoExecutor.execute(MojoExecutor.java:209)
        ... 40 more
Caused by: java.lang.NullPointerException
        at org.apache.maven.plugins.enforcer.EnforceBytecodeVersion.isBadArtifact(EnforceBytecodeVersion.java:195)
        at org.apache.maven.plugins.enforcer.EnforceBytecodeVersion.checkDependencies(EnforceBytecodeVersion.java:182)
        at org.apache.maven.plugins.enforcer.EnforceBytecodeVersion.handleArtifacts(EnforceBytecodeVersion.java:109)
        at org.apache.maven.plugins.enforcer.AbstractResolveDependencies.execute(AbstractResolveDependencies.java:77)
        at org.apache.maven.plugins.enforcer.EnforceMojo.execute(EnforceMojo.java:193)
        at org.apache.maven.plugin.DefaultBuildPluginManager.executeMojo(DefaultBuildPluginManager.java:101)
        ... 41 more

On Mon, Aug 22, 2016 at 11:09 AM, Apache Jenkins Server
<jenkins@builds.apache.org> wrote:
> See <https://builds.apache.org/job/Creadur-Rat-Site/218/>
>
> ------------------------------------------
> [...truncated 515 lines...]
> Downloaded: http://repo.maven.apache.org/maven2/org/apache/maven/plugins/maven-changes-plugin/2.11/maven-changes-plugin-2.11.pom
(19 KB at 72.5 KB/sec)
> Downloading: http://repo.maven.apache.org/maven2/org/apache/maven/plugins/maven-changes-plugin/2.11/maven-changes-plugin-2.11.jar
> Downloaded: http://repo.maven.apache.org/maven2/org/apache/maven/plugins/maven-changes-plugin/2.11/maven-changes-plugin-2.11.jar
(209 KB at 1795.6 KB/sec)
> Downloading: http://repo.maven.apache.org/maven2/org/codehaus/plexus/plexus-mail-sender-api/1.0-alpha-7/plexus-mail-sender-api-1.0-alpha-7.pom
> Downloaded: http://repo.maven.apache.org/maven2/org/codehaus/plexus/plexus-mail-sender-api/1.0-alpha-7/plexus-mail-sender-api-1.0-alpha-7.pom
(433 B at 7.7 KB/sec)
> Downloading: http://repo.maven.apache.org/maven2/org/codehaus/plexus/plexus-mail-sender/1.0-alpha-7/plexus-mail-sender-1.0-alpha-7.pom
> Downloaded: http://repo.maven.apache.org/maven2/org/codehaus/plexus/plexus-mail-sender/1.0-alpha-7/plexus-mail-sender-1.0-alpha-7.pom
(2 KB at 20.9 KB/sec)
> Downloading: http://repo.maven.apache.org/maven2/org/apache/geronimo/javamail/geronimo-javamail_1.4_provider/1.7/geronimo-javamail_1.4_provider-1.7.pom
> Downloaded: http://repo.maven.apache.org/maven2/org/apache/geronimo/javamail/geronimo-javamail_1.4_provider/1.7/geronimo-javamail_1.4_provider-1.7.pom
(3 KB at 39.9 KB/sec)
> Downloading: http://repo.maven.apache.org/maven2/org/apache/geronimo/javamail/geronimo-javamail_1.4/1.7/geronimo-javamail_1.4-1.7.pom
> Downloaded: http://repo.maven.apache.org/maven2/org/apache/geronimo/javamail/geronimo-javamail_1.4/1.7/geronimo-javamail_1.4-1.7.pom
(5 KB at 81.7 KB/sec)
> Downloading: http://repo.maven.apache.org/maven2/org/apache/geronimo/specs/geronimo-javamail_1.4_spec/1.7/geronimo-javamail_1.4_spec-1.7.pom
> Downloaded: http://repo.maven.apache.org/maven2/org/apache/geronimo/specs/geronimo-javamail_1.4_spec/1.7/geronimo-javamail_1.4_spec-1.7.pom
(7 KB at 120.5 KB/sec)
> Downloading: http://repo.maven.apache.org/maven2/org/apache/geronimo/javamail/geronimo-javamail_1.4_mail/1.7/geronimo-javamail_1.4_mail-1.7.pom
> Downloaded: http://repo.maven.apache.org/maven2/org/apache/geronimo/javamail/geronimo-javamail_1.4_mail/1.7/geronimo-javamail_1.4_mail-1.7.pom
(2 KB at 20.4 KB/sec)
> Downloading: http://repo.maven.apache.org/maven2/org/codehaus/plexus/plexus-mail-sender-javamail/1.0-alpha-7/plexus-mail-sender-javamail-1.0-alpha-7.pom
> Downloaded: http://repo.maven.apache.org/maven2/org/codehaus/plexus/plexus-mail-sender-javamail/1.0-alpha-7/plexus-mail-sender-javamail-1.0-alpha-7.pom
(2 KB at 21.4 KB/sec)
> Downloading: http://repo.maven.apache.org/maven2/org/codehaus/plexus/plexus-mail-senders/1.0-alpha-7/plexus-mail-senders-1.0-alpha-7.pom
> Downloaded: http://repo.maven.apache.org/maven2/org/codehaus/plexus/plexus-mail-senders/1.0-alpha-7/plexus-mail-senders-1.0-alpha-7.pom
(939 B at 17.0 KB/sec)
> Downloading: http://repo.maven.apache.org/maven2/org/codehaus/plexus/plexus-mail-sender-simple/1.0-alpha-7/plexus-mail-sender-simple-1.0-alpha-7.pom
> Downloaded: http://repo.maven.apache.org/maven2/org/codehaus/plexus/plexus-mail-sender-simple/1.0-alpha-7/plexus-mail-sender-simple-1.0-alpha-7.pom
(837 B at 14.9 KB/sec)
> Downloading: http://repo.maven.apache.org/maven2/commons-collections/commons-collections/3.0/commons-collections-3.0.pom
> Downloaded: http://repo.maven.apache.org/maven2/commons-collections/commons-collections/3.0/commons-collections-3.0.pom
(6 KB at 108.5 KB/sec)
> Downloading: http://repo.maven.apache.org/maven2/org/apache/cxf/cxf-rt-frontend-jaxrs/2.6.3/cxf-rt-frontend-jaxrs-2.6.3.pom
> Downloaded: http://repo.maven.apache.org/maven2/org/apache/cxf/cxf-rt-frontend-jaxrs/2.6.3/cxf-rt-frontend-jaxrs-2.6.3.pom
(6 KB at 69.9 KB/sec)
> Downloading: http://repo.maven.apache.org/maven2/org/apache/cxf/cxf-parent/2.6.3/cxf-parent-2.6.3.pom
> Downloaded: http://repo.maven.apache.org/maven2/org/apache/cxf/cxf-parent/2.6.3/cxf-parent-2.6.3.pom
(81 KB at 960.3 KB/sec)
> Downloading: http://repo.maven.apache.org/maven2/org/apache/cxf/cxf/2.6.3/cxf-2.6.3.pom
> Downloaded: http://repo.maven.apache.org/maven2/org/apache/cxf/cxf/2.6.3/cxf-2.6.3.pom
(34 KB at 414.4 KB/sec)
> Downloading: http://repo.maven.apache.org/maven2/org/apache/cxf/cxf-api/2.6.3/cxf-api-2.6.3.pom
> Downloaded: http://repo.maven.apache.org/maven2/org/apache/cxf/cxf-api/2.6.3/cxf-api-2.6.3.pom
(15 KB at 216.1 KB/sec)
> Downloading: http://repo.maven.apache.org/maven2/org/codehaus/woodstox/woodstox-core-asl/4.1.4/woodstox-core-asl-4.1.4.pom
> Downloaded: http://repo.maven.apache.org/maven2/org/codehaus/woodstox/woodstox-core-asl/4.1.4/woodstox-core-asl-4.1.4.pom
(2 KB at 14.9 KB/sec)
> Downloading: http://repo.maven.apache.org/maven2/org/apache/ws/xmlschema/xmlschema-core/2.0.3/xmlschema-core-2.0.3.pom
> Downloaded: http://repo.maven.apache.org/maven2/org/apache/ws/xmlschema/xmlschema-core/2.0.3/xmlschema-core-2.0.3.pom
(6 KB at 87.5 KB/sec)
> Downloading: http://repo.maven.apache.org/maven2/org/apache/ws/xmlschema/xmlschema/2.0.3/xmlschema-2.0.3.pom
> Downloaded: http://repo.maven.apache.org/maven2/org/apache/ws/xmlschema/xmlschema/2.0.3/xmlschema-2.0.3.pom
(29 KB at 481.2 KB/sec)
> Downloading: http://repo.maven.apache.org/maven2/org/apache/cxf/cxf-rt-core/2.6.3/cxf-rt-core-2.6.3.pom
> Downloaded: http://repo.maven.apache.org/maven2/org/apache/cxf/cxf-rt-core/2.6.3/cxf-rt-core-2.6.3.pom
(5 KB at 84.8 KB/sec)
> Downloading: http://repo.maven.apache.org/maven2/com/sun/xml/bind/jaxb-impl/2.2.5/jaxb-impl-2.2.5.pom
> Downloaded: http://repo.maven.apache.org/maven2/com/sun/xml/bind/jaxb-impl/2.2.5/jaxb-impl-2.2.5.pom
(5 KB at 81.6 KB/sec)
> Downloading: http://repo.maven.apache.org/maven2/org/apache/cxf/cxf-rt-bindings-xml/2.6.3/cxf-rt-bindings-xml-2.6.3.pom
> Downloaded: http://repo.maven.apache.org/maven2/org/apache/cxf/cxf-rt-bindings-xml/2.6.3/cxf-rt-bindings-xml-2.6.3.pom
(6 KB at 65.9 KB/sec)
> Downloading: http://repo.maven.apache.org/maven2/org/apache/cxf/cxf-rt-transports-http/2.6.3/cxf-rt-transports-http-2.6.3.pom
> Downloaded: http://repo.maven.apache.org/maven2/org/apache/cxf/cxf-rt-transports-http/2.6.3/cxf-rt-transports-http-2.6.3.pom
(6 KB at 106.6 KB/sec)
> Downloading: http://repo.maven.apache.org/maven2/com/fasterxml/jackson/core/jackson-core/2.1.0/jackson-core-2.1.0.pom
> Downloaded: http://repo.maven.apache.org/maven2/com/fasterxml/jackson/core/jackson-core/2.1.0/jackson-core-2.1.0.pom
(6 KB at 101.9 KB/sec)
> Downloading: http://repo.maven.apache.org/maven2/com/fasterxml/jackson/core/jackson-databind/2.1.0/jackson-databind-2.1.0.pom
> Downloaded: http://repo.maven.apache.org/maven2/com/fasterxml/jackson/core/jackson-databind/2.1.0/jackson-databind-2.1.0.pom
(6 KB at 86.8 KB/sec)
> Downloading: http://repo.maven.apache.org/maven2/com/fasterxml/jackson/core/jackson-annotations/2.1.0/jackson-annotations-2.1.0.pom
> Downloaded: http://repo.maven.apache.org/maven2/com/fasterxml/jackson/core/jackson-annotations/2.1.0/jackson-annotations-2.1.0.pom
(2 KB at 33.3 KB/sec)
> Downloading: http://repo.maven.apache.org/maven2/org/apache/xmlrpc/xmlrpc-client/3.0/xmlrpc-client-3.0.pom
> Downloaded: http://repo.maven.apache.org/maven2/org/apache/xmlrpc/xmlrpc-client/3.0/xmlrpc-client-3.0.pom
(808 B at 14.6 KB/sec)
> Downloading: http://repo.maven.apache.org/maven2/org/apache/xmlrpc/xmlrpc/3.0/xmlrpc-3.0.pom
> Downloaded: http://repo.maven.apache.org/maven2/org/apache/xmlrpc/xmlrpc/3.0/xmlrpc-3.0.pom
(12 KB at 197.9 KB/sec)
> Downloading: http://repo.maven.apache.org/maven2/org/apache/xmlrpc/xmlrpc-common/3.0/xmlrpc-common-3.0.pom
> Downloaded: http://repo.maven.apache.org/maven2/org/apache/xmlrpc/xmlrpc-common/3.0/xmlrpc-common-3.0.pom
(854 B at 15.4 KB/sec)
> Downloading: http://repo.maven.apache.org/maven2/org/apache/ws/commons/ws-commons-util/1.0.1/ws-commons-util-1.0.1.pom
> Downloaded: http://repo.maven.apache.org/maven2/org/apache/ws/commons/ws-commons-util/1.0.1/ws-commons-util-1.0.1.pom
(6 KB at 53.3 KB/sec)
> Downloading: http://repo.maven.apache.org/maven2/org/eclipse/mylyn/github/org.eclipse.egit.github.core/1.2.0/org.eclipse.egit.github.core-1.2.0.pom
> Downloaded: http://repo.maven.apache.org/maven2/org/eclipse/mylyn/github/org.eclipse.egit.github.core/1.2.0/org.eclipse.egit.github.core-1.2.0.pom
(6 KB at 77.3 KB/sec)
> Downloading: http://repo.maven.apache.org/maven2/com/google/code/gson/gson/1.7.2/gson-1.7.2.pom
> Downloaded: http://repo.maven.apache.org/maven2/com/google/code/gson/gson/1.7.2/gson-1.7.2.pom
(10 KB at 147.2 KB/sec)
> Downloading: http://repo.maven.apache.org/maven2/org/codehaus/plexus/plexus-mail-sender-api/1.0-alpha-7/plexus-mail-sender-api-1.0-alpha-7.jar
> Downloading: http://repo.maven.apache.org/maven2/org/apache/geronimo/javamail/geronimo-javamail_1.4_provider/1.7/geronimo-javamail_1.4_provider-1.7.jar
> Downloading: http://repo.maven.apache.org/maven2/org/apache/geronimo/javamail/geronimo-javamail_1.4_mail/1.7/geronimo-javamail_1.4_mail-1.7.jar
> Downloading: http://repo.maven.apache.org/maven2/org/apache/geronimo/specs/geronimo-javamail_1.4_spec/1.7/geronimo-javamail_1.4_spec-1.7.jar
> Downloading: http://repo.maven.apache.org/maven2/org/codehaus/plexus/plexus-mail-sender-javamail/1.0-alpha-7/plexus-mail-sender-javamail-1.0-alpha-7.jar
> Downloaded: http://repo.maven.apache.org/maven2/org/codehaus/plexus/plexus-mail-sender-api/1.0-alpha-7/plexus-mail-sender-api-1.0-alpha-7.jar
(10 KB at 160.8 KB/sec)
> Downloading: http://repo.maven.apache.org/maven2/org/codehaus/plexus/plexus-mail-sender-simple/1.0-alpha-7/plexus-mail-sender-simple-1.0-alpha-7.jar
> Downloaded: http://repo.maven.apache.org/maven2/org/codehaus/plexus/plexus-mail-sender-javamail/1.0-alpha-7/plexus-mail-sender-javamail-1.0-alpha-7.jar
(12 KB at 145.1 KB/sec)
> Downloading: http://repo.maven.apache.org/maven2/commons-collections/commons-collections/3.0/commons-collections-3.0.jar
> Downloaded: http://repo.maven.apache.org/maven2/org/codehaus/plexus/plexus-mail-sender-simple/1.0-alpha-7/plexus-mail-sender-simple-1.0-alpha-7.jar
(12 KB at 204.9 KB/sec)
> Downloading: http://repo.maven.apache.org/maven2/org/apache/cxf/cxf-rt-frontend-jaxrs/2.6.3/cxf-rt-frontend-jaxrs-2.6.3.jar
> Downloaded: http://repo.maven.apache.org/maven2/org/apache/geronimo/specs/geronimo-javamail_1.4_spec/1.7/geronimo-javamail_1.4_spec-1.7.jar
(219 KB at 1260.1 KB/sec)
> Downloading: http://repo.maven.apache.org/maven2/org/apache/cxf/cxf-api/2.6.3/cxf-api-2.6.3.jar
> Downloaded: http://repo.maven.apache.org/maven2/org/apache/geronimo/javamail/geronimo-javamail_1.4_provider/1.7/geronimo-javamail_1.4_provider-1.7.jar
(227 KB at 1295.6 KB/sec)
> Downloading: http://repo.maven.apache.org/maven2/org/codehaus/woodstox/woodstox-core-asl/4.1.4/woodstox-core-asl-4.1.4.jar
> Downloaded: http://repo.maven.apache.org/maven2/org/apache/geronimo/javamail/geronimo-javamail_1.4_mail/1.7/geronimo-javamail_1.4_mail-1.7.jar
(425 KB at 2321.6 KB/sec)
> Downloading: http://repo.maven.apache.org/maven2/org/apache/ws/xmlschema/xmlschema-core/2.0.3/xmlschema-core-2.0.3.jar
> Downloaded: http://repo.maven.apache.org/maven2/org/apache/cxf/cxf-rt-frontend-jaxrs/2.6.3/cxf-rt-frontend-jaxrs-2.6.3.jar
(494 KB at 5541.2 KB/sec)
> Downloading: http://repo.maven.apache.org/maven2/org/apache/cxf/cxf-rt-core/2.6.3/cxf-rt-core-2.6.3.jar
> Downloaded: http://repo.maven.apache.org/maven2/commons-collections/commons-collections/3.0/commons-collections-3.0.jar
(507 KB at 3354.2 KB/sec)
> Downloading: http://repo.maven.apache.org/maven2/com/sun/xml/bind/jaxb-impl/2.2.5/jaxb-impl-2.2.5.jar
> Downloaded: http://repo.maven.apache.org/maven2/org/apache/ws/xmlschema/xmlschema-core/2.0.3/xmlschema-core-2.0.3.jar
(160 KB at 2741.4 KB/sec)
> Downloading: http://repo.maven.apache.org/maven2/org/apache/cxf/cxf-rt-bindings-xml/2.6.3/cxf-rt-bindings-xml-2.6.3.jar
> Downloaded: http://repo.maven.apache.org/maven2/org/codehaus/woodstox/woodstox-core-asl/4.1.4/woodstox-core-asl-4.1.4.jar
(468 KB at 5637.0 KB/sec)
> Downloading: http://repo.maven.apache.org/maven2/org/apache/cxf/cxf-rt-transports-http/2.6.3/cxf-rt-transports-http-2.6.3.jar
> Downloaded: http://repo.maven.apache.org/maven2/org/apache/cxf/cxf-rt-core/2.6.3/cxf-rt-core-2.6.3.jar
(349 KB at 5206.2 KB/sec)
> Downloading: http://repo.maven.apache.org/maven2/com/fasterxml/jackson/core/jackson-core/2.1.0/jackson-core-2.1.0.jar
> Downloaded: http://repo.maven.apache.org/maven2/org/apache/cxf/cxf-api/2.6.3/cxf-api-2.6.3.jar
(974 KB at 8041.9 KB/sec)
> Downloading: http://repo.maven.apache.org/maven2/com/fasterxml/jackson/core/jackson-databind/2.1.0/jackson-databind-2.1.0.jar
> Downloaded: http://repo.maven.apache.org/maven2/org/apache/cxf/cxf-rt-bindings-xml/2.6.3/cxf-rt-bindings-xml-2.6.3.jar
(38 KB at 689.2 KB/sec)
> Downloading: http://repo.maven.apache.org/maven2/com/fasterxml/jackson/core/jackson-annotations/2.1.0/jackson-annotations-2.1.0.jar
> Downloaded: http://repo.maven.apache.org/maven2/org/apache/cxf/cxf-rt-transports-http/2.6.3/cxf-rt-transports-http-2.6.3.jar
(215 KB at 3516.6 KB/sec)
> Downloading: http://repo.maven.apache.org/maven2/org/apache/xmlrpc/xmlrpc-client/3.0/xmlrpc-client-3.0.jar
> Downloaded: http://repo.maven.apache.org/maven2/com/fasterxml/jackson/core/jackson-core/2.1.0/jackson-core-2.1.0.jar
(202 KB at 3196.8 KB/sec)
> Downloading: http://repo.maven.apache.org/maven2/org/apache/xmlrpc/xmlrpc-common/3.0/xmlrpc-common-3.0.jar
> Downloaded: http://repo.maven.apache.org/maven2/com/sun/xml/bind/jaxb-impl/2.2.5/jaxb-impl-2.2.5.jar
(1080 KB at 10902.7 KB/sec)
> Downloading: http://repo.maven.apache.org/maven2/org/apache/ws/commons/ws-commons-util/1.0.1/ws-commons-util-1.0.1.jar
> Downloaded: http://repo.maven.apache.org/maven2/com/fasterxml/jackson/core/jackson-annotations/2.1.0/jackson-annotations-2.1.0.jar
(34 KB at 619.4 KB/sec)
> Downloading: http://repo.maven.apache.org/maven2/org/eclipse/mylyn/github/org.eclipse.egit.github.core/1.2.0/org.eclipse.egit.github.core-1.2.0.jar
> Downloaded: http://repo.maven.apache.org/maven2/com/fasterxml/jackson/core/jackson-databind/2.1.0/jackson-databind-2.1.0.jar
(900 KB at 11991.8 KB/sec)
> Downloading: http://repo.maven.apache.org/maven2/com/google/code/gson/gson/1.7.2/gson-1.7.2.jar
> Downloaded: http://repo.maven.apache.org/maven2/org/apache/xmlrpc/xmlrpc-client/3.0/xmlrpc-client-3.0.jar
(43 KB at 783.3 KB/sec)
> Downloaded: http://repo.maven.apache.org/maven2/org/apache/ws/commons/ws-commons-util/1.0.1/ws-commons-util-1.0.1.jar
(35 KB at 630.1 KB/sec)
> Downloaded: http://repo.maven.apache.org/maven2/org/apache/xmlrpc/xmlrpc-common/3.0/xmlrpc-common-3.0.jar
(96 KB at 1709.9 KB/sec)
> Downloaded: http://repo.maven.apache.org/maven2/org/eclipse/mylyn/github/org.eclipse.egit.github.core/1.2.0/org.eclipse.egit.github.core-1.2.0.jar
(158 KB at 2666.8 KB/sec)
> Downloaded: http://repo.maven.apache.org/maven2/com/google/code/gson/gson/1.7.2/gson-1.7.2.jar
(170 KB at 2923.1 KB/sec)
> [INFO] configuring report plugin org.apache.maven.plugins:maven-javadoc-plugin:2.10.4
> [INFO] preparing 'javadoc' report requires 'generate-sources' forked phase execution
> [INFO]
> [INFO] --- maven-enforcer-plugin:1.4.1:enforce (enforce-bytecode-version) @ apache-rat-project
---
> [INFO]
> [INFO] --- apache-rat-plugin:0.12:check (default) @ apache-rat-project ---
> [INFO] Enabled default license matchers.
> [INFO] Will parse SCM ignores for exclusions...
> [INFO] Parsing exclusions from <https://builds.apache.org/job/Creadur-Rat-Site/ws/.gitignore>
> [INFO] Finished adding exclusions from SCM ignore files.
> [INFO] 78 implicit excludes (use -debug for more details).
> [INFO] Exclude: BUILD.txt
> [INFO] Exclude: apache-rat/README*.txt
> [INFO] Exclude: apache-rat-core/src/test/resources/**
> [INFO] Exclude: apache-rat*/target/**
> [INFO] Exclude: apache-rat-plugin/src/test/resources/**
> [INFO] Exclude: apache-rat-plugin/src/it/**
> [INFO] Exclude: apache-rat-tasks/src/test/resources/**
> [INFO] 16 resources included (use -debug for more details)
> [INFO] Rat check: Summary over all files. Unapproved: 0, unknown: 0, generated: 0, approved:
11 licenses.
> [INFO] preparing 'aggregate' report requires 'generate-sources' forked phase execution
> [INFO]
> [INFO] >>>>>>>>>>>>>>>>>>>>>>>>>>>>>>>>>>>>>>>>>>>>>>>>>>>>>>>>>>>>>>>>>>>>>>>>
> [INFO] Forking Apache Creadur Rat 0.13-SNAPSHOT
> [INFO] >>>>>>>>>>>>>>>>>>>>>>>>>>>>>>>>>>>>>>>>>>>>>>>>>>>>>>>>>>>>>>>>>>>>>>>>
> [INFO]
> [INFO] --- maven-enforcer-plugin:1.4.1:enforce (enforce-bytecode-version) @ apache-rat-project
---
> [INFO]
> [INFO] --- apache-rat-plugin:0.12:check (default) @ apache-rat-project ---
> [INFO] Enabled default license matchers.
> [INFO] Will parse SCM ignores for exclusions...
> [INFO] Parsing exclusions from <https://builds.apache.org/job/Creadur-Rat-Site/ws/.gitignore>
> [INFO] Finished adding exclusions from SCM ignore files.
> [INFO] 78 implicit excludes (use -debug for more details).
> [INFO] Exclude: BUILD.txt
> [INFO] Exclude: apache-rat/README*.txt
> [INFO] Exclude: apache-rat-core/src/test/resources/**
> [INFO] Exclude: apache-rat*/target/**
> [INFO] Exclude: apache-rat-plugin/src/test/resources/**
> [INFO] Exclude: apache-rat-plugin/src/it/**
> [INFO] Exclude: apache-rat-tasks/src/test/resources/**
> [INFO] 16 resources included (use -debug for more details)
> [INFO] Rat check: Summary over all files. Unapproved: 0, unknown: 0, generated: 0, approved:
11 licenses.
> [INFO]
> [INFO] >>>>>>>>>>>>>>>>>>>>>>>>>>>>>>>>>>>>>>>>>>>>>>>>>>>>>>>>>>>>>>>>>>>>>>>>
> [INFO] Forking Apache Creadur Rat::API 0.13-SNAPSHOT
> [INFO] >>>>>>>>>>>>>>>>>>>>>>>>>>>>>>>>>>>>>>>>>>>>>>>>>>>>>>>>>>>>>>>>>>>>>>>>
> [INFO]
> [INFO] --- maven-enforcer-plugin:1.4.1:enforce (enforce-bytecode-version) @ apache-rat-api
---
> [JENKINS] Archiving site from <https://builds.apache.org/job/Creadur-Rat-Site/ws/target/site>
to /x1/jenkins/jenkins-home/jobs/Creadur-Rat-Site/site
> [INFO] ------------------------------------------------------------------------
> [INFO] Reactor Summary:
> [INFO]
> [INFO] Apache Creadur Rat ................................ FAILURE [23.414s]
> [INFO] Apache Creadur Rat::API ........................... SKIPPED
> [INFO] Apache Creadur Rat::Core .......................... SKIPPED
> [INFO] Apache Creadur Rat::Plugin4Maven .................. SKIPPED
> [INFO] Apache Creadur Rat::Tasks4Ant ..................... SKIPPED
> [INFO] Apache Creadur Rat::Command Line .................. SKIPPED
> [INFO] ------------------------------------------------------------------------
> [INFO] BUILD FAILURE
> [INFO] ------------------------------------------------------------------------
> [INFO] Total time: 25.221s
> [INFO] Finished at: Mon Aug 22 09:09:16 UTC 2016
> [INFO] Final Memory: 28M/385M
> [INFO] ------------------------------------------------------------------------
> Waiting for Jenkins to finish collecting data
> [ERROR] Failed to execute goal org.apache.maven.plugins:maven-site-plugin:3.4:site (default-site)
on project apache-rat-project: failed to get report for org.apache.maven.plugins:maven-javadoc-plugin:
Failed to execute goal org.apache.maven.plugins:maven-enforcer-plugin:1.4.1:enforce (enforce-bytecode-version)
on project apache-rat-api: Execution enforce-bytecode-version of goal org.apache.maven.plugins:maven-enforcer-plugin:1.4.1:enforce
failed. NullPointerException -> [Help 1]
> org.apache.maven.lifecycle.LifecycleExecutionException: Failed to execute goal org.apache.maven.plugins:maven-site-plugin:3.4:site
(default-site) on project apache-rat-project: failed to get report for org.apache.maven.plugins:maven-javadoc-plugin
>         at org.apache.maven.lifecycle.internal.MojoExecutor.execute(MojoExecutor.java:217)
>         at org.apache.maven.lifecycle.internal.MojoExecutor.execute(MojoExecutor.java:153)
>         at org.apache.maven.lifecycle.internal.MojoExecutor.execute(MojoExecutor.java:145)
>         at org.apache.maven.lifecycle.internal.LifecycleModuleBuilder.buildProject(LifecycleModuleBuilder.java:84)
>         at org.apache.maven.lifecycle.internal.LifecycleModuleBuilder.buildProject(LifecycleModuleBuilder.java:59)
>         at org.apache.maven.lifecycle.internal.LifecycleStarter.singleThreadedBuild(LifecycleStarter.java:183)
>         at org.apache.maven.lifecycle.internal.LifecycleStarter.execute(LifecycleStarter.java:161)
>         at org.apache.maven.DefaultMaven.doExecute(DefaultMaven.java:320)
>         at org.apache.maven.DefaultMaven.execute(DefaultMaven.java:156)
>         at org.jvnet.hudson.maven3.launcher.Maven3Launcher.main(Maven3Launcher.java:117)
>         at sun.reflect.NativeMethodAccessorImpl.invoke0(Native Method)
>         at sun.reflect.NativeMethodAccessorImpl.invoke(NativeMethodAccessorImpl.java:57)
>         at sun.reflect.DelegatingMethodAccessorImpl.invoke(DelegatingMethodAccessorImpl.java:43)
>         at java.lang.reflect.Method.invoke(Method.java:606)
>         at org.codehaus.plexus.classworlds.launcher.Launcher.launchStandard(Launcher.java:329)
>         at org.codehaus.plexus.classworlds.launcher.Launcher.launch(Launcher.java:239)
>         at org.jvnet.hudson.maven3.agent.Maven3Main.launch(Maven3Main.java:181)
>         at sun.reflect.NativeMethodAccessorImpl.invoke0(Native Method)
>         at sun.reflect.NativeMethodAccessorImpl.invoke(NativeMethodAccessorImpl.java:57)
>         at sun.reflect.DelegatingMethodAccessorImpl.invoke(DelegatingMethodAccessorImpl.java:43)
>         at java.lang.reflect.Method.invoke(Method.java:606)
>         at hudson.maven.Maven3Builder.call(Maven3Builder.java:136)
>         at hudson.maven.Maven3Builder.call(Maven3Builder.java:71)
>         at hudson.remoting.UserRequest.perform(UserRequest.java:153)
>         at hudson.remoting.UserRequest.perform(UserRequest.java:50)
>         at hudson.remoting.Request$2.run(Request.java:332)
>         at hudson.remoting.InterceptingExecutorService$1.call(InterceptingExecutorService.java:68)
>         at java.util.concurrent.FutureTask.run(FutureTask.java:262)
>         at java.util.concurrent.ThreadPoolExecutor.runWorker(ThreadPoolExecutor.java:1145)
>         at java.util.concurrent.ThreadPoolExecutor$Worker.run(ThreadPoolExecutor.java:615)
>         at java.lang.Thread.run(Thread.java:745)
> Caused by: org.apache.maven.plugin.MojoExecutionException: failed to get report for org.apache.maven.plugins:maven-javadoc-plugin
>         at org.apache.maven.reporting.exec.DefaultMavenReportExecutor.buildMavenReports(DefaultMavenReportExecutor.java:156)
>         at org.apache.maven.plugins.site.render.AbstractSiteRenderingMojo.getReports(AbstractSiteRenderingMojo.java:239)
>         at org.apache.maven.plugins.site.render.SiteMojo.execute(SiteMojo.java:124)
>         at org.apache.maven.plugin.DefaultBuildPluginManager.executeMojo(DefaultBuildPluginManager.java:101)
>         at org.apache.maven.lifecycle.internal.MojoExecutor.execute(MojoExecutor.java:209)
>         ... 30 more
> Caused by: org.apache.maven.lifecycle.LifecycleExecutionException: Failed to execute
goal org.apache.maven.plugins:maven-enforcer-plugin:1.4.1:enforce (enforce-bytecode-version)
on project apache-rat-api: Execution enforce-bytecode-version of goal org.apache.maven.plugins:maven-enforcer-plugin:1.4.1:enforce
failed.
>         at org.apache.maven.lifecycle.internal.MojoExecutor.execute(MojoExecutor.java:225)
>         at org.apache.maven.lifecycle.internal.MojoExecutor.execute(MojoExecutor.java:153)
>         at org.apache.maven.lifecycle.internal.MojoExecutor.execute(MojoExecutor.java:145)
>         at org.apache.maven.lifecycle.internal.MojoExecutor.executeForkedExecutions(MojoExecutor.java:365)
>         at org.apache.maven.lifecycle.DefaultLifecycleExecutor.executeForkedExecutions(DefaultLifecycleExecutor.java:173)
>         at org.apache.maven.reporting.exec.DefaultMavenReportExecutor.buildReportPlugin(DefaultMavenReportExecutor.java:309)
>         at org.apache.maven.reporting.exec.DefaultMavenReportExecutor.buildMavenReports(DefaultMavenReportExecutor.java:151)
>         ... 34 more
> Caused by: org.apache.maven.plugin.PluginExecutionException: Execution enforce-bytecode-version
of goal org.apache.maven.plugins:maven-enforcer-plugin:1.4.1:enforce failed.
>         at org.apache.maven.plugin.DefaultBuildPluginManager.executeMojo(DefaultBuildPluginManager.java:110)
>         at org.apache.maven.lifecycle.internal.MojoExecutor.execute(MojoExecutor.java:209)
>         ... 40 more
> Caused by: java.lang.NullPointerException
>         at org.apache.maven.plugins.enforcer.EnforceBytecodeVersion.isBadArtifact(EnforceBytecodeVersion.java:195)
>         at org.apache.maven.plugins.enforcer.EnforceBytecodeVersion.checkDependencies(EnforceBytecodeVersion.java:182)
>         at org.apache.maven.plugins.enforcer.EnforceBytecodeVersion.handleArtifacts(EnforceBytecodeVersion.java:109)
>         at org.apache.maven.plugins.enforcer.AbstractResolveDependencies.execute(AbstractResolveDependencies.java:77)
>         at org.apache.maven.plugins.enforcer.EnforceMojo.execute(EnforceMojo.java:193)
>         at org.apache.maven.plugin.DefaultBuildPluginManager.executeMojo(DefaultBuildPluginManager.java:101)
>         ... 41 more
> [ERROR]
> [ERROR] Re-run Maven using the -X switch to enable full debug logging.
> [ERROR]
> [ERROR] For more information about the errors and possible solutions, please read the
following articles:
> [ERROR] [Help 1] http://cwiki.apache.org/confluence/display/MAVEN/MojoExecutionException
> [JENKINS] Archiving <https://builds.apache.org/job/Creadur-Rat-Site/ws/apache-rat-plugin/pom.xml>
to org.apache.rat/apache-rat-plugin/0.13-SNAPSHOT/apache-rat-plugin-0.13-SNAPSHOT.pom
> [JENKINS] Archiving <https://builds.apache.org/job/Creadur-Rat-Site/ws/apache-rat-api/pom.xml>
to org.apache.rat/apache-rat-api/0.13-SNAPSHOT/apache-rat-api-0.13-SNAPSHOT.pom
> [JENKINS] Archiving <https://builds.apache.org/job/Creadur-Rat-Site/ws/apache-rat/pom.xml>
to org.apache.rat/apache-rat/0.13-SNAPSHOT/apache-rat-0.13-SNAPSHOT.pom
> [JENKINS] Archiving <https://builds.apache.org/job/Creadur-Rat-Site/ws/pom.xml>
to org.apache.rat/apache-rat-project/0.13-SNAPSHOT/apache-rat-project-0.13-SNAPSHOT.pom
> [JENKINS] Archiving <https://builds.apache.org/job/Creadur-Rat-Site/ws/apache-rat-core/pom.xml>
to org.apache.rat/apache-rat-core/0.13-SNAPSHOT/apache-rat-core-0.13-SNAPSHOT.pom
> [JENKINS] Archiving <https://builds.apache.org/job/Creadur-Rat-Site/ws/apache-rat-tasks/pom.xml>
to org.apache.rat/apache-rat-tasks/0.13-SNAPSHOT/apache-rat-tasks-0.13-SNAPSHOT.pom
> channel stopped



-- 
The next time you hear: "Don't reinvent the wheel!"

http://www.keystonedevelopment.co.uk/wp-content/uploads/2014/10/evolution-of-the-wheel-300x85.jpg

Mime
View raw message