creadur-dev mailing list archives

Site index · List index
Message view « Date » · « Thread »
Top « Date » · « Thread »
From Apache Jenkins Server <jenk...@builds.apache.org>
Subject Build failed in Jenkins: Creadur-Rat-Site-Latest-Jdk #216
Date Mon, 22 Aug 2016 09:07:44 GMT
See <https://builds.apache.org/job/Creadur-Rat-Site-Latest-Jdk/216/>

------------------------------------------
[...truncated 424 lines...]
AU        apache-rat-core/src/main/java/org/apache/rat/license/GPL3LicenseFamily.java
AU        apache-rat-core/src/main/java/org/apache/rat/ReportConfiguration.java
AU        apache-rat-core/src/main/java/org/apache/rat/ReportFailedRuntimeException.java
A         apache-rat-core/src/main/java/org/apache/rat/analysis
AU        apache-rat-core/src/main/java/org/apache/rat/analysis/IHeaderMatcher.java
AU        apache-rat-core/src/main/java/org/apache/rat/analysis/DocumentHeaderAnalyser.java
AU        apache-rat-core/src/main/java/org/apache/rat/analysis/DefaultAnalyserFactory.java
A         apache-rat-core/src/main/java/org/apache/rat/analysis/generation
AU        apache-rat-core/src/main/java/org/apache/rat/analysis/generation/JavaDocLicenseNotRequired.java
AU        apache-rat-core/src/main/java/org/apache/rat/analysis/generation/GeneratedLicenseNotRequired.java
A         apache-rat-core/src/main/java/org/apache/rat/analysis/util
AU        apache-rat-core/src/main/java/org/apache/rat/analysis/util/HeaderMatcherMultiplexer.java
AU        apache-rat-core/src/main/java/org/apache/rat/analysis/HeaderCheckWorker.java
AU        apache-rat-core/src/main/java/org/apache/rat/analysis/RatHeaderAnalysisException.java
A         apache-rat-core/src/main/java/org/apache/rat/analysis/license
AU        apache-rat-core/src/main/java/org/apache/rat/analysis/license/GPL1License.java
AU        apache-rat-core/src/main/java/org/apache/rat/analysis/license/DojoLicenseHeader.java
AU        apache-rat-core/src/main/java/org/apache/rat/analysis/license/GPL2License.java
AU        apache-rat-core/src/main/java/org/apache/rat/analysis/license/GPL3License.java
AU        apache-rat-core/src/main/java/org/apache/rat/analysis/license/BaseLicense.java
AU        apache-rat-core/src/main/java/org/apache/rat/analysis/license/CopyrightHeader.java
AU        apache-rat-core/src/main/java/org/apache/rat/analysis/license/OASISLicense.java
AU        apache-rat-core/src/main/java/org/apache/rat/analysis/license/FullTextMatchingLicense.java
AU        apache-rat-core/src/main/java/org/apache/rat/analysis/license/W3CDocLicense.java
AU        apache-rat-core/src/main/java/org/apache/rat/analysis/license/SimplePatternBasedLicense.java
AU        apache-rat-core/src/main/java/org/apache/rat/analysis/license/CDDL1License.java
AU        apache-rat-core/src/main/java/org/apache/rat/analysis/license/MITLicense.java
AU        apache-rat-core/src/main/java/org/apache/rat/analysis/license/W3CLicense.java
AU        apache-rat-core/src/main/java/org/apache/rat/analysis/license/AppliedApacheSoftwareLicense20.java
AU        apache-rat-core/src/main/java/org/apache/rat/analysis/license/ApacheSoftwareLicense20.java
AU        apache-rat-core/src/main/java/org/apache/rat/analysis/license/TMF854LicenseHeader.java
AU        apache-rat-core/src/main/java/org/apache/rat/analysis/RatReportAnalysisResultException.java
A         apache-rat-core/src/main/resources
A         apache-rat-core/src/main/resources/org
A         apache-rat-core/src/main/resources/org/apache
A         apache-rat-core/src/main/resources/org/apache/rat
AU        apache-rat-core/src/main/resources/org/apache/rat/unapproved-licenses.xsl
AU        apache-rat-core/src/main/resources/org/apache/rat/plain-rat.xsl
A         apache-rat-core/src/site
A         apache-rat-core/src/site/resources
A         apache-rat-core/src/site/resources/css
AU        apache-rat-core/src/site/resources/css/site.css
AU        apache-rat-core/src/site/site.xml
A         apache-rat-core/src/site/apt
AU        apache-rat-core/src/site/apt/index.apt.vm
AU        apache-rat-core/pom.xml
 U        .
At revision 1757120

No changes for http://svn.apache.org/repos/asf/creadur/rat/trunk since the previous build
No JDK named ?jdk-1.8.0? found
No JDK named ?jdk-1.8.0? found
Parsing POMs
Modules changed, recalculating dependency graph
Established TCP socket on 43328
maven32-agent.jar already up to date
maven32-interceptor.jar already up to date
maven3-interceptor-commons.jar already up to date
[Creadur-Rat-Site-Latest-Jdk] $ java -Xmx2g -Xms256m -XX:MaxPermSize=512m -cp /home/jenkins/jenkins-slave/maven32-agent.jar:/home/jenkins/tools/maven/apache-maven-3.2.1/boot/plexus-classworlds-2.5.1.jar:/home/jenkins/tools/maven/apache-maven-3.2.1/conf/logging
jenkins.maven3.agent.Maven32Main /home/jenkins/tools/maven/apache-maven-3.2.1 /home/jenkins/jenkins-slave/slave.jar
/home/jenkins/jenkins-slave/maven32-interceptor.jar /home/jenkins/jenkins-slave/maven3-interceptor-commons.jar
43328
<===[JENKINS REMOTING CAPACITY]===>   channel started
Executing Maven:  -B -f <https://builds.apache.org/job/Creadur-Rat-Site-Latest-Jdk/ws/pom.xml>
-Dmaven.repo.local=/home/jenkins/jenkins-slave/maven-repositories/0 -e clean site -Dmaven.test.skip=true
[INFO] Error stacktraces are turned on.
[INFO] Scanning for projects...
[INFO] Downloading: http://repo.maven.apache.org/maven2/org/apache/maven/wagon/wagon-ssh/1.0-beta-7/wagon-ssh-1.0-beta-7.pom
[INFO] Downloaded: http://repo.maven.apache.org/maven2/org/apache/maven/wagon/wagon-ssh/1.0-beta-7/wagon-ssh-1.0-beta-7.pom
(3 KB at 11.9 KB/sec)
[INFO] Downloading: http://repo.maven.apache.org/maven2/org/apache/maven/wagon/wagon-ssh/1.0-beta-7/wagon-ssh-1.0-beta-7.jar
[INFO] Downloaded: http://repo.maven.apache.org/maven2/org/apache/maven/wagon/wagon-ssh/1.0-beta-7/wagon-ssh-1.0-beta-7.jar
(28 KB at 249.5 KB/sec)
[INFO] ------------------------------------------------------------------------
[INFO] Reactor Build Order:
[INFO] 
[INFO] Apache Creadur Rat
[INFO] Apache Creadur Rat::API
[INFO] Apache Creadur Rat::Core
[INFO] Apache Creadur Rat::Plugin4Maven
[INFO] Apache Creadur Rat::Tasks4Ant
[INFO] Apache Creadur Rat::Command Line
[INFO] 
[INFO] Using the builder org.apache.maven.lifecycle.internal.builder.singlethreaded.SingleThreadedBuilder
with a thread count of 1
[INFO]                                                                         
[INFO] ------------------------------------------------------------------------
[INFO] Building Apache Creadur Rat 0.13-SNAPSHOT
[INFO] ------------------------------------------------------------------------
[INFO] 
[INFO] --- maven-clean-plugin:3.0.0:clean (default-clean) @ apache-rat-project ---
[INFO] 
[INFO] --- maven-antrun-plugin:1.7:run (copy-site-resources) @ apache-rat-project ---
[INFO] Executing tasks

main:
     [copy] Copying 1 file to <https://builds.apache.org/job/Creadur-Rat-Site-Latest-Jdk/ws/target/site>
[INFO] Executed tasks
[INFO] 
[INFO] --- maven-site-plugin:3.4:site (default-site) @ apache-rat-project ---
[INFO] configuring report plugin org.apache.maven.plugins:maven-changes-plugin:2.11
[INFO] Downloading: http://repo.maven.apache.org/maven2/org/apache/maven/plugins/maven-changes-plugin/2.11/maven-changes-plugin-2.11.pom
[INFO] Downloaded: http://repo.maven.apache.org/maven2/org/apache/maven/plugins/maven-changes-plugin/2.11/maven-changes-plugin-2.11.pom
(19 KB at 220.8 KB/sec)
[INFO] Downloading: http://repo.maven.apache.org/maven2/org/apache/maven/plugins/maven-changes-plugin/2.11/maven-changes-plugin-2.11.jar
[INFO] Downloaded: http://repo.maven.apache.org/maven2/org/apache/maven/plugins/maven-changes-plugin/2.11/maven-changes-plugin-2.11.jar
(209 KB at 1614.7 KB/sec)
[INFO] configuring report plugin org.apache.maven.plugins:maven-javadoc-plugin:2.10.4
[INFO] preparing 'javadoc' report requires 'generate-sources' forked phase execution
[INFO] 
[INFO] >>> maven-javadoc-plugin:2.10.4:javadoc @ apache-rat-project >>>
[INFO] 
[INFO] --- maven-enforcer-plugin:1.4.1:enforce (enforce-bytecode-version) @ apache-rat-project
---
[INFO] 
[INFO] --- apache-rat-plugin:0.12:check (default) @ apache-rat-project ---
[INFO] Enabled default license matchers.
[INFO] Will parse SCM ignores for exclusions...
[INFO] Parsing exclusions from <https://builds.apache.org/job/Creadur-Rat-Site-Latest-Jdk/ws/.gitignore>
[INFO] Finished adding exclusions from SCM ignore files.
[INFO] 78 implicit excludes (use -debug for more details).
[INFO] Exclude: BUILD.txt
[INFO] Exclude: apache-rat/README*.txt
[INFO] Exclude: apache-rat-core/src/test/resources/**
[INFO] Exclude: apache-rat*/target/**
[INFO] Exclude: apache-rat-plugin/src/test/resources/**
[INFO] Exclude: apache-rat-plugin/src/it/**
[INFO] Exclude: apache-rat-tasks/src/test/resources/**
[INFO] 16 resources included (use -debug for more details)
[INFO] Rat check: Summary over all files. Unapproved: 0, unknown: 0, generated: 0, approved:
11 licenses.
[INFO] 
[INFO] <<< maven-javadoc-plugin:2.10.4:javadoc @ apache-rat-project <<<
[INFO] Downloading: http://repo.maven.apache.org/maven2/org/apache/maven/plugins/maven-invoker-plugin/1.10/maven-invoker-plugin-1.10.pom
[INFO] Downloaded: http://repo.maven.apache.org/maven2/org/apache/maven/plugins/maven-invoker-plugin/1.10/maven-invoker-plugin-1.10.pom
(11 KB at 178.6 KB/sec)
[INFO] Downloading: http://repo.maven.apache.org/maven2/org/apache/maven/plugins/maven-invoker-plugin/1.10/maven-invoker-plugin-1.10.jar
[INFO] Downloaded: http://repo.maven.apache.org/maven2/org/apache/maven/plugins/maven-invoker-plugin/1.10/maven-invoker-plugin-1.10.jar
(103 KB at 1798.9 KB/sec)
[INFO] preparing 'aggregate' report requires 'generate-sources' forked phase execution
[INFO] 
[INFO] >>> maven-javadoc-plugin:2.10.4:aggregate @ apache-rat-project >>>
[INFO]                                                                         
[INFO] >>>>>>>>>>>>>>>>>>>>>>>>>>>>>>>>>>>>>>>>>>>>>>>>>>>>>>>>>>>>>>>>>>>>>>>>
[INFO] Forking Apache Creadur Rat 0.13-SNAPSHOT
[INFO] >>>>>>>>>>>>>>>>>>>>>>>>>>>>>>>>>>>>>>>>>>>>>>>>>>>>>>>>>>>>>>>>>>>>>>>>
[INFO] 
[INFO] --- maven-enforcer-plugin:1.4.1:enforce (enforce-bytecode-version) @ apache-rat-project
---
[INFO] 
[INFO] --- apache-rat-plugin:0.12:check (default) @ apache-rat-project ---
[INFO] Enabled default license matchers.
[INFO] Will parse SCM ignores for exclusions...
[INFO] Parsing exclusions from <https://builds.apache.org/job/Creadur-Rat-Site-Latest-Jdk/ws/.gitignore>
[INFO] Finished adding exclusions from SCM ignore files.
[INFO] 78 implicit excludes (use -debug for more details).
[INFO] Exclude: BUILD.txt
[INFO] Exclude: apache-rat/README*.txt
[INFO] Exclude: apache-rat-core/src/test/resources/**
[INFO] Exclude: apache-rat*/target/**
[INFO] Exclude: apache-rat-plugin/src/test/resources/**
[INFO] Exclude: apache-rat-plugin/src/it/**
[INFO] Exclude: apache-rat-tasks/src/test/resources/**
[INFO] 16 resources included (use -debug for more details)
[INFO] Rat check: Summary over all files. Unapproved: 0, unknown: 0, generated: 0, approved:
11 licenses.
[INFO]                                                                         
[INFO] >>>>>>>>>>>>>>>>>>>>>>>>>>>>>>>>>>>>>>>>>>>>>>>>>>>>>>>>>>>>>>>>>>>>>>>>
[INFO] Forking Apache Creadur Rat::API 0.13-SNAPSHOT
[INFO] >>>>>>>>>>>>>>>>>>>>>>>>>>>>>>>>>>>>>>>>>>>>>>>>>>>>>>>>>>>>>>>>>>>>>>>>
[INFO] 
[INFO] --- maven-enforcer-plugin:1.4.1:enforce (enforce-bytecode-version) @ apache-rat-api
---
[JENKINS] Archiving site from <https://builds.apache.org/job/Creadur-Rat-Site-Latest-Jdk/ws/target/site>
to /x1/jenkins/jenkins-home/jobs/Creadur-Rat-Site-Latest-Jdk/site
[INFO] ------------------------------------------------------------------------
[INFO] Reactor Summary:
[INFO] 
[INFO] Apache Creadur Rat ................................ FAILURE [ 26.521 s]
[INFO] Apache Creadur Rat::API ........................... SKIPPED
[INFO] Apache Creadur Rat::Core .......................... SKIPPED
[INFO] Apache Creadur Rat::Plugin4Maven .................. SKIPPED
[INFO] Apache Creadur Rat::Tasks4Ant ..................... SKIPPED
[INFO] Apache Creadur Rat::Command Line .................. SKIPPED
[INFO] ------------------------------------------------------------------------
[INFO] BUILD FAILURE
[INFO] ------------------------------------------------------------------------
[INFO] Total time: 30.284 s
[INFO] Finished at: 2016-08-22T09:06:43+00:00
[INFO] Final Memory: 38M/448M
[INFO] ------------------------------------------------------------------------
Waiting for Jenkins to finish collecting data[ERROR] Failed to execute goal org.apache.maven.plugins:maven-site-plugin:3.4:site
(default-site) on project apache-rat-project: failed to get report for org.apache.maven.plugins:maven-javadoc-plugin:
Failed to execute goal org.apache.maven.plugins:maven-enforcer-plugin:1.4.1:enforce (enforce-bytecode-version)
on project apache-rat-api: Execution enforce-bytecode-version of goal org.apache.maven.plugins:maven-enforcer-plugin:1.4.1:enforce
failed. NullPointerException -> [Help 1]
org.apache.maven.lifecycle.LifecycleExecutionException: Failed to execute goal org.apache.maven.plugins:maven-site-plugin:3.4:site
(default-site) on project apache-rat-project: failed to get report for org.apache.maven.plugins:maven-javadoc-plugin
	at org.apache.maven.lifecycle.internal.MojoExecutor.execute(MojoExecutor.java:216)
	at org.apache.maven.lifecycle.internal.MojoExecutor.execute(MojoExecutor.java:153)
	at org.apache.maven.lifecycle.internal.MojoExecutor.execute(MojoExecutor.java:145)
	at org.apache.maven.lifecycle.internal.LifecycleModuleBuilder.buildProject(LifecycleModuleBuilder.java:108)
	at org.apache.maven.lifecycle.internal.LifecycleModuleBuilder.buildProject(LifecycleModuleBuilder.java:76)
	at org.apache.maven.lifecycle.internal.builder.singlethreaded.SingleThreadedBuilder.build(SingleThreadedBuilder.java:51)
	at org.apache.maven.lifecycle.internal.LifecycleStarter.execute(LifecycleStarter.java:116)
	at org.apache.maven.DefaultMaven.doExecute(DefaultMaven.java:361)
	at org.apache.maven.DefaultMaven.execute(DefaultMaven.java:155)
	at org.jvnet.hudson.maven3.launcher.Maven32Launcher.main(Maven32Launcher.java:132)
	at sun.reflect.NativeMethodAccessorImpl.invoke0(Native Method)
	at sun.reflect.NativeMethodAccessorImpl.invoke(NativeMethodAccessorImpl.java:57)
	at sun.reflect.DelegatingMethodAccessorImpl.invoke(DelegatingMethodAccessorImpl.java:43)
	at java.lang.reflect.Method.invoke(Method.java:606)
	at org.codehaus.plexus.classworlds.launcher.Launcher.launchStandard(Launcher.java:330)
	at org.codehaus.plexus.classworlds.launcher.Launcher.launch(Launcher.java:238)
	at jenkins.maven3.agent.Maven32Main.launch(Maven32Main.java:186)
	at sun.reflect.NativeMethodAccessorImpl.invoke0(Native Method)
	at sun.reflect.NativeMethodAccessorImpl.invoke(NativeMethodAccessorImpl.java:57)
	at sun.reflect.DelegatingMethodAccessorImpl.invoke(DelegatingMethodAccessorImpl.java:43)
	at java.lang.reflect.Method.invoke(Method.java:606)
	at hudson.maven.Maven3Builder.call(Maven3Builder.java:136)
	at hudson.maven.Maven3Builder.call(Maven3Builder.java:71)
	at hudson.remoting.UserRequest.perform(UserRequest.java:153)
	at hudson.remoting.UserRequest.perform(UserRequest.java:50)
	at hudson.remoting.Request$2.run(Request.java:332)
	at hudson.remoting.InterceptingExecutorService$1.call(InterceptingExecutorService.java:68)
	at java.util.concurrent.FutureTask.run(FutureTask.java:262)
	at java.util.concurrent.ThreadPoolExecutor.runWorker(ThreadPoolExecutor.java:1145)
	at java.util.concurrent.ThreadPoolExecutor$Worker.run(ThreadPoolExecutor.java:615)
	at java.lang.Thread.run(Thread.java:745)
Caused by: org.apache.maven.plugin.MojoExecutionException: failed to get report for org.apache.maven.plugins:maven-javadoc-plugin
	at org.apache.maven.reporting.exec.DefaultMavenReportExecutor.buildMavenReports(DefaultMavenReportExecutor.java:156)
	at org.apache.maven.plugins.site.render.AbstractSiteRenderingMojo.getReports(AbstractSiteRenderingMojo.java:239)
	at org.apache.maven.plugins.site.render.SiteMojo.execute(SiteMojo.java:124)
	at org.apache.maven.plugin.DefaultBuildPluginManager.executeMojo(DefaultBuildPluginManager.java:133)
	at org.apache.maven.lifecycle.internal.MojoExecutor.execute(MojoExecutor.java:208)
	... 30 more
Caused by: org.apache.maven.lifecycle.LifecycleExecutionException: Failed to execute goal
org.apache.maven.plugins:maven-enforcer-plugin:1.4.1:enforce (enforce-bytecode-version) on
project apache-rat-api: Execution enforce-bytecode-version of goal org.apache.maven.plugins:maven-enforcer-plugin:1.4.1:enforce
failed.
	at org.apache.maven.lifecycle.internal.MojoExecutor.execute(MojoExecutor.java:224)
	at org.apache.maven.lifecycle.internal.MojoExecutor.execute(MojoExecutor.java:153)
	at org.apache.maven.lifecycle.internal.MojoExecutor.execute(MojoExecutor.java:145)
	at org.apache.maven.lifecycle.internal.MojoExecutor.executeForkedExecutions(MojoExecutor.java:364)
	at org.apache.maven.lifecycle.DefaultLifecycleExecutor.executeForkedExecutions(DefaultLifecycleExecutor.java:173)
	at org.apache.maven.reporting.exec.DefaultMavenReportExecutor.buildReportPlugin(DefaultMavenReportExecutor.java:309)
	at org.apache.maven.reporting.exec.DefaultMavenReportExecutor.buildMavenReports(DefaultMavenReportExecutor.java:151)
	... 34 more
Caused by: org.apache.maven.plugin.PluginExecutionException: Execution enforce-bytecode-version
of goal org.apache.maven.plugins:maven-enforcer-plugin:1.4.1:enforce failed.
	at org.apache.maven.plugin.DefaultBuildPluginManager.executeMojo(DefaultBuildPluginManager.java:144)
	at org.apache.maven.lifecycle.internal.MojoExecutor.execute(MojoExecutor.java:208)
	... 40 more
Caused by: java.lang.NullPointerException
	at org.apache.maven.plugins.enforcer.EnforceBytecodeVersion.isBadArtifact(EnforceBytecodeVersion.java:195)
	at org.apache.maven.plugins.enforcer.EnforceBytecodeVersion.checkDependencies(EnforceBytecodeVersion.java:182)
	at org.apache.maven.plugins.enforcer.EnforceBytecodeVersion.handleArtifacts(EnforceBytecodeVersion.java:109)
	at org.apache.maven.plugins.enforcer.AbstractResolveDependencies.execute(AbstractResolveDependencies.java:77)
	at org.apache.maven.plugins.enforcer.EnforceMojo.execute(EnforceMojo.java:193)
	at org.apache.maven.plugin.DefaultBuildPluginManager.executeMojo(DefaultBuildPluginManager.java:133)
	... 41 more
[ERROR] 
[ERROR] Re-run Maven using the -X switch to enable full debug logging.
[ERROR] 
[ERROR] For more information about the errors and possible solutions, please read the following
articles:
[ERROR] [Help 1] http://cwiki.apache.org/confluence/display/MAVEN/MojoExecutionException

[JENKINS] Archiving <https://builds.apache.org/job/Creadur-Rat-Site-Latest-Jdk/ws/apache-rat-plugin/pom.xml>
to org.apache.rat/apache-rat-plugin/0.13-SNAPSHOT/apache-rat-plugin-0.13-SNAPSHOT.pom
[JENKINS] Archiving <https://builds.apache.org/job/Creadur-Rat-Site-Latest-Jdk/ws/apache-rat-api/pom.xml>
to org.apache.rat/apache-rat-api/0.13-SNAPSHOT/apache-rat-api-0.13-SNAPSHOT.pom
[JENKINS] Archiving <https://builds.apache.org/job/Creadur-Rat-Site-Latest-Jdk/ws/apache-rat/pom.xml>
to org.apache.rat/apache-rat/0.13-SNAPSHOT/apache-rat-0.13-SNAPSHOT.pom
[JENKINS] Archiving <https://builds.apache.org/job/Creadur-Rat-Site-Latest-Jdk/ws/pom.xml>
to org.apache.rat/apache-rat-project/0.13-SNAPSHOT/apache-rat-project-0.13-SNAPSHOT.pom
[JENKINS] Archiving <https://builds.apache.org/job/Creadur-Rat-Site-Latest-Jdk/ws/apache-rat-core/pom.xml>
to org.apache.rat/apache-rat-core/0.13-SNAPSHOT/apache-rat-core-0.13-SNAPSHOT.pom
[JENKINS] Archiving <https://builds.apache.org/job/Creadur-Rat-Site-Latest-Jdk/ws/apache-rat-tasks/pom.xml>
to org.apache.rat/apache-rat-tasks/0.13-SNAPSHOT/apache-rat-tasks-0.13-SNAPSHOT.pom
channel stopped
No JDK named ?jdk-1.8.0? found

Mime
View raw message