creadur-dev mailing list archives

Site index · List index
Message view « Date » · « Thread »
Top « Date » · « Thread »
From Apache Jenkins Server <jenk...@builds.apache.org>
Subject Build failed in Jenkins: Creadur-Rat-Latest-Jdk #178
Date Sun, 27 Sep 2015 15:03:53 GMT
See <https://builds.apache.org/job/Creadur-Rat-Latest-Jdk/178/changes>

Changes:

[jochen] PR: RAT-208

Added includesFile, excludesFile, includesFileCharacterset, and excludesFileCharacterset parameters,
and support thereof.

------------------------------------------
[...truncated 1533 lines...]
[INFO] Build
Tooling API is using target Gradle version: 2.4.
Connected to daemon DaemonInfo{pid=4003, address=[5659b21e-8a2e-40ea-bc2b-682c180d29a4 port:46607,
addresses:[/0:0:0:0:0:0:0:1%lo, /127.0.0.1]], idle=true, context=DefaultDaemonContext[uid=64a6c082-7fc3-4e2a-98d2-7424f48f6edd,javaHome=/home/jenkins/jenkins-slave/tools/hudson.model.JDK/jdk-1.8.0,daemonRegistryDir=/home/jenkins/.gradle/daemon,pid=4003,idleTimeout=10800000,daemonOpts=-XX:MaxPermSize=256m,-XX:+HeapDumpOnOutOfMemoryError,-Xmx1024m,-Dfile.encoding=ISO-8859-1,-Duser.country=US,-Duser.language=en,-Duser.variant]}.
Dispatching request Build{id=b564d073-6a45-4600-a5ee-7ce1debe9067.1, currentDir=<https://builds.apache.org/job/Creadur-Rat-Latest-Jdk/ws/}.>
[INFO] Initialize build
[INFO] Resolve dependencies 'classpath'
[INFO] Initialize build
[INFO] Configure projects
[INFO] Configure project :
[INFO] Resolve dependencies ':classpath'
[INFO] Configure project :
[INFO] Configure projects
[INFO] Initialize build
[INFO] Build
[INFO] Execute tasks
:compileJava[INFO] Execute :compileJava
 UP-TO-DATE
[INFO] Execute tasks
:compileGroovy[INFO] Execute :compileGroovy
[INFO] Resolve dependencies ':compile'
[INFO] Execute :compileGroovy
 UP-TO-DATE
[INFO] Execute tasks
:processResources[INFO] Execute :processResources
 UP-TO-DATE
[INFO] Execute tasks
:classes[INFO] Execute :classes
 UP-TO-DATE
[INFO] Execute tasks
:jar[INFO] Execute :jar

[INFO] Execute tasks
:groovydoc[INFO] Execute :groovydoc

[INFO] Execute tasks
:publishPluginGroovyDocsJar[INFO] Execute :publishPluginGroovyDocsJar

[INFO] Execute tasks
:publishPluginJar[INFO] Execute :publishPluginJar

[INFO] Execute tasks
:javadoc[INFO] Execute :javadoc
 UP-TO-DATE
[INFO] Execute tasks
:publishPluginJavaDocsJar[INFO] Execute :publishPluginJavaDocsJar

[INFO] Execute tasks
:assemble[INFO] Execute :assemble

[INFO] Execute tasks

BUILD SUCCESSFUL

Total time: 3.706 secs
[INFO] Build
Received result Success[value=org.gradle.tooling.internal.provider.BuildActionResult@2a8df6ff]
from daemon DaemonInfo{pid=4003, address=[5659b21e-8a2e-40ea-bc2b-682c180d29a4 port:46607,
addresses:[/0:0:0:0:0:0:0:1%lo, /127.0.0.1]], idle=true, context=DefaultDaemonContext[uid=64a6c082-7fc3-4e2a-98d2-7424f48f6edd,javaHome=/home/jenkins/jenkins-slave/tools/hudson.model.JDK/jdk-1.8.0,daemonRegistryDir=/home/jenkins/.gradle/daemon,pid=4003,idleTimeout=10800000,daemonOpts=-XX:MaxPermSize=256m,-XX:+HeapDumpOnOutOfMemoryError,-Xmx1024m,-Dfile.encoding=ISO-8859-1,-Duser.country=US,-Duser.language=en,-Duser.variant]}.
[INFO] 
[INFO] gradle execution complete
[INFO] 
[INFO] --- maven-antrun-plugin:1.8:run (default) @ apache-rat-gradle ---
[INFO] Executing tasks

main:
     [copy] Copying 1 file to <https://builds.apache.org/job/Creadur-Rat-Latest-Jdk/ws/apache-rat-gradle/target>
     [copy] Copying 1 file to <https://builds.apache.org/job/Creadur-Rat-Latest-Jdk/ws/apache-rat-gradle/target>
     [copy] Copying 1 file to <https://builds.apache.org/job/Creadur-Rat-Latest-Jdk/ws/apache-rat-gradle/target>
     [copy] Copying 1 file to <https://builds.apache.org/job/Creadur-Rat-Latest-Jdk/ws/apache-rat-gradle/target>
[INFO] Executed tasks
[INFO] 
[INFO] --- maven-install-plugin:2.5.2:install (default-install) @ apache-rat-gradle ---
[INFO] Installing <https://builds.apache.org/job/Creadur-Rat-Latest-Jdk/ws/apache-rat-gradle/target/apache-rat-gradle-0.12-SNAPSHOT.jar>
to /home/jenkins/jenkins-slave/maven-repositories/1/org/apache/rat/apache-rat-gradle/0.12-SNAPSHOT/apache-rat-gradle-0.12-SNAPSHOT.jar
[INFO] Installing <https://builds.apache.org/job/Creadur-Rat-Latest-Jdk/ws/apache-rat-gradle/pom.xml>
to /home/jenkins/jenkins-slave/maven-repositories/1/org/apache/rat/apache-rat-gradle/0.12-SNAPSHOT/apache-rat-gradle-0.12-SNAPSHOT.pom
[INFO]                                                                         
[INFO] ------------------------------------------------------------------------
[INFO] Building Apache Creadur Rat::Command Line 0.12-SNAPSHOT
[INFO] ------------------------------------------------------------------------
[INFO] 
[INFO] --- maven-clean-plugin:2.5:clean (default-clean) @ apache-rat ---
[INFO] 
[INFO] --- maven-enforcer-plugin:1.3.1:enforce (enforce-bytecode-version) @ apache-rat ---
[INFO] 
[INFO] --- apache-rat-plugin:0.11:check (default) @ apache-rat ---
[INFO] 51 implicit excludes (use -debug for more details).
[INFO] Exclude: README-ANT.txt
[INFO] Exclude: README-CLI.txt
[INFO] 7 resources included (use -debug for more details)
[INFO] Rat check: Summary of files. Unapproved: 0 unknown: 0 generated: 0 approved: 6 licence.
[INFO] 
[INFO] --- maven-remote-resources-plugin:1.5:process (default) @ apache-rat ---
[INFO] 
[INFO] --- maven-resources-plugin:2.7:resources (default-resources) @ apache-rat ---
[INFO] Using 'UTF-8' encoding to copy filtered resources.
[INFO] Copying 3 resources to META-INF
[INFO] Copying 3 resources
[INFO] 
[INFO] --- maven-compiler-plugin:3.2:compile (default-compile) @ apache-rat ---
[INFO] No sources to compile
[INFO] 
[INFO] --- animal-sniffer-maven-plugin:1.11:check (check-java-1.5-compat) @ apache-rat ---
[INFO] Signature checking is skipped.
[INFO] 
[INFO] --- maven-resources-plugin:2.7:testResources (default-testResources) @ apache-rat ---
[INFO] Using 'UTF-8' encoding to copy filtered resources.
[INFO] skip non existing resourceDirectory <https://builds.apache.org/job/Creadur-Rat-Latest-Jdk/ws/apache-rat/src/test/resources>
[INFO] Copying 3 resources
[INFO] 
[INFO] --- maven-compiler-plugin:3.2:testCompile (default-testCompile) @ apache-rat ---
[INFO] No sources to compile
[INFO] 
[INFO] --- maven-surefire-plugin:2.18.1:test (default-test) @ apache-rat ---
[JENKINS] Recording test results[INFO] 
[INFO] --- maven-dependency-plugin:2.8:unpack-dependencies (default) @ apache-rat ---
[INFO] Unpacking /home/jenkins/jenkins-slave/maven-repositories/1/commons-lang/commons-lang/2.6/commons-lang-2.6.jar
to <https://builds.apache.org/job/Creadur-Rat-Latest-Jdk/ws/apache-rat/target/classes>
with includes "" and excludes "META-INF/**"

[INFO] Unpacking <https://builds.apache.org/job/Creadur-Rat-Latest-Jdk/ws/apache-rat-core/target/apache-rat-core-0.12-SNAPSHOT.jar>
to <https://builds.apache.org/job/Creadur-Rat-Latest-Jdk/ws/apache-rat/target/classes>
with includes "" and excludes "META-INF/**"
[INFO] Unpacking <https://builds.apache.org/job/Creadur-Rat-Latest-Jdk/ws/apache-rat-api/target/apache-rat-api-0.12-SNAPSHOT.jar>
to <https://builds.apache.org/job/Creadur-Rat-Latest-Jdk/ws/apache-rat/target/classes>
with includes "" and excludes "META-INF/**"
[INFO] Unpacking /home/jenkins/jenkins-slave/maven-repositories/1/org/apache/commons/commons-compress/1.5/commons-compress-1.5.jar
to <https://builds.apache.org/job/Creadur-Rat-Latest-Jdk/ws/apache-rat/target/classes>
with includes "" and excludes "META-INF/**"
[INFO] Unpacking /home/jenkins/jenkins-slave/maven-repositories/1/commons-cli/commons-cli/1.2/commons-cli-1.2.jar
to <https://builds.apache.org/job/Creadur-Rat-Latest-Jdk/ws/apache-rat/target/classes>
with includes "" and excludes "META-INF/**"
[INFO] Unpacking /home/jenkins/jenkins-slave/maven-repositories/1/commons-io/commons-io/2.2/commons-io-2.2.jar
to <https://builds.apache.org/job/Creadur-Rat-Latest-Jdk/ws/apache-rat/target/classes>
with includes "" and excludes "META-INF/**"
[INFO] Unpacking /home/jenkins/jenkins-slave/maven-repositories/1/commons-collections/commons-collections/3.2.1/commons-collections-3.2.1.jar
to <https://builds.apache.org/job/Creadur-Rat-Latest-Jdk/ws/apache-rat/target/classes>
with includes "" and excludes "META-INF/**"
[INFO] Unpacking <https://builds.apache.org/job/Creadur-Rat-Latest-Jdk/ws/apache-rat-tasks/target/apache-rat-tasks-0.12-SNAPSHOT.jar>
to <https://builds.apache.org/job/Creadur-Rat-Latest-Jdk/ws/apache-rat/target/classes>
with includes "" and excludes "META-INF/**"
[INFO] 
[INFO] --- maven-jar-plugin:2.5:jar (default-jar) @ apache-rat ---
[INFO] Building jar: <https://builds.apache.org/job/Creadur-Rat-Latest-Jdk/ws/apache-rat/target/apache-rat-0.12-SNAPSHOT.jar>
[INFO] 
[INFO] --- maven-site-plugin:3.4:attach-descriptor (attach-descriptor) @ apache-rat ---
[INFO] 
[INFO] --- maven-install-plugin:2.5.2:install (default-install) @ apache-rat ---
[INFO] Installing <https://builds.apache.org/job/Creadur-Rat-Latest-Jdk/ws/apache-rat/target/apache-rat-0.12-SNAPSHOT.jar>
to /home/jenkins/jenkins-slave/maven-repositories/1/org/apache/rat/apache-rat/0.12-SNAPSHOT/apache-rat-0.12-SNAPSHOT.jar
[INFO] Installing <https://builds.apache.org/job/Creadur-Rat-Latest-Jdk/ws/apache-rat/pom.xml>
to /home/jenkins/jenkins-slave/maven-repositories/1/org/apache/rat/apache-rat/0.12-SNAPSHOT/apache-rat-0.12-SNAPSHOT.pom
[INFO] ------------------------------------------------------------------------
[INFO] Reactor Summary:
[INFO] 
[INFO] Apache Creadur Rat ................................ SUCCESS [  4.419 s]
[INFO] Apache Creadur Rat::API ........................... SUCCESS [  8.436 s]
[INFO] Apache Creadur Rat::Core .......................... SUCCESS [  4.941 s]
[INFO] Apache Creadur Rat::Plugin4Maven .................. FAILURE [  1.463 s]
[INFO] Apache Creadur Rat::Tasks4Ant ..................... SUCCESS [  5.157 s]
[INFO] Apache Creadur Rat::Plugin4Gradle ................. SUCCESS [ 39.595 s]
[INFO] Apache Creadur Rat::Command Line .................. SUCCESS [  1.770 s]
[INFO] ------------------------------------------------------------------------
[INFO] BUILD FAILURE
[INFO] ------------------------------------------------------------------------
[INFO] Total time: 01:11 min
[INFO] Finished at: 2015-09-27T15:04:16+00:00
[INFO] Final Memory: 48M/667M
[INFO] ------------------------------------------------------------------------
[WARNING] The requested profile "rat" could not be activated because it does not exist.
[ERROR] Failed to execute goal org.apache.maven.plugins:maven-enforcer-plugin:1.3.1:enforce
(enforce-bytecode-version) on project apache-rat-plugin: Some Enforcer rules have failed.
Look above for specific messages explaining why the rule failed. -> [Help 1]
org.apache.maven.lifecycle.LifecycleExecutionException: Failed to execute goal org.apache.maven.plugins:maven-enforcer-plugin:1.3.1:enforce
(enforce-bytecode-version) on project apache-rat-plugin: Some Enforcer rules have failed.
Look above for specific messages explaining why the rule failed.
	at org.apache.maven.lifecycle.internal.MojoExecutor.execute(MojoExecutor.java:216)
	at org.apache.maven.lifecycle.internal.MojoExecutor.execute(MojoExecutor.java:153)
	at org.apache.maven.lifecycle.internal.MojoExecutor.execute(MojoExecutor.java:145)
	at org.apache.maven.lifecycle.internal.LifecycleModuleBuilder.buildProject(LifecycleModuleBuilder.java:108)
	at org.apache.maven.lifecycle.internal.LifecycleModuleBuilder.buildProject(LifecycleModuleBuilder.java:76)
	at org.apache.maven.lifecycle.internal.builder.singlethreaded.SingleThreadedBuilder.build(SingleThreadedBuilder.java:51)
	at org.apache.maven.lifecycle.internal.LifecycleStarter.execute(LifecycleStarter.java:116)
	at org.apache.maven.DefaultMaven.doExecute(DefaultMaven.java:361)
	at org.apache.maven.DefaultMaven.execute(DefaultMaven.java:155)
	at org.jvnet.hudson.maven3.launcher.Maven31Launcher.main(Maven31Launcher.java:132)
	at sun.reflect.NativeMethodAccessorImpl.invoke0(Native Method)
	at sun.reflect.NativeMethodAccessorImpl.invoke(NativeMethodAccessorImpl.java:62)
	at sun.reflect.DelegatingMethodAccessorImpl.invoke(DelegatingMethodAccessorImpl.java:43)
	at java.lang.reflect.Method.invoke(Method.java:483)
	at org.codehaus.plexus.classworlds.launcher.Launcher.launchStandard(Launcher.java:330)
	at org.codehaus.plexus.classworlds.launcher.Launcher.launch(Launcher.java:238)
	at jenkins.maven3.agent.Maven31Main.launch(Maven31Main.java:181)
	at sun.reflect.NativeMethodAccessorImpl.invoke0(Native Method)
	at sun.reflect.NativeMethodAccessorImpl.invoke(NativeMethodAccessorImpl.java:62)
	at sun.reflect.DelegatingMethodAccessorImpl.invoke(DelegatingMethodAccessorImpl.java:43)
	at java.lang.reflect.Method.invoke(Method.java:483)
	at hudson.maven.Maven3Builder.call(Maven3Builder.java:136)
	at hudson.maven.Maven3Builder.call(Maven3Builder.java:71)
	at hudson.remoting.UserRequest.perform(UserRequest.java:118)
	at hudson.remoting.UserRequest.perform(UserRequest.java:48)
	at hudson.remoting.Request$2.run(Request.java:328)
	at hudson.remoting.InterceptingExecutorService$1.call(InterceptingExecutorService.java:72)
	at java.util.concurrent.FutureTask.run(FutureTask.java:266)
	at java.util.concurrent.ThreadPoolExecutor.runWorker(ThreadPoolExecutor.java:1142)
	at java.util.concurrent.ThreadPoolExecutor$Worker.run(ThreadPoolExecutor.java:617)
	at java.lang.Thread.run(Thread.java:745)
Caused by: org.apache.maven.plugin.MojoExecutionException: Some Enforcer rules have failed.
Look above for specific messages explaining why the rule failed.
	at org.apache.maven.plugins.enforcer.EnforceMojo.execute(EnforceMojo.java:209)
	at org.apache.maven.plugin.DefaultBuildPluginManager.executeMojo(DefaultBuildPluginManager.java:133)
	at org.apache.maven.lifecycle.internal.MojoExecutor.execute(MojoExecutor.java:208)
	... 30 more
[ERROR] 
[ERROR] Re-run Maven using the -X switch to enable full debug logging.
[ERROR] 
[ERROR] For more information about the errors and possible solutions, please read the following
articles:
[ERROR] [Help 1] http://cwiki.apache.org/confluence/display/MAVEN/MojoExecutionException
[ERROR] 
[ERROR] After correcting the problems, you can resume the build with the command
[ERROR]   mvn <goals> -rf :apache-rat-plugin
[JENKINS] Archiving <https://builds.apache.org/job/Creadur-Rat-Latest-Jdk/ws/apache-rat-gradle/pom.xml>
to org.apache.rat/apache-rat-gradle/0.12-SNAPSHOT/apache-rat-gradle-0.12-SNAPSHOT.pom
[JENKINS] Archiving <https://builds.apache.org/job/Creadur-Rat-Latest-Jdk/ws/apache-rat-gradle/target/apache-rat-gradle-0.12-SNAPSHOT.jar>
to org.apache.rat/apache-rat-gradle/0.12-SNAPSHOT/apache-rat-gradle-0.12-SNAPSHOT.jar
Sending artifact delta relative to Creadur-Rat-Latest-Jdk » Apache Creadur Rat::Plugin4Gradle
#177
Archived 2 artifacts
Archive block size is 32768
Received 0 blocks and 45117 bytes
Compression is 0.0%
Took 98 ms
[JENKINS] Archiving <https://builds.apache.org/job/Creadur-Rat-Latest-Jdk/ws/apache-rat-plugin/pom.xml>
to org.apache.rat/apache-rat-plugin/0.12-SNAPSHOT/apache-rat-plugin-0.12-SNAPSHOT.pom
Sending artifact delta relative to Creadur-Rat-Latest-Jdk » Apache Creadur Rat::Plugin4Maven
#177
Archived 1 artifacts
Archive block size is 32768
Received 0 blocks and 10200 bytes
Compression is 0.0%
Took 26 ms
[JENKINS] Archiving <https://builds.apache.org/job/Creadur-Rat-Latest-Jdk/ws/apache-rat-tasks/pom.xml>
to org.apache.rat/apache-rat-tasks/0.12-SNAPSHOT/apache-rat-tasks-0.12-SNAPSHOT.pom
[JENKINS] Archiving <https://builds.apache.org/job/Creadur-Rat-Latest-Jdk/ws/apache-rat-tasks/target/apache-rat-tasks-0.12-SNAPSHOT.jar>
to org.apache.rat/apache-rat-tasks/0.12-SNAPSHOT/apache-rat-tasks-0.12-SNAPSHOT.jar
Sending artifact delta relative to Creadur-Rat-Latest-Jdk » Apache Creadur Rat::Tasks4Ant
#177
Archived 2 artifacts
Archive block size is 32768
Received 0 blocks and 31958 bytes
Compression is 0.0%
Took 28 ms
[JENKINS] Archiving <https://builds.apache.org/job/Creadur-Rat-Latest-Jdk/ws/pom.xml>
to org.apache.rat/apache-rat-project/0.12-SNAPSHOT/apache-rat-project-0.12-SNAPSHOT.pom
[JENKINS] Archiving <https://builds.apache.org/job/Creadur-Rat-Latest-Jdk/ws/target/apache-rat-project-0.12-SNAPSHOT-site.xml>
to org.apache.rat/apache-rat-project/0.12-SNAPSHOT/apache-rat-project-0.12-SNAPSHOT-site.xml
Sending artifact delta relative to Creadur-Rat-Latest-Jdk » Apache Creadur Rat #177
Archived 2 artifacts
Archive block size is 32768
Received 0 blocks and 27831 bytes
Compression is 0.0%
Took 28 ms
[JENKINS] Archiving <https://builds.apache.org/job/Creadur-Rat-Latest-Jdk/ws/apache-rat-api/pom.xml>
to org.apache.rat/apache-rat-api/0.12-SNAPSHOT/apache-rat-api-0.12-SNAPSHOT.pom
[JENKINS] Archiving <https://builds.apache.org/job/Creadur-Rat-Latest-Jdk/ws/apache-rat-api/target/apache-rat-api-0.12-SNAPSHOT.jar>
to org.apache.rat/apache-rat-api/0.12-SNAPSHOT/apache-rat-api-0.12-SNAPSHOT.jar
Sending artifact delta relative to Creadur-Rat-Latest-Jdk » Apache Creadur Rat::API #177
Archived 2 artifacts
Archive block size is 32768
Received 0 blocks and 12695 bytes
Compression is 0.0%
Took 27 ms
[JENKINS] Archiving <https://builds.apache.org/job/Creadur-Rat-Latest-Jdk/ws/apache-rat/pom.xml>
to org.apache.rat/apache-rat/0.12-SNAPSHOT/apache-rat-0.12-SNAPSHOT.pom
[JENKINS] Archiving <https://builds.apache.org/job/Creadur-Rat-Latest-Jdk/ws/apache-rat/target/apache-rat-0.12-SNAPSHOT.jar>
to org.apache.rat/apache-rat/0.12-SNAPSHOT/apache-rat-0.12-SNAPSHOT.jar
Sending artifact delta relative to Creadur-Rat-Latest-Jdk » Apache Creadur Rat::Command Line
#177
Archived 2 artifacts
Archive block size is 32768
Received 38 blocks and 203723 bytes
Compression is 85.9%
Took 0.11 sec
[JENKINS] Archiving <https://builds.apache.org/job/Creadur-Rat-Latest-Jdk/ws/apache-rat-core/pom.xml>
to org.apache.rat/apache-rat-core/0.12-SNAPSHOT/apache-rat-core-0.12-SNAPSHOT.pom
[JENKINS] Archiving <https://builds.apache.org/job/Creadur-Rat-Latest-Jdk/ws/apache-rat-core/target/apache-rat-core-0.12-SNAPSHOT.jar>
to org.apache.rat/apache-rat-core/0.12-SNAPSHOT/apache-rat-core-0.12-SNAPSHOT.jar
Sending artifact delta relative to Creadur-Rat-Latest-Jdk » Apache Creadur Rat::Core #177
Archived 2 artifacts
Archive block size is 32768
Received 0 blocks and 131874 bytes
Compression is 0.0%
Took 59 ms
channel stopped

Mime
View raw message