creadur-dev mailing list archives

Site index · List index
Message view « Date » · « Thread »
Top « Date » · « Thread »
From Apache Jenkins Server <jenk...@builds.apache.org>
Subject Build failed in Jenkins: Creadur-Rat #283
Date Sat, 26 Sep 2015 11:33:05 GMT
See <https://builds.apache.org/job/Creadur-Rat/283/>

------------------------------------------
[...truncated 1635 lines...]
[INFO] Using 'UTF-8' encoding to copy filtered resources.
[INFO] skip non existing resourceDirectory <https://builds.apache.org/job/Creadur-Rat/ws/apache-rat-gradle/src/test/resources>
[INFO] Copying 3 resources
[INFO] 
[INFO] --- maven-compiler-plugin:3.2:testCompile (default-testCompile) @ apache-rat-gradle
---
[INFO] No sources to compile
[INFO] 
[INFO] --- maven-surefire-plugin:2.18.1:test (default-test) @ apache-rat-gradle ---
[JENKINS] Recording test results[INFO] 

[INFO] --- gradle-maven-plugin:1.0.7:invoke (gradle-test) @ apache-rat-gradle ---
[INFO] jvmArgs: [Ljava.lang.String;@12650fe
[INFO] gradleProjectDirectory: <https://builds.apache.org/job/Creadur-Rat/ws/apache-rat-gradle/src/gradle>
[INFO] Build
[INFO] Validate distribution
[INFO] Build
Tooling API is using target Gradle version: 2.4.
Connected to daemon DaemonInfo{pid=27582, address=[3d16b79c-5ce1-4add-a534-50be8bd950e7 port:47142,
addresses:[/0:0:0:0:0:0:0:1%1, /127.0.0.1]], idle=true, context=DefaultDaemonContext[uid=ed601b91-fecb-486b-8871-0b22ad18a667,javaHome=/x1/jenkins/tools/java/jdk1.6.0_45-32,daemonRegistryDir=/home/jenkins/.gradle/daemon,pid=27582,idleTimeout=10800000,daemonOpts=-XX:MaxPermSize=256m,-XX:+HeapDumpOnOutOfMemoryError,-Xmx1024m,-Dfile.encoding=US-ASCII,-Duser.country=US,-Duser.language=en,-Duser.variant]}.
Dispatching request Build{id=5bb05f97-3eef-4f4e-9121-05ddf733e11a.1, currentDir=/x1/jenkins/jenkins-slave/workspace/Creadur-Rat}.
[INFO] Initialize build
[INFO] Resolve dependencies 'classpath'
[INFO] Initialize build
[INFO] Configure projects
[INFO] Configure project :
[INFO] Resolve dependencies ':classpath'
[INFO] Configure project :
[INFO] Configure projects
[INFO] Initialize build
[INFO] Build
[INFO] Execute tasks
:compileJava[INFO] Execute :compileJava
 UP-TO-DATE
[INFO] Execute tasks
:compileGroovy[INFO] Execute :compileGroovy
[INFO] Resolve dependencies ':compile'
[INFO] Execute :compileGroovy

[INFO] Execute tasks
:processResources[INFO] Execute :processResources

[INFO] Execute tasks
:classes[INFO] Execute :classes

[INFO] Execute tasks
:compileTestJava[INFO] Execute :compileTestJava
 UP-TO-DATE
[INFO] Execute tasks
:compileTestGroovy[INFO] Execute :compileTestGroovy
[INFO] Resolve dependencies ':testCompile'

Download https://jcenter.bintray.com/com/netflix/nebula/nebula-test/2.2.1/nebula-test-2.2.1.pom[INFO]
Download https://jcenter.bintray.com/com/netflix/nebula/nebula-test/2.2.1/nebula-test-2.2.1.pom

[INFO] Resolve dependencies ':testCompile'
[INFO] Execute :compileTestGroovy
Download https://jcenter.bintray.com/com/netflix/nebula/nebula-test/2.2.1/nebula-test-2.2.1.jar[INFO]
Download https://jcenter.bintray.com/com/netflix/nebula/nebula-test/2.2.1/nebula-test-2.2.1.jar

[INFO] Execute :compileTestGroovy
:compileTestGroovy FAILED
[INFO] Execute tasks

FAILURE: Build failed with an exception.

* What went wrong:
Execution failed for task ':compileTestGroovy'.
> nebula/test/PluginProjectSpec : Unsupported major.minor version 51.0

* Try:
Run with --stacktrace option to get the stack trace. Run with --info or --debug option to
get more log output.

BUILD FAILED

Total time: 7.21 secs
[INFO] Build
Received result CommandFailure[value=org.gradle.launcher.exec.ReportedException: org.gradle.internal.exceptions.LocationAwareException:
Execution failed for task ':compileTestGroovy'.] from daemon DaemonInfo{pid=27582, address=[3d16b79c-5ce1-4add-a534-50be8bd950e7
port:47142, addresses:[/0:0:0:0:0:0:0:1%1, /127.0.0.1]], idle=true, context=DefaultDaemonContext[uid=ed601b91-fecb-486b-8871-0b22ad18a667,javaHome=/x1/jenkins/tools/java/jdk1.6.0_45-32,daemonRegistryDir=/home/jenkins/.gradle/daemon,pid=27582,idleTimeout=10800000,daemonOpts=-XX:MaxPermSize=256m,-XX:+HeapDumpOnOutOfMemoryError,-Xmx1024m,-Dfile.encoding=US-ASCII,-Duser.country=US,-Duser.language=en,-Duser.variant]}.
[INFO] 
[INFO]                                                                         
[INFO] ------------------------------------------------------------------------
[INFO] Building Apache Creadur Rat::Command Line 0.12-SNAPSHOT
[INFO] ------------------------------------------------------------------------
[INFO] 
[INFO] --- maven-clean-plugin:2.5:clean (default-clean) @ apache-rat ---
[INFO] 
[INFO] --- maven-enforcer-plugin:1.3.1:enforce (enforce-bytecode-version) @ apache-rat ---
[INFO] 
[INFO] --- apache-rat-plugin:0.11:check (default) @ apache-rat ---
[INFO] 51 implicit excludes (use -debug for more details).
[INFO] Exclude: README-ANT.txt
[INFO] Exclude: README-CLI.txt
[INFO] 7 resources included (use -debug for more details)
[INFO] Rat check: Summary of files. Unapproved: 0 unknown: 0 generated: 0 approved: 6 licence.
[INFO] 
[INFO] --- maven-remote-resources-plugin:1.5:process (default) @ apache-rat ---
[INFO] 
[INFO] --- maven-resources-plugin:2.7:resources (default-resources) @ apache-rat ---
[INFO] Using 'UTF-8' encoding to copy filtered resources.
[INFO] Copying 3 resources to META-INF
[INFO] Copying 3 resources
[INFO] 
[INFO] --- maven-compiler-plugin:3.2:compile (default-compile) @ apache-rat ---
[INFO] No sources to compile
[INFO] 
[INFO] --- animal-sniffer-maven-plugin:1.11:check (check-java-1.5-compat) @ apache-rat ---
[INFO] Signature checking is skipped.
[INFO] 
[INFO] --- maven-resources-plugin:2.7:testResources (default-testResources) @ apache-rat ---
[INFO] Using 'UTF-8' encoding to copy filtered resources.
[INFO] skip non existing resourceDirectory <https://builds.apache.org/job/Creadur-Rat/ws/apache-rat/src/test/resources>
[INFO] Copying 3 resources
[INFO] 
[INFO] --- maven-compiler-plugin:3.2:testCompile (default-testCompile) @ apache-rat ---
[INFO] No sources to compile
[INFO] 
[INFO] --- maven-surefire-plugin:2.18.1:test (default-test) @ apache-rat ---
[JENKINS] Recording test results[INFO] 
[INFO] --- maven-dependency-plugin:2.8:unpack-dependencies (default) @ apache-rat ---

[INFO] Unpacking /home/jenkins/jenkins-slave/maven-repositories/2/commons-lang/commons-lang/2.6/commons-lang-2.6.jar
to <https://builds.apache.org/job/Creadur-Rat/ws/apache-rat/target/classes> with includes
"" and excludes "META-INF/**"
[INFO] Unpacking <https://builds.apache.org/job/Creadur-Rat/ws/apache-rat-core/target/apache-rat-core-0.12-SNAPSHOT.jar>
to <https://builds.apache.org/job/Creadur-Rat/ws/apache-rat/target/classes> with includes
"" and excludes "META-INF/**"
[INFO] Unpacking <https://builds.apache.org/job/Creadur-Rat/ws/apache-rat-api/target/apache-rat-api-0.12-SNAPSHOT.jar>
to <https://builds.apache.org/job/Creadur-Rat/ws/apache-rat/target/classes> with includes
"" and excludes "META-INF/**"
[INFO] Unpacking <https://builds.apache.org/job/Creadur-Rat/ws/apache-rat-tasks/target/apache-rat-tasks-0.12-SNAPSHOT.jar>
to <https://builds.apache.org/job/Creadur-Rat/ws/apache-rat/target/classes> with includes
"" and excludes "META-INF/**"
[INFO] Unpacking /home/jenkins/jenkins-slave/maven-repositories/2/commons-io/commons-io/2.2/commons-io-2.2.jar
to <https://builds.apache.org/job/Creadur-Rat/ws/apache-rat/target/classes> with includes
"" and excludes "META-INF/**"
[INFO] Unpacking /home/jenkins/jenkins-slave/maven-repositories/2/commons-collections/commons-collections/3.2.1/commons-collections-3.2.1.jar
to <https://builds.apache.org/job/Creadur-Rat/ws/apache-rat/target/classes> with includes
"" and excludes "META-INF/**"
[INFO] Unpacking /home/jenkins/jenkins-slave/maven-repositories/2/commons-cli/commons-cli/1.2/commons-cli-1.2.jar
to <https://builds.apache.org/job/Creadur-Rat/ws/apache-rat/target/classes> with includes
"" and excludes "META-INF/**"
[INFO] Unpacking /home/jenkins/jenkins-slave/maven-repositories/2/org/apache/commons/commons-compress/1.5/commons-compress-1.5.jar
to <https://builds.apache.org/job/Creadur-Rat/ws/apache-rat/target/classes> with includes
"" and excludes "META-INF/**"
[INFO] 
[INFO] --- maven-jar-plugin:2.5:jar (default-jar) @ apache-rat ---
[INFO] Building jar: <https://builds.apache.org/job/Creadur-Rat/ws/apache-rat/target/apache-rat-0.12-SNAPSHOT.jar>
[INFO] 
[INFO] --- maven-site-plugin:3.4:attach-descriptor (attach-descriptor) @ apache-rat ---
[INFO] 
[INFO] --- maven-install-plugin:2.5.2:install (default-install) @ apache-rat ---
[INFO] Installing <https://builds.apache.org/job/Creadur-Rat/ws/apache-rat/target/apache-rat-0.12-SNAPSHOT.jar>
to /home/jenkins/jenkins-slave/maven-repositories/2/org/apache/rat/apache-rat/0.12-SNAPSHOT/apache-rat-0.12-SNAPSHOT.jar
[INFO] Installing <https://builds.apache.org/job/Creadur-Rat/ws/apache-rat/pom.xml>
to /home/jenkins/jenkins-slave/maven-repositories/2/org/apache/rat/apache-rat/0.12-SNAPSHOT/apache-rat-0.12-SNAPSHOT.pom
[INFO] ------------------------------------------------------------------------
[INFO] Reactor Summary:
[INFO] 
[INFO] Apache Creadur Rat ................................ SUCCESS [3.659s]
[INFO] Apache Creadur Rat::API ........................... SUCCESS [5.098s]
[INFO] Apache Creadur Rat::Core .......................... SUCCESS [4.880s]
[INFO] Apache Creadur Rat::Plugin4Maven .................. SUCCESS [31.128s]
[INFO] Apache Creadur Rat::Tasks4Ant ..................... SUCCESS [5.653s]
[INFO] Apache Creadur Rat::Plugin4Gradle ................. FAILURE [24.977s]
[INFO] Apache Creadur Rat::Command Line .................. SUCCESS [1.816s]
[INFO] ------------------------------------------------------------------------
[INFO] BUILD FAILURE
[INFO] ------------------------------------------------------------------------
[INFO] Total time: 1:21.664s
[INFO] Finished at: Sat Sep 26 11:33:23 UTC 2015
[INFO] Final Memory: 43M/248M
[INFO] ------------------------------------------------------------------------
[WARNING] The requested profile "rat" could not be activated because it does not exist.
Waiting for Jenkins to finish collecting data
[ERROR] Failed to execute goal org.fortasoft:gradle-maven-plugin:1.0.7:invoke (gradle-test)
on project apache-rat-gradle: org.gradle.tooling.BuildException: Could not execute build using
Gradle distribution 'http://services.gradle.org/distributions/gradle-2.4-bin.zip'. -> [Help
1]
org.apache.maven.lifecycle.LifecycleExecutionException: Failed to execute goal org.fortasoft:gradle-maven-plugin:1.0.7:invoke
(gradle-test) on project apache-rat-gradle: org.gradle.tooling.BuildException: Could not execute
build using Gradle distribution 'http://services.gradle.org/distributions/gradle-2.4-bin.zip'.
	at org.apache.maven.lifecycle.internal.MojoExecutor.execute(MojoExecutor.java:213)
	at org.apache.maven.lifecycle.internal.MojoExecutor.execute(MojoExecutor.java:153)
	at org.apache.maven.lifecycle.internal.MojoExecutor.execute(MojoExecutor.java:145)
	at org.apache.maven.lifecycle.internal.LifecycleModuleBuilder.buildProject(LifecycleModuleBuilder.java:84)
	at org.apache.maven.lifecycle.internal.LifecycleModuleBuilder.buildProject(LifecycleModuleBuilder.java:59)
	at org.apache.maven.lifecycle.internal.LifecycleStarter.singleThreadedBuild(LifecycleStarter.java:183)
	at org.apache.maven.lifecycle.internal.LifecycleStarter.execute(LifecycleStarter.java:161)
	at org.apache.maven.DefaultMaven.doExecute(DefaultMaven.java:320)
	at org.apache.maven.DefaultMaven.execute(DefaultMaven.java:156)
	at org.jvnet.hudson.maven3.launcher.Maven3Launcher.main(Maven3Launcher.java:117)
	at sun.reflect.NativeMethodAccessorImpl.invoke0(Native Method)
	at sun.reflect.NativeMethodAccessorImpl.invoke(NativeMethodAccessorImpl.java:39)
	at sun.reflect.DelegatingMethodAccessorImpl.invoke(DelegatingMethodAccessorImpl.java:25)
	at java.lang.reflect.Method.invoke(Method.java:597)
	at org.codehaus.plexus.classworlds.launcher.Launcher.launchStandard(Launcher.java:329)
	at org.codehaus.plexus.classworlds.launcher.Launcher.launch(Launcher.java:239)
	at org.jvnet.hudson.maven3.agent.Maven3Main.launch(Maven3Main.java:178)
	at sun.reflect.NativeMethodAccessorImpl.invoke0(Native Method)
	at sun.reflect.NativeMethodAccessorImpl.invoke(NativeMethodAccessorImpl.java:39)
	at sun.reflect.DelegatingMethodAccessorImpl.invoke(DelegatingMethodAccessorImpl.java:25)
	at java.lang.reflect.Method.invoke(Method.java:597)
	at hudson.maven.Maven3Builder.call(Maven3Builder.java:136)
	at hudson.maven.Maven3Builder.call(Maven3Builder.java:71)
	at hudson.remoting.UserRequest.perform(UserRequest.java:118)
	at hudson.remoting.UserRequest.perform(UserRequest.java:48)
	at hudson.remoting.Request$2.run(Request.java:328)
	at hudson.remoting.InterceptingExecutorService$1.call(InterceptingExecutorService.java:72)
	at java.util.concurrent.FutureTask$Sync.innerRun(FutureTask.java:303)
	at java.util.concurrent.FutureTask.run(FutureTask.java:138)
	at java.util.concurrent.ThreadPoolExecutor$Worker.runTask(ThreadPoolExecutor.java:895)
	at java.util.concurrent.ThreadPoolExecutor$Worker.run(ThreadPoolExecutor.java:918)
	at java.lang.Thread.run(Thread.java:662)
Caused by: org.apache.maven.plugin.MojoFailureException: org.gradle.tooling.BuildException:
Could not execute build using Gradle distribution 'http://services.gradle.org/distributions/gradle-2.4-bin.zip'.
	at org.fortasoft.maven.plugin.gradle.GradleMojo.execute(GradleMojo.java:254)
	at org.apache.maven.plugin.DefaultBuildPluginManager.executeMojo(DefaultBuildPluginManager.java:101)
	at org.apache.maven.lifecycle.internal.MojoExecutor.execute(MojoExecutor.java:209)
	... 31 more
[ERROR] 
[ERROR] Re-run Maven using the -X switch to enable full debug logging.
[ERROR] 
[ERROR] For more information about the errors and possible solutions, please read the following
articles:
[ERROR] [Help 1] http://cwiki.apache.org/confluence/display/MAVEN/MojoFailureException
[ERROR] 
[ERROR] After correcting the problems, you can resume the build with the command
[ERROR]   mvn <goals> -rf :apache-rat-gradle
[JENKINS] Archiving <https://builds.apache.org/job/Creadur-Rat/ws/apache-rat-gradle/pom.xml>
to org.apache.rat/apache-rat-gradle/0.12-SNAPSHOT/apache-rat-gradle-0.12-SNAPSHOT.pom
No prior successful build to compare, so performing full copy of artifacts
[JENKINS] Archiving <https://builds.apache.org/job/Creadur-Rat/ws/apache-rat-plugin/pom.xml>
to org.apache.rat/apache-rat-plugin/0.12-SNAPSHOT/apache-rat-plugin-0.12-SNAPSHOT.pom
[JENKINS] Archiving <https://builds.apache.org/job/Creadur-Rat/ws/apache-rat-plugin/target/apache-rat-plugin-0.12-SNAPSHOT.jar>
to org.apache.rat/apache-rat-plugin/0.12-SNAPSHOT/apache-rat-plugin-0.12-SNAPSHOT.jar
Sending artifact delta relative to Creadur-Rat ? Apache Creadur Rat::Plugin4Maven #282
Archived 2 artifacts
Archive block size is 32768
Received 0 blocks and 60886 bytes
Compression is 0.0%
Took 15 ms
[JENKINS] Archiving <https://builds.apache.org/job/Creadur-Rat/ws/apache-rat-tasks/pom.xml>
to org.apache.rat/apache-rat-tasks/0.12-SNAPSHOT/apache-rat-tasks-0.12-SNAPSHOT.pom
[JENKINS] Archiving <https://builds.apache.org/job/Creadur-Rat/ws/apache-rat-tasks/target/apache-rat-tasks-0.12-SNAPSHOT.jar>
to org.apache.rat/apache-rat-tasks/0.12-SNAPSHOT/apache-rat-tasks-0.12-SNAPSHOT.jar
Sending artifact delta relative to Creadur-Rat ? Apache Creadur Rat::Tasks4Ant #282
Archived 2 artifacts
Archive block size is 32768
Received 0 blocks and 31939 bytes
Compression is 0.0%
Took 10 ms
[JENKINS] Archiving <https://builds.apache.org/job/Creadur-Rat/ws/pom.xml> to org.apache.rat/apache-rat-project/0.12-SNAPSHOT/apache-rat-project-0.12-SNAPSHOT.pom
[JENKINS] Archiving <https://builds.apache.org/job/Creadur-Rat/ws/target/apache-rat-project-0.12-SNAPSHOT-site.xml>
to org.apache.rat/apache-rat-project/0.12-SNAPSHOT/apache-rat-project-0.12-SNAPSHOT-site.xml
Sending artifact delta relative to Creadur-Rat ? Apache Creadur Rat #282
Archived 2 artifacts
Archive block size is 32768
Received 0 blocks and 27831 bytes
Compression is 0.0%
Took 0.13 sec
[JENKINS] Archiving <https://builds.apache.org/job/Creadur-Rat/ws/apache-rat-api/pom.xml>
to org.apache.rat/apache-rat-api/0.12-SNAPSHOT/apache-rat-api-0.12-SNAPSHOT.pom
[JENKINS] Archiving <https://builds.apache.org/job/Creadur-Rat/ws/apache-rat-api/target/apache-rat-api-0.12-SNAPSHOT.jar>
to org.apache.rat/apache-rat-api/0.12-SNAPSHOT/apache-rat-api-0.12-SNAPSHOT.jar
Sending artifact delta relative to Creadur-Rat ? Apache Creadur Rat::API #282
Archived 2 artifacts
Archive block size is 32768
Received 0 blocks and 12682 bytes
Compression is 0.0%
Took 10 ms
[JENKINS] Archiving <https://builds.apache.org/job/Creadur-Rat/ws/apache-rat/pom.xml>
to org.apache.rat/apache-rat/0.12-SNAPSHOT/apache-rat-0.12-SNAPSHOT.pom
[JENKINS] Archiving <https://builds.apache.org/job/Creadur-Rat/ws/apache-rat/target/apache-rat-0.12-SNAPSHOT.jar>
to org.apache.rat/apache-rat/0.12-SNAPSHOT/apache-rat-0.12-SNAPSHOT.jar
Sending artifact delta relative to Creadur-Rat ? Apache Creadur Rat::Command Line #282
Archived 2 artifacts
Archive block size is 32768
Received 0 blocks and 1449035 bytes
Compression is 0.0%
Took 0.3 sec
[JENKINS] Archiving <https://builds.apache.org/job/Creadur-Rat/ws/apache-rat-core/pom.xml>
to org.apache.rat/apache-rat-core/0.12-SNAPSHOT/apache-rat-core-0.12-SNAPSHOT.pom
[JENKINS] Archiving <https://builds.apache.org/job/Creadur-Rat/ws/apache-rat-core/target/apache-rat-core-0.12-SNAPSHOT.jar>
to org.apache.rat/apache-rat-core/0.12-SNAPSHOT/apache-rat-core-0.12-SNAPSHOT.jar
Sending artifact delta relative to Creadur-Rat ? Apache Creadur Rat::Core #282
Archived 2 artifacts
Archive block size is 32768
Received 0 blocks and 132003 bytes
Compression is 0.0%
Took 47 ms
channel stopped

Mime
View raw message