creadur-dev mailing list archives

Site index · List index
Message view « Date » · « Thread »
Top « Date » · « Thread »
From Apache Jenkins Server <jenk...@builds.apache.org>
Subject Build failed in Jenkins: Creadur-Rat-Site-Latest-Jdk #141
Date Mon, 18 May 2015 18:36:22 GMT
See <https://builds.apache.org/job/Creadur-Rat-Site-Latest-Jdk/141/>

------------------------------------------
[...truncated 988 lines...]
Generating <https://builds.apache.org/job/Creadur-Rat-Site-Latest-Jdk/ws/target/site/apidocs/org/apache/rat/document/package-use.html...>
Generating <https://builds.apache.org/job/Creadur-Rat-Site-Latest-Jdk/ws/target/site/apidocs/org/apache/rat/document/impl/package-use.html...>
Generating <https://builds.apache.org/job/Creadur-Rat-Site-Latest-Jdk/ws/target/site/apidocs/org/apache/rat/document/impl/guesser/package-use.html...>
Generating <https://builds.apache.org/job/Creadur-Rat-Site-Latest-Jdk/ws/target/site/apidocs/org/apache/rat/document/impl/util/package-use.html...>
Generating <https://builds.apache.org/job/Creadur-Rat-Site-Latest-Jdk/ws/target/site/apidocs/org/apache/rat/header/package-use.html...>
Generating <https://builds.apache.org/job/Creadur-Rat-Site-Latest-Jdk/ws/target/site/apidocs/org/apache/rat/license/package-use.html...>
Generating <https://builds.apache.org/job/Creadur-Rat-Site-Latest-Jdk/ws/target/site/apidocs/org/apache/rat/mp/package-use.html...>
Generating <https://builds.apache.org/job/Creadur-Rat-Site-Latest-Jdk/ws/target/site/apidocs/org/apache/rat/mp/util/package-use.html...>
Generating <https://builds.apache.org/job/Creadur-Rat-Site-Latest-Jdk/ws/target/site/apidocs/org/apache/rat/policy/package-use.html...>
Generating <https://builds.apache.org/job/Creadur-Rat-Site-Latest-Jdk/ws/target/site/apidocs/org/apache/rat/report/package-use.html...>
Generating <https://builds.apache.org/job/Creadur-Rat-Site-Latest-Jdk/ws/target/site/apidocs/org/apache/rat/report/claim/package-use.html...>
Generating <https://builds.apache.org/job/Creadur-Rat-Site-Latest-Jdk/ws/target/site/apidocs/org/apache/rat/report/claim/impl/package-use.html...>
Generating <https://builds.apache.org/job/Creadur-Rat-Site-Latest-Jdk/ws/target/site/apidocs/org/apache/rat/report/claim/impl/xml/package-use.html...>
Generating <https://builds.apache.org/job/Creadur-Rat-Site-Latest-Jdk/ws/target/site/apidocs/org/apache/rat/report/claim/util/package-use.html...>
Generating <https://builds.apache.org/job/Creadur-Rat-Site-Latest-Jdk/ws/target/site/apidocs/org/apache/rat/report/xml/package-use.html...>
Generating <https://builds.apache.org/job/Creadur-Rat-Site-Latest-Jdk/ws/target/site/apidocs/org/apache/rat/report/xml/writer/package-use.html...>
Generating <https://builds.apache.org/job/Creadur-Rat-Site-Latest-Jdk/ws/target/site/apidocs/org/apache/rat/report/xml/writer/impl/base/package-use.html...>
Generating <https://builds.apache.org/job/Creadur-Rat-Site-Latest-Jdk/ws/target/site/apidocs/org/apache/rat/walker/package-use.html...>
Building index for all the packages and classes...
Generating <https://builds.apache.org/job/Creadur-Rat-Site-Latest-Jdk/ws/target/site/apidocs/overview-tree.html...>
Generating <https://builds.apache.org/job/Creadur-Rat-Site-Latest-Jdk/ws/target/site/apidocs/index-all.html...>
Generating <https://builds.apache.org/job/Creadur-Rat-Site-Latest-Jdk/ws/target/site/apidocs/deprecated-list.html...>
Building index for all classes...
Generating <https://builds.apache.org/job/Creadur-Rat-Site-Latest-Jdk/ws/target/site/apidocs/allclasses-frame.html...>
Generating <https://builds.apache.org/job/Creadur-Rat-Site-Latest-Jdk/ws/target/site/apidocs/allclasses-noframe.html...>
Generating <https://builds.apache.org/job/Creadur-Rat-Site-Latest-Jdk/ws/target/site/apidocs/index.html...>
Generating <https://builds.apache.org/job/Creadur-Rat-Site-Latest-Jdk/ws/target/site/apidocs/overview-summary.html...>
Generating <https://builds.apache.org/job/Creadur-Rat-Site-Latest-Jdk/ws/target/site/apidocs/help-doc.html...>
3 errors
2 warnings
[JENKINS] Archiving site from <https://builds.apache.org/job/Creadur-Rat-Site-Latest-Jdk/ws/target/site>
to /x1/jenkins/jenkins-home/jobs/Creadur-Rat-Site-Latest-Jdk/site
log4j:WARN No appenders could be found for logger (org.apache.commons.beanutils.converters.BooleanConverter).
log4j:WARN Please initialize the log4j system properly.
[INFO] ------------------------------------------------------------------------
[INFO] Reactor Summary:
[INFO] 
[INFO] Apache Creadur Rat ................................ FAILURE [ 24.159 s]
[INFO] Apache Creadur Rat::API ........................... SKIPPED
[INFO] Apache Creadur Rat::Core .......................... SKIPPED
[INFO] Apache Creadur Rat::Plugin4Maven .................. SKIPPED
[INFO] Apache Creadur Rat::Tasks4Ant ..................... SKIPPED
[INFO] Apache Creadur Rat::Command Line .................. SKIPPED
[INFO] ------------------------------------------------------------------------
[INFO] BUILD FAILURE
[INFO] ------------------------------------------------------------------------
[INFO] Total time: 26.727 s
[INFO] Finished at: 2015-05-18T18:36:14+00:00
[INFO] Final Memory: 48M/596M
[INFO] ------------------------------------------------------------------------
Waiting for Jenkins to finish collecting data
[ERROR] Failed to execute goal org.apache.maven.plugins:maven-site-plugin:3.4:site (default-site)
on project apache-rat-project: Error generating maven-javadoc-plugin:2.9.1:aggregate:
[ERROR] Exit code: 1 - <https://builds.apache.org/job/Creadur-Rat-Site-Latest-Jdk/ws/apache-rat-core/src/main/java/org/apache/rat/analysis/license/CopyrightHeader.java>:32:
error: self-closing element not allowed
[ERROR] * <p/>
[ERROR] ^
[ERROR] <https://builds.apache.org/job/Creadur-Rat-Site-Latest-Jdk/ws/apache-rat-core/src/main/java/org/apache/rat/analysis/license/CopyrightHeader.java>:32:
warning: empty <p> tag
[ERROR] * <p/>
[ERROR] ^
[ERROR] <https://builds.apache.org/job/Creadur-Rat-Site-Latest-Jdk/ws/apache-rat-core/src/main/java/org/apache/rat/analysis/license/CopyrightHeader.java>:34:
error: self-closing element not allowed
[ERROR] * <p/>
[ERROR] ^
[ERROR] <https://builds.apache.org/job/Creadur-Rat-Site-Latest-Jdk/ws/apache-rat-core/src/main/java/org/apache/rat/analysis/license/CopyrightHeader.java>:41:
error: self-closing element not allowed
[ERROR] * <p/>
[ERROR] ^
[ERROR] <https://builds.apache.org/job/Creadur-Rat-Site-Latest-Jdk/ws/apache-rat-core/src/main/java/org/apache/rat/analysis/license/CopyrightHeader.java>:41:
warning: empty <p> tag
[ERROR] * <p/>
[ERROR] ^
[ERROR] 
[ERROR] Command line was: /home/jenkins/jenkins-slave/tools/hudson.model.JDK/jdk-1.8.0/jre/../bin/javadoc
@options @packages @argfile
[ERROR] 
[ERROR] Refer to the generated Javadoc files in '<https://builds.apache.org/job/Creadur-Rat-Site-Latest-Jdk/ws/target/site/apidocs'>
dir.
[ERROR] -> [Help 1]
org.apache.maven.lifecycle.LifecycleExecutionException: Failed to execute goal org.apache.maven.plugins:maven-site-plugin:3.4:site
(default-site) on project apache-rat-project: Error generating maven-javadoc-plugin:2.9.1:aggregate:

Exit code: 1 - <https://builds.apache.org/job/Creadur-Rat-Site-Latest-Jdk/ws/apache-rat-core/src/main/java/org/apache/rat/analysis/license/CopyrightHeader.java>:32:
error: self-closing element not allowed
 * <p/>
   ^
<https://builds.apache.org/job/Creadur-Rat-Site-Latest-Jdk/ws/apache-rat-core/src/main/java/org/apache/rat/analysis/license/CopyrightHeader.java>:32:
warning: empty <p> tag
 * <p/>
   ^
<https://builds.apache.org/job/Creadur-Rat-Site-Latest-Jdk/ws/apache-rat-core/src/main/java/org/apache/rat/analysis/license/CopyrightHeader.java>:34:
error: self-closing element not allowed
 * <p/>
   ^
<https://builds.apache.org/job/Creadur-Rat-Site-Latest-Jdk/ws/apache-rat-core/src/main/java/org/apache/rat/analysis/license/CopyrightHeader.java>:41:
error: self-closing element not allowed
 * <p/>
   ^
<https://builds.apache.org/job/Creadur-Rat-Site-Latest-Jdk/ws/apache-rat-core/src/main/java/org/apache/rat/analysis/license/CopyrightHeader.java>:41:
warning: empty <p> tag
 * <p/>
   ^

Command line was: /home/jenkins/jenkins-slave/tools/hudson.model.JDK/jdk-1.8.0/jre/../bin/javadoc
@options @packages @argfile

Refer to the generated Javadoc files in '<https://builds.apache.org/job/Creadur-Rat-Site-Latest-Jdk/ws/target/site/apidocs'>
dir.

	at org.apache.maven.lifecycle.internal.MojoExecutor.execute(MojoExecutor.java:216)
	at org.apache.maven.lifecycle.internal.MojoExecutor.execute(MojoExecutor.java:153)
	at org.apache.maven.lifecycle.internal.MojoExecutor.execute(MojoExecutor.java:145)
	at org.apache.maven.lifecycle.internal.LifecycleModuleBuilder.buildProject(LifecycleModuleBuilder.java:108)
	at org.apache.maven.lifecycle.internal.LifecycleModuleBuilder.buildProject(LifecycleModuleBuilder.java:76)
	at org.apache.maven.lifecycle.internal.builder.singlethreaded.SingleThreadedBuilder.build(SingleThreadedBuilder.java:51)
	at org.apache.maven.lifecycle.internal.LifecycleStarter.execute(LifecycleStarter.java:116)
	at org.apache.maven.DefaultMaven.doExecute(DefaultMaven.java:361)
	at org.apache.maven.DefaultMaven.execute(DefaultMaven.java:155)
	at org.jvnet.hudson.maven3.launcher.Maven31Launcher.main(Maven31Launcher.java:132)
	at sun.reflect.NativeMethodAccessorImpl.invoke0(Native Method)
	at sun.reflect.NativeMethodAccessorImpl.invoke(NativeMethodAccessorImpl.java:62)
	at sun.reflect.DelegatingMethodAccessorImpl.invoke(DelegatingMethodAccessorImpl.java:43)
	at java.lang.reflect.Method.invoke(Method.java:483)
	at org.codehaus.plexus.classworlds.launcher.Launcher.launchStandard(Launcher.java:330)
	at org.codehaus.plexus.classworlds.launcher.Launcher.launch(Launcher.java:238)
	at jenkins.maven3.agent.Maven31Main.launch(Maven31Main.java:181)
	at sun.reflect.NativeMethodAccessorImpl.invoke0(Native Method)
	at sun.reflect.NativeMethodAccessorImpl.invoke(NativeMethodAccessorImpl.java:62)
	at sun.reflect.DelegatingMethodAccessorImpl.invoke(DelegatingMethodAccessorImpl.java:43)
	at java.lang.reflect.Method.invoke(Method.java:483)
	at hudson.maven.Maven3Builder.call(Maven3Builder.java:136)
	at hudson.maven.Maven3Builder.call(Maven3Builder.java:71)
	at hudson.remoting.UserRequest.perform(UserRequest.java:118)
	at hudson.remoting.UserRequest.perform(UserRequest.java:48)
	at hudson.remoting.Request$2.run(Request.java:328)
	at hudson.remoting.InterceptingExecutorService$1.call(InterceptingExecutorService.java:72)
	at java.util.concurrent.FutureTask.run(FutureTask.java:266)
	at java.util.concurrent.ThreadPoolExecutor.runWorker(ThreadPoolExecutor.java:1142)
	at java.util.concurrent.ThreadPoolExecutor$Worker.run(ThreadPoolExecutor.java:617)
	at java.lang.Thread.run(Thread.java:745)
Caused by: org.apache.maven.plugin.MojoExecutionException: Error generating maven-javadoc-plugin:2.9.1:aggregate:

Exit code: 1 - <https://builds.apache.org/job/Creadur-Rat-Site-Latest-Jdk/ws/apache-rat-core/src/main/java/org/apache/rat/analysis/license/CopyrightHeader.java>:32:
error: self-closing element not allowed
 * <p/>
   ^
<https://builds.apache.org/job/Creadur-Rat-Site-Latest-Jdk/ws/apache-rat-core/src/main/java/org/apache/rat/analysis/license/CopyrightHeader.java>:32:
warning: empty <p> tag
 * <p/>
   ^
<https://builds.apache.org/job/Creadur-Rat-Site-Latest-Jdk/ws/apache-rat-core/src/main/java/org/apache/rat/analysis/license/CopyrightHeader.java>:34:
error: self-closing element not allowed
 * <p/>
   ^
<https://builds.apache.org/job/Creadur-Rat-Site-Latest-Jdk/ws/apache-rat-core/src/main/java/org/apache/rat/analysis/license/CopyrightHeader.java>:41:
error: self-closing element not allowed
 * <p/>
   ^
<https://builds.apache.org/job/Creadur-Rat-Site-Latest-Jdk/ws/apache-rat-core/src/main/java/org/apache/rat/analysis/license/CopyrightHeader.java>:41:
warning: empty <p> tag
 * <p/>
   ^

Command line was: /home/jenkins/jenkins-slave/tools/hudson.model.JDK/jdk-1.8.0/jre/../bin/javadoc
@options @packages @argfile

Refer to the generated Javadoc files in '<https://builds.apache.org/job/Creadur-Rat-Site-Latest-Jdk/ws/target/site/apidocs'>
dir.

	at org.apache.maven.plugins.site.render.SiteMojo.execute(SiteMojo.java:146)
	at org.apache.maven.plugin.DefaultBuildPluginManager.executeMojo(DefaultBuildPluginManager.java:133)
	at org.apache.maven.lifecycle.internal.MojoExecutor.execute(MojoExecutor.java:208)
	... 30 more
Caused by: org.apache.maven.doxia.siterenderer.RendererException: Error generating maven-javadoc-plugin:2.9.1:aggregate:

Exit code: 1 - <https://builds.apache.org/job/Creadur-Rat-Site-Latest-Jdk/ws/apache-rat-core/src/main/java/org/apache/rat/analysis/license/CopyrightHeader.java>:32:
error: self-closing element not allowed
 * <p/>
   ^
<https://builds.apache.org/job/Creadur-Rat-Site-Latest-Jdk/ws/apache-rat-core/src/main/java/org/apache/rat/analysis/license/CopyrightHeader.java>:32:
warning: empty <p> tag
 * <p/>
   ^
<https://builds.apache.org/job/Creadur-Rat-Site-Latest-Jdk/ws/apache-rat-core/src/main/java/org/apache/rat/analysis/license/CopyrightHeader.java>:34:
error: self-closing element not allowed
 * <p/>
   ^
<https://builds.apache.org/job/Creadur-Rat-Site-Latest-Jdk/ws/apache-rat-core/src/main/java/org/apache/rat/analysis/license/CopyrightHeader.java>:41:
error: self-closing element not allowed
 * <p/>
   ^
<https://builds.apache.org/job/Creadur-Rat-Site-Latest-Jdk/ws/apache-rat-core/src/main/java/org/apache/rat/analysis/license/CopyrightHeader.java>:41:
warning: empty <p> tag
 * <p/>
   ^

Command line was: /home/jenkins/jenkins-slave/tools/hudson.model.JDK/jdk-1.8.0/jre/../bin/javadoc
@options @packages @argfile

Refer to the generated Javadoc files in '<https://builds.apache.org/job/Creadur-Rat-Site-Latest-Jdk/ws/target/site/apidocs'>
dir.

	at org.apache.maven.plugins.site.render.ReportDocumentRenderer.renderDocument(ReportDocumentRenderer.java:239)
	at org.apache.maven.doxia.siterenderer.DefaultSiteRenderer.renderModule(DefaultSiteRenderer.java:311)
	at org.apache.maven.doxia.siterenderer.DefaultSiteRenderer.render(DefaultSiteRenderer.java:129)
	at org.apache.maven.plugins.site.render.SiteMojo.renderLocale(SiteMojo.java:182)
	at org.apache.maven.plugins.site.render.SiteMojo.execute(SiteMojo.java:141)
	... 32 more
Caused by: org.apache.maven.reporting.MavenReportException: 
Exit code: 1 - <https://builds.apache.org/job/Creadur-Rat-Site-Latest-Jdk/ws/apache-rat-core/src/main/java/org/apache/rat/analysis/license/CopyrightHeader.java>:32:
error: self-closing element not allowed
 * <p/>
   ^
<https://builds.apache.org/job/Creadur-Rat-Site-Latest-Jdk/ws/apache-rat-core/src/main/java/org/apache/rat/analysis/license/CopyrightHeader.java>:32:
warning: empty <p> tag
 * <p/>
   ^
<https://builds.apache.org/job/Creadur-Rat-Site-Latest-Jdk/ws/apache-rat-core/src/main/java/org/apache/rat/analysis/license/CopyrightHeader.java>:34:
error: self-closing element not allowed
 * <p/>
   ^
<https://builds.apache.org/job/Creadur-Rat-Site-Latest-Jdk/ws/apache-rat-core/src/main/java/org/apache/rat/analysis/license/CopyrightHeader.java>:41:
error: self-closing element not allowed
 * <p/>
   ^
<https://builds.apache.org/job/Creadur-Rat-Site-Latest-Jdk/ws/apache-rat-core/src/main/java/org/apache/rat/analysis/license/CopyrightHeader.java>:41:
warning: empty <p> tag
 * <p/>
   ^

Command line was: /home/jenkins/jenkins-slave/tools/hudson.model.JDK/jdk-1.8.0/jre/../bin/javadoc
@options @packages @argfile

Refer to the generated Javadoc files in '<https://builds.apache.org/job/Creadur-Rat-Site-Latest-Jdk/ws/target/site/apidocs'>
dir.

	at org.apache.maven.plugin.javadoc.AbstractJavadocMojo.executeJavadocCommandLine(AbstractJavadocMojo.java:5074)
	at org.apache.maven.plugin.javadoc.AbstractJavadocMojo.executeReport(AbstractJavadocMojo.java:1999)
	at org.apache.maven.plugin.javadoc.JavadocReport.generate(JavadocReport.java:130)
	at org.apache.maven.plugins.site.render.ReportDocumentRenderer.renderDocument(ReportDocumentRenderer.java:233)
	... 36 more
[ERROR] 
[ERROR] Re-run Maven using the -X switch to enable full debug logging.
[ERROR] 
[ERROR] For more information about the errors and possible solutions, please read the following
articles:
[ERROR] [Help 1] http://cwiki.apache.org/confluence/display/MAVEN/MojoExecutionException
[JENKINS] Archiving <https://builds.apache.org/job/Creadur-Rat-Site-Latest-Jdk/ws/apache-rat-plugin/pom.xml>
to org.apache.rat/apache-rat-plugin/0.12-SNAPSHOT/apache-rat-plugin-0.12-SNAPSHOT.pom
Sending artifact delta relative to Creadur-Rat-Site-Latest-Jdk » Apache Creadur Rat::Plugin4Maven
#139
Archived 1 artifacts
Archive block size is 32768
Received 0 blocks and 9155 bytes
Compression is 0.0%
Took 0.29 sec
[JENKINS] Archiving <https://builds.apache.org/job/Creadur-Rat-Site-Latest-Jdk/ws/apache-rat-tasks/pom.xml>
to org.apache.rat/apache-rat-tasks/0.12-SNAPSHOT/apache-rat-tasks-0.12-SNAPSHOT.pom
Sending artifact delta relative to Creadur-Rat-Site-Latest-Jdk » Apache Creadur Rat::Tasks4Ant
#139
Archived 1 artifacts
Archive block size is 32768
Received 0 blocks and 6322 bytes
Compression is 0.0%
Took 0.15 sec
[JENKINS] Archiving <https://builds.apache.org/job/Creadur-Rat-Site-Latest-Jdk/ws/pom.xml>
to org.apache.rat/apache-rat-project/0.12-SNAPSHOT/apache-rat-project-0.12-SNAPSHOT.pom
Sending artifact delta relative to Creadur-Rat-Site-Latest-Jdk » Apache Creadur Rat #139
Archived 1 artifacts
Archive block size is 32768
Received 0 blocks and 21622 bytes
Compression is 0.0%
Took 0.14 sec
[JENKINS] Archiving <https://builds.apache.org/job/Creadur-Rat-Site-Latest-Jdk/ws/apache-rat-api/pom.xml>
to org.apache.rat/apache-rat-api/0.12-SNAPSHOT/apache-rat-api-0.12-SNAPSHOT.pom
Sending artifact delta relative to Creadur-Rat-Site-Latest-Jdk » Apache Creadur Rat::API
#139
Archived 1 artifacts
Archive block size is 32768
Received 0 blocks and 1972 bytes
Compression is 0.0%
Took 0.1 sec
[JENKINS] Archiving <https://builds.apache.org/job/Creadur-Rat-Site-Latest-Jdk/ws/apache-rat/pom.xml>
to org.apache.rat/apache-rat/0.12-SNAPSHOT/apache-rat-0.12-SNAPSHOT.pom
Sending artifact delta relative to Creadur-Rat-Site-Latest-Jdk » Apache Creadur Rat::Command
Line #139
Archived 1 artifacts
Archive block size is 32768
Received 0 blocks and 7019 bytes
Compression is 0.0%
Took 60 ms
[JENKINS] Archiving <https://builds.apache.org/job/Creadur-Rat-Site-Latest-Jdk/ws/apache-rat-core/pom.xml>
to org.apache.rat/apache-rat-core/0.12-SNAPSHOT/apache-rat-core-0.12-SNAPSHOT.pom
Sending artifact delta relative to Creadur-Rat-Site-Latest-Jdk » Apache Creadur Rat::Core
#139
Archived 1 artifacts
Archive block size is 32768
Received 0 blocks and 4350 bytes
Compression is 0.0%
Took 27 ms
channel stopped

Mime
View raw message