creadur-dev mailing list archives

Site index · List index
Message view « Date » · « Thread »
Top « Date » · « Thread »
From Apache Jenkins Server <jenk...@builds.apache.org>
Subject Build failed in Jenkins: Creadur-Rat-Site-Latest-Jdk #68
Date Tue, 24 Feb 2015 00:35:58 GMT
See <https://builds.apache.org/job/Creadur-Rat-Site-Latest-Jdk/68/changes>

Changes:

[pottlinger] RAT-195: Merged rat-api from GSOC branch.

* Cleaned up mess with pom coordinates of it test projects.
* Enhanced SVN:ignore to not take care of *.iml.
* Activated RAT::API as default module.

------------------------------------------
[...truncated 938 lines...]
Generating <https://builds.apache.org/job/Creadur-Rat-Site-Latest-Jdk/ws/target/site/apidocs/org/apache/rat/config/class-use/SourceCodeManagementSystems.html...>
Generating <https://builds.apache.org/job/Creadur-Rat-Site-Latest-Jdk/ws/target/site/apidocs/org/apache/rat/class-use/ReportConfiguration.html...>
Generating <https://builds.apache.org/job/Creadur-Rat-Site-Latest-Jdk/ws/target/site/apidocs/org/apache/rat/class-use/Report.html...>
Generating <https://builds.apache.org/job/Creadur-Rat-Site-Latest-Jdk/ws/target/site/apidocs/org/apache/rat/class-use/Defaults.html...>
Generating <https://builds.apache.org/job/Creadur-Rat-Site-Latest-Jdk/ws/target/site/apidocs/org/apache/rat/header/class-use/HeaderMatcher.html...>
Generating <https://builds.apache.org/job/Creadur-Rat-Site-Latest-Jdk/ws/target/site/apidocs/org/apache/rat/header/class-use/HeaderBean.html...>
Generating <https://builds.apache.org/job/Creadur-Rat-Site-Latest-Jdk/ws/target/site/apidocs/org/apache/rat/walker/class-use/Walker.html...>
Generating <https://builds.apache.org/job/Creadur-Rat-Site-Latest-Jdk/ws/target/site/apidocs/org/apache/rat/walker/class-use/DirectoryWalker.html...>
Generating <https://builds.apache.org/job/Creadur-Rat-Site-Latest-Jdk/ws/target/site/apidocs/org/apache/rat/walker/class-use/ArchiveWalker.html...>
Generating <https://builds.apache.org/job/Creadur-Rat-Site-Latest-Jdk/ws/target/site/apidocs/org/apache/rat/api/class-use/RatException.html...>
Generating <https://builds.apache.org/job/Creadur-Rat-Site-Latest-Jdk/ws/target/site/apidocs/org/apache/rat/api/class-use/MimeTyper.html...>
Generating <https://builds.apache.org/job/Creadur-Rat-Site-Latest-Jdk/ws/target/site/apidocs/org/apache/rat/api/class-use/MetaData.html...>
Generating <https://builds.apache.org/job/Creadur-Rat-Site-Latest-Jdk/ws/target/site/apidocs/org/apache/rat/api/class-use/MetaData.Datum.html...>
Generating <https://builds.apache.org/job/Creadur-Rat-Site-Latest-Jdk/ws/target/site/apidocs/org/apache/rat/api/class-use/Document.html...>
Generating <https://builds.apache.org/job/Creadur-Rat-Site-Latest-Jdk/ws/target/site/apidocs/org/apache/rat/api/class-use/ContentType.html...>
Generating <https://builds.apache.org/job/Creadur-Rat-Site-Latest-Jdk/ws/target/site/apidocs/org/apache/rat/policy/class-use/DefaultPolicy.html...>
Generating <https://builds.apache.org/job/Creadur-Rat-Site-Latest-Jdk/ws/target/site/apidocs/org/apache/rat/document/class-use/UnsuitableDocumentException.html...>
Generating <https://builds.apache.org/job/Creadur-Rat-Site-Latest-Jdk/ws/target/site/apidocs/org/apache/rat/document/class-use/ToNameTransformer.html...>
Generating <https://builds.apache.org/job/Creadur-Rat-Site-Latest-Jdk/ws/target/site/apidocs/org/apache/rat/document/class-use/RatDocumentAnalysisException.html...>
Generating <https://builds.apache.org/job/Creadur-Rat-Site-Latest-Jdk/ws/target/site/apidocs/org/apache/rat/document/class-use/IDocumentAnalyser.html...>
Generating <https://builds.apache.org/job/Creadur-Rat-Site-Latest-Jdk/ws/target/site/apidocs/org/apache/rat/document/class-use/CompositeDocumentException.html...>
Generating <https://builds.apache.org/job/Creadur-Rat-Site-Latest-Jdk/ws/target/site/apidocs/org/apache/rat/document/impl/class-use/MonolithicFileDocument.html...>
Generating <https://builds.apache.org/job/Creadur-Rat-Site-Latest-Jdk/ws/target/site/apidocs/org/apache/rat/document/impl/class-use/FileDocument.html...>
Generating <https://builds.apache.org/job/Creadur-Rat-Site-Latest-Jdk/ws/target/site/apidocs/org/apache/rat/document/impl/class-use/DocumentImplUtils.html...>
Generating <https://builds.apache.org/job/Creadur-Rat-Site-Latest-Jdk/ws/target/site/apidocs/org/apache/rat/document/impl/class-use/ArchiveEntryDocument.html...>
Generating <https://builds.apache.org/job/Creadur-Rat-Site-Latest-Jdk/ws/target/site/apidocs/org/apache/rat/document/impl/class-use/AbstractMonolithicDocument.html...>
Generating <https://builds.apache.org/job/Creadur-Rat-Site-Latest-Jdk/ws/target/site/apidocs/org/apache/rat/document/impl/util/class-use/DocumentAnalyserMultiplexer.html...>
Generating <https://builds.apache.org/job/Creadur-Rat-Site-Latest-Jdk/ws/target/site/apidocs/org/apache/rat/document/impl/guesser/class-use/NoteGuesser.html...>
Generating <https://builds.apache.org/job/Creadur-Rat-Site-Latest-Jdk/ws/target/site/apidocs/org/apache/rat/document/impl/guesser/class-use/GuessUtils.html...>
Generating <https://builds.apache.org/job/Creadur-Rat-Site-Latest-Jdk/ws/target/site/apidocs/org/apache/rat/document/impl/guesser/class-use/BinaryGuesser.html...>
Generating <https://builds.apache.org/job/Creadur-Rat-Site-Latest-Jdk/ws/target/site/apidocs/org/apache/rat/document/impl/guesser/class-use/ArchiveGuesser.html...>
Generating <https://builds.apache.org/job/Creadur-Rat-Site-Latest-Jdk/ws/target/site/apidocs/org/apache/rat/license/class-use/W3CSoftwareLicenseFamily.html...>
Generating <https://builds.apache.org/job/Creadur-Rat-Site-Latest-Jdk/ws/target/site/apidocs/org/apache/rat/license/class-use/W3CDocumentLicenseFamily.html...>
Generating <https://builds.apache.org/job/Creadur-Rat-Site-Latest-Jdk/ws/target/site/apidocs/org/apache/rat/license/class-use/SimpleLicenseFamily.html...>
Generating <https://builds.apache.org/job/Creadur-Rat-Site-Latest-Jdk/ws/target/site/apidocs/org/apache/rat/license/class-use/OASISLicenseFamily.html...>
Generating <https://builds.apache.org/job/Creadur-Rat-Site-Latest-Jdk/ws/target/site/apidocs/org/apache/rat/license/class-use/ModifiedBSDLicenseFamily.html...>
Generating <https://builds.apache.org/job/Creadur-Rat-Site-Latest-Jdk/ws/target/site/apidocs/org/apache/rat/license/class-use/MITLicenseFamily.html...>
Generating <https://builds.apache.org/job/Creadur-Rat-Site-Latest-Jdk/ws/target/site/apidocs/org/apache/rat/license/class-use/ILicenseFamily.html...>
Generating <https://builds.apache.org/job/Creadur-Rat-Site-Latest-Jdk/ws/target/site/apidocs/org/apache/rat/license/class-use/GPL3LicenseFamily.html...>
Generating <https://builds.apache.org/job/Creadur-Rat-Site-Latest-Jdk/ws/target/site/apidocs/org/apache/rat/license/class-use/GPL2LicenseFamily.html...>
Generating <https://builds.apache.org/job/Creadur-Rat-Site-Latest-Jdk/ws/target/site/apidocs/org/apache/rat/license/class-use/GPL1LicenseFamily.html...>
Generating <https://builds.apache.org/job/Creadur-Rat-Site-Latest-Jdk/ws/target/site/apidocs/org/apache/rat/license/class-use/CDDL1LicenseFamily.html...>
Generating <https://builds.apache.org/job/Creadur-Rat-Site-Latest-Jdk/ws/target/site/apidocs/org/apache/rat/license/class-use/Apache20LicenseFamily.html...>
Generating <https://builds.apache.org/job/Creadur-Rat-Site-Latest-Jdk/ws/target/site/apidocs/org/apache/rat/license/class-use/AcademicFree21LicenseFamily.html...>
Generating <https://builds.apache.org/job/Creadur-Rat-Site-Latest-Jdk/ws/target/site/apidocs/org/apache/rat/mp/class-use/LicenseFamilySpecification.html...>
Generating <https://builds.apache.org/job/Creadur-Rat-Site-Latest-Jdk/ws/target/site/apidocs/org/apache/rat/mp/class-use/AbstractRatMojo.html...>
Generating <https://builds.apache.org/job/Creadur-Rat-Site-Latest-Jdk/ws/target/site/apidocs/org/apache/rat/mp/class-use/RatReportMojo.html...>
Generating <https://builds.apache.org/job/Creadur-Rat-Site-Latest-Jdk/ws/target/site/apidocs/org/apache/rat/mp/class-use/ExclusionHelper.html...>
Generating <https://builds.apache.org/job/Creadur-Rat-Site-Latest-Jdk/ws/target/site/apidocs/org/apache/rat/mp/class-use/HeaderMatcherSpecification.html...>
Generating <https://builds.apache.org/job/Creadur-Rat-Site-Latest-Jdk/ws/target/site/apidocs/org/apache/rat/mp/class-use/RatCheckMojo.html...>
Generating <https://builds.apache.org/job/Creadur-Rat-Site-Latest-Jdk/ws/target/site/apidocs/org/apache/rat/mp/class-use/RatCheckException.html...>
Generating <https://builds.apache.org/job/Creadur-Rat-Site-Latest-Jdk/ws/target/site/apidocs/org/apache/rat/anttasks/class-use/SubstringLicenseMatcher.html...>
Generating <https://builds.apache.org/job/Creadur-Rat-Site-Latest-Jdk/ws/target/site/apidocs/org/apache/rat/anttasks/class-use/SubstringLicenseMatcher.Pattern.html...>
Generating <https://builds.apache.org/job/Creadur-Rat-Site-Latest-Jdk/ws/target/site/apidocs/org/apache/rat/anttasks/class-use/Report.html...>
Generating <https://builds.apache.org/job/Creadur-Rat-Site-Latest-Jdk/ws/target/site/apidocs/org/apache/rat/anttasks/class-use/Report.Format.html...>
Generating <https://builds.apache.org/job/Creadur-Rat-Site-Latest-Jdk/ws/target/site/apidocs/org/apache/rat/anttasks/class-use/Report.AddLicenseHeaders.html...>
Generating <https://builds.apache.org/job/Creadur-Rat-Site-Latest-Jdk/ws/target/site/apidocs/org/apache/rat/anttasks/class-use/FullTextLicenseMatcher.html...>
Generating <https://builds.apache.org/job/Creadur-Rat-Site-Latest-Jdk/ws/target/site/apidocs/package-use.html...>
Generating <https://builds.apache.org/job/Creadur-Rat-Site-Latest-Jdk/ws/target/site/apidocs/org/apache/rat/package-use.html...>
Generating <https://builds.apache.org/job/Creadur-Rat-Site-Latest-Jdk/ws/target/site/apidocs/org/apache/rat/analysis/package-use.html...>
Generating <https://builds.apache.org/job/Creadur-Rat-Site-Latest-Jdk/ws/target/site/apidocs/org/apache/rat/analysis/generation/package-use.html...>
Generating <https://builds.apache.org/job/Creadur-Rat-Site-Latest-Jdk/ws/target/site/apidocs/org/apache/rat/analysis/license/package-use.html...>
Generating <https://builds.apache.org/job/Creadur-Rat-Site-Latest-Jdk/ws/target/site/apidocs/org/apache/rat/analysis/util/package-use.html...>
Generating <https://builds.apache.org/job/Creadur-Rat-Site-Latest-Jdk/ws/target/site/apidocs/org/apache/rat/annotation/package-use.html...>
Generating <https://builds.apache.org/job/Creadur-Rat-Site-Latest-Jdk/ws/target/site/apidocs/org/apache/rat/anttasks/package-use.html...>
Generating <https://builds.apache.org/job/Creadur-Rat-Site-Latest-Jdk/ws/target/site/apidocs/org/apache/rat/api/package-use.html...>
Generating <https://builds.apache.org/job/Creadur-Rat-Site-Latest-Jdk/ws/target/site/apidocs/org/apache/rat/api/domain/package-use.html...>
Generating <https://builds.apache.org/job/Creadur-Rat-Site-Latest-Jdk/ws/target/site/apidocs/org/apache/rat/config/package-use.html...>
Generating <https://builds.apache.org/job/Creadur-Rat-Site-Latest-Jdk/ws/target/site/apidocs/org/apache/rat/document/package-use.html...>
Generating <https://builds.apache.org/job/Creadur-Rat-Site-Latest-Jdk/ws/target/site/apidocs/org/apache/rat/document/impl/package-use.html...>
Generating <https://builds.apache.org/job/Creadur-Rat-Site-Latest-Jdk/ws/target/site/apidocs/org/apache/rat/document/impl/guesser/package-use.html...>
Generating <https://builds.apache.org/job/Creadur-Rat-Site-Latest-Jdk/ws/target/site/apidocs/org/apache/rat/document/impl/util/package-use.html...>
Generating <https://builds.apache.org/job/Creadur-Rat-Site-Latest-Jdk/ws/target/site/apidocs/org/apache/rat/header/package-use.html...>
Generating <https://builds.apache.org/job/Creadur-Rat-Site-Latest-Jdk/ws/target/site/apidocs/org/apache/rat/license/package-use.html...>
Generating <https://builds.apache.org/job/Creadur-Rat-Site-Latest-Jdk/ws/target/site/apidocs/org/apache/rat/mp/package-use.html...>
Generating <https://builds.apache.org/job/Creadur-Rat-Site-Latest-Jdk/ws/target/site/apidocs/org/apache/rat/policy/package-use.html...>
Generating <https://builds.apache.org/job/Creadur-Rat-Site-Latest-Jdk/ws/target/site/apidocs/org/apache/rat/report/package-use.html...>
Generating <https://builds.apache.org/job/Creadur-Rat-Site-Latest-Jdk/ws/target/site/apidocs/org/apache/rat/report/claim/package-use.html...>
Generating <https://builds.apache.org/job/Creadur-Rat-Site-Latest-Jdk/ws/target/site/apidocs/org/apache/rat/report/claim/impl/package-use.html...>
Generating <https://builds.apache.org/job/Creadur-Rat-Site-Latest-Jdk/ws/target/site/apidocs/org/apache/rat/report/claim/impl/xml/package-use.html...>
Generating <https://builds.apache.org/job/Creadur-Rat-Site-Latest-Jdk/ws/target/site/apidocs/org/apache/rat/report/claim/util/package-use.html...>
Generating <https://builds.apache.org/job/Creadur-Rat-Site-Latest-Jdk/ws/target/site/apidocs/org/apache/rat/report/xml/package-use.html...>
Generating <https://builds.apache.org/job/Creadur-Rat-Site-Latest-Jdk/ws/target/site/apidocs/org/apache/rat/report/xml/writer/package-use.html...>
Generating <https://builds.apache.org/job/Creadur-Rat-Site-Latest-Jdk/ws/target/site/apidocs/org/apache/rat/report/xml/writer/impl/base/package-use.html...>
Generating <https://builds.apache.org/job/Creadur-Rat-Site-Latest-Jdk/ws/target/site/apidocs/org/apache/rat/walker/package-use.html...>
Building index for all the packages and classes...
Generating <https://builds.apache.org/job/Creadur-Rat-Site-Latest-Jdk/ws/target/site/apidocs/overview-tree.html...>
Generating <https://builds.apache.org/job/Creadur-Rat-Site-Latest-Jdk/ws/target/site/apidocs/index-all.html...>
Generating <https://builds.apache.org/job/Creadur-Rat-Site-Latest-Jdk/ws/target/site/apidocs/deprecated-list.html...>
Building index for all classes...
Generating <https://builds.apache.org/job/Creadur-Rat-Site-Latest-Jdk/ws/target/site/apidocs/allclasses-frame.html...>
Generating <https://builds.apache.org/job/Creadur-Rat-Site-Latest-Jdk/ws/target/site/apidocs/allclasses-noframe.html...>
Generating <https://builds.apache.org/job/Creadur-Rat-Site-Latest-Jdk/ws/target/site/apidocs/index.html...>
Generating <https://builds.apache.org/job/Creadur-Rat-Site-Latest-Jdk/ws/target/site/apidocs/overview-summary.html...>
Generating <https://builds.apache.org/job/Creadur-Rat-Site-Latest-Jdk/ws/target/site/apidocs/help-doc.html...>
1 error
[JENKINS] Archiving site from <https://builds.apache.org/job/Creadur-Rat-Site-Latest-Jdk/ws/target/site>
to /x1/jenkins/jenkins-home/jobs/Creadur-Rat-Site-Latest-Jdk/site
log4j:WARN No appenders could be found for logger (org.apache.commons.beanutils.converters.BooleanConverter).
log4j:WARN Please initialize the log4j system properly.
[INFO] ------------------------------------------------------------------------
[INFO] Reactor Summary:
[INFO] 
[INFO] Apache Creadur Rat ................................ FAILURE [ 39.127 s]
[INFO] Apache Creadur Rat::API ........................... SKIPPED
[INFO] Apache Creadur Rat::Core .......................... SKIPPED
[INFO] Apache Creadur Rat::Plugin4Maven .................. SKIPPED
[INFO] Apache Creadur Rat::Tasks4Ant ..................... SKIPPED
[INFO] Apache Creadur Rat::Command Line .................. SKIPPED
[INFO] ------------------------------------------------------------------------
[INFO] BUILD FAILURE
[INFO] ------------------------------------------------------------------------
[INFO] Total time: 42.132 s
[INFO] Finished at: 2015-02-24T00:35:49+00:00
[INFO] Final Memory: 44M/454M
[INFO] ------------------------------------------------------------------------
[ERROR] Failed to execute goal org.apache.maven.plugins:maven-site-plugin:3.4:site (default-site)
on project apache-rat-project: Error generating maven-javadoc-plugin:2.9.1:aggregate:
[ERROR] Exit code: 1 - <https://builds.apache.org/job/Creadur-Rat-Site-Latest-Jdk/ws/apache-rat-api/src/main/java/org/apache/rat/api/domain/LicenseFamily.java>:24:
error: self-closing element not allowed
[ERROR] * <p/>
[ERROR] ^
[ERROR] 
[ERROR] Command line was: /home/jenkins/jenkins-slave/tools/hudson.model.JDK/jdk-1.8.0/jre/../bin/javadoc
@options @packages @argfile
[ERROR] 
[ERROR] Refer to the generated Javadoc files in '<https://builds.apache.org/job/Creadur-Rat-Site-Latest-Jdk/ws/target/site/apidocs'>
dir.
[ERROR] -> [Help 1]
org.apache.maven.lifecycle.LifecycleExecutionException: Failed to execute goal org.apache.maven.plugins:maven-site-plugin:3.4:site
(default-site) on project apache-rat-project: Error generating maven-javadoc-plugin:2.9.1:aggregate:

Exit code: 1 - <https://builds.apache.org/job/Creadur-Rat-Site-Latest-Jdk/ws/apache-rat-api/src/main/java/org/apache/rat/api/domain/LicenseFamily.java>:24:
error: self-closing element not allowed
 * <p/>
   ^

Command line was: /home/jenkins/jenkins-slave/tools/hudson.model.JDK/jdk-1.8.0/jre/../bin/javadoc
@options @packages @argfile

Refer to the generated Javadoc files in '<https://builds.apache.org/job/Creadur-Rat-Site-Latest-Jdk/ws/target/site/apidocs'>
dir.

	at org.apache.maven.lifecycle.internal.MojoExecutor.execute(MojoExecutor.java:216)
	at org.apache.maven.lifecycle.internal.MojoExecutor.execute(MojoExecutor.java:153)
	at org.apache.maven.lifecycle.internal.MojoExecutor.execute(MojoExecutor.java:145)
	at org.apache.maven.lifecycle.internal.LifecycleModuleBuilder.buildProject(LifecycleModuleBuilder.java:108)
	at org.apache.maven.lifecycle.internal.LifecycleModuleBuilder.buildProject(LifecycleModuleBuilder.java:76)
	at org.apache.maven.lifecycle.internal.builder.singlethreaded.SingleThreadedBuilder.build(SingleThreadedBuilder.java:51)
	at org.apache.maven.lifecycle.internal.LifecycleStarter.execute(LifecycleStarter.java:116)
	at org.apache.maven.DefaultMaven.doExecute(DefaultMaven.java:361)
	at org.apache.maven.DefaultMaven.execute(DefaultMaven.java:155)
	at org.jvnet.hudson.maven3.launcher.Maven31Launcher.main(Maven31Launcher.java:132)
	at sun.reflect.NativeMethodAccessorImpl.invoke0(Native Method)
	at sun.reflect.NativeMethodAccessorImpl.invoke(NativeMethodAccessorImpl.java:62)
	at sun.reflect.DelegatingMethodAccessorImpl.invoke(DelegatingMethodAccessorImpl.java:43)
	at java.lang.reflect.Method.invoke(Method.java:483)
	at org.codehaus.plexus.classworlds.launcher.Launcher.launchStandard(Launcher.java:330)
	at org.codehaus.plexus.classworlds.launcher.Launcher.launch(Launcher.java:238)
	at jenkins.maven3.agent.Maven31Main.launch(Maven31Main.java:181)
	at sun.reflect.NativeMethodAccessorImpl.invoke0(Native Method)
	at sun.reflect.NativeMethodAccessorImpl.invoke(NativeMethodAccessorImpl.java:62)
	at sun.reflect.DelegatingMethodAccessorImpl.invoke(DelegatingMethodAccessorImpl.java:43)
	at java.lang.reflect.Method.invoke(Method.java:483)
	at hudson.maven.Maven3Builder.call(Maven3Builder.java:136)
	at hudson.maven.Maven3Builder.call(Maven3Builder.java:71)
	at hudson.remoting.UserRequest.perform(UserRequest.java:118)
	at hudson.remoting.UserRequest.perform(UserRequest.java:48)
	at hudson.remoting.Request$2.run(Request.java:328)
	at hudson.remoting.InterceptingExecutorService$1.call(InterceptingExecutorService.java:72)
	at java.util.concurrent.FutureTask.run(FutureTask.java:266)
	at java.util.concurrent.ThreadPoolExecutor.runWorker(ThreadPoolExecutor.java:1142)
	at java.util.concurrent.ThreadPoolExecutor$Worker.run(ThreadPoolExecutor.java:617)
	at java.lang.Thread.run(Thread.java:745)
Caused by: org.apache.maven.plugin.MojoExecutionException: Error generating maven-javadoc-plugin:2.9.1:aggregate:

Exit code: 1 - <https://builds.apache.org/job/Creadur-Rat-Site-Latest-Jdk/ws/apache-rat-api/src/main/java/org/apache/rat/api/domain/LicenseFamily.java>:24:
error: self-closing element not allowed
 * <p/>
   ^

Command line was: /home/jenkins/jenkins-slave/tools/hudson.model.JDK/jdk-1.8.0/jre/../bin/javadoc
@options @packages @argfile

Refer to the generated Javadoc files in '<https://builds.apache.org/job/Creadur-Rat-Site-Latest-Jdk/ws/target/site/apidocs'>
dir.

	at org.apache.maven.plugins.site.render.SiteMojo.execute(SiteMojo.java:146)
	at org.apache.maven.plugin.DefaultBuildPluginManager.executeMojo(DefaultBuildPluginManager.java:133)
	at org.apache.maven.lifecycle.internal.MojoExecutor.execute(MojoExecutor.java:208)
	... 30 more
Caused by: org.apache.maven.doxia.siterenderer.RendererException: Error generating maven-javadoc-plugin:2.9.1:aggregate:

Exit code: 1 - <https://builds.apache.org/job/Creadur-Rat-Site-Latest-Jdk/ws/apache-rat-api/src/main/java/org/apache/rat/api/domain/LicenseFamily.java>:24:
error: self-closing element not allowed
 * <p/>
   ^

Command line was: /home/jenkins/jenkins-slave/tools/hudson.model.JDK/jdk-1.8.0/jre/../bin/javadoc
@options @packages @argfile

Refer to the generated Javadoc files in '<https://builds.apache.org/job/Creadur-Rat-Site-Latest-Jdk/ws/target/site/apidocs'>
dir.

	at org.apache.maven.plugins.site.render.ReportDocumentRenderer.renderDocument(ReportDocumentRenderer.java:239)
	at org.apache.maven.doxia.siterenderer.DefaultSiteRenderer.renderModule(DefaultSiteRenderer.java:311)
	at org.apache.maven.doxia.siterenderer.DefaultSiteRenderer.render(DefaultSiteRenderer.java:129)
	at org.apache.maven.plugins.site.render.SiteMojo.renderLocale(SiteMojo.java:182)
	at org.apache.maven.plugins.site.render.SiteMojo.execute(SiteMojo.java:141)
	... 32 more
Caused by: org.apache.maven.reporting.MavenReportException: 
Exit code: 1 - <https://builds.apache.org/job/Creadur-Rat-Site-Latest-Jdk/ws/apache-rat-api/src/main/java/org/apache/rat/api/domain/LicenseFamily.java>:24:
error: self-closing element not allowed
 * <p/>
   ^

Command line was: /home/jenkins/jenkins-slave/tools/hudson.model.JDK/jdk-1.8.0/jre/../bin/javadoc
@options @packages @argfile

Refer to the generated Javadoc files in '<https://builds.apache.org/job/Creadur-Rat-Site-Latest-Jdk/ws/target/site/apidocs'>
dir.

	at org.apache.maven.plugin.javadoc.AbstractJavadocMojo.executeJavadocCommandLine(AbstractJavadocMojo.java:5074)
	at org.apache.maven.plugin.javadoc.AbstractJavadocMojo.executeReport(AbstractJavadocMojo.java:1999)
	at org.apache.maven.plugin.javadoc.JavadocReport.generate(JavadocReport.java:130)
	at org.apache.maven.plugins.site.render.ReportDocumentRenderer.renderDocument(ReportDocumentRenderer.java:233)
	... 36 more
[ERROR] 
[ERROR] Re-run Maven using the -X switch to enable full debug logging.
[ERROR] 
[ERROR] For more information about the errors and possible solutions, please read the following
articles:
[ERROR] [Help 1] http://cwiki.apache.org/confluence/display/MAVEN/MojoExecutionException
[JENKINS] Archiving <https://builds.apache.org/job/Creadur-Rat-Site-Latest-Jdk/ws/apache-rat-plugin/pom.xml>
to org.apache.rat/apache-rat-plugin/0.12-SNAPSHOT/apache-rat-plugin-0.12-SNAPSHOT.pom
Sending artifact delta relative to Creadur-Rat-Site-Latest-Jdk » Apache Creadur Rat::Plugin4Maven
#67
Archived 1 artifacts
Archive block size is 32768
Received 0 blocks and 9218 bytes
Compression is 0.0%
Took 89 ms
[JENKINS] Archiving <https://builds.apache.org/job/Creadur-Rat-Site-Latest-Jdk/ws/apache-rat-tasks/pom.xml>
to org.apache.rat/apache-rat-tasks/0.12-SNAPSHOT/apache-rat-tasks-0.12-SNAPSHOT.pom
Sending artifact delta relative to Creadur-Rat-Site-Latest-Jdk » Apache Creadur Rat::Tasks4Ant
#67
Archived 1 artifacts
Archive block size is 32768
Received 0 blocks and 6322 bytes
Compression is 0.0%
Took 80 ms
[JENKINS] Archiving <https://builds.apache.org/job/Creadur-Rat-Site-Latest-Jdk/ws/pom.xml>
to org.apache.rat/apache-rat-project/0.12-SNAPSHOT/apache-rat-project-0.12-SNAPSHOT.pom
Sending artifact delta relative to Creadur-Rat-Site-Latest-Jdk » Apache Creadur Rat #67
Archived 1 artifacts
Archive block size is 32768
Received 0 blocks and 22114 bytes
Compression is 0.0%
Took 81 ms
[JENKINS] Archiving <https://builds.apache.org/job/Creadur-Rat-Site-Latest-Jdk/ws/apache-rat-api/pom.xml>
to org.apache.rat/apache-rat-api/0.12-SNAPSHOT/apache-rat-api-0.12-SNAPSHOT.pom
No prior successful build to compare, so performing full copy of artifacts
[JENKINS] Archiving <https://builds.apache.org/job/Creadur-Rat-Site-Latest-Jdk/ws/apache-rat/pom.xml>
to org.apache.rat/apache-rat/0.12-SNAPSHOT/apache-rat-0.12-SNAPSHOT.pom
Sending artifact delta relative to Creadur-Rat-Site-Latest-Jdk » Apache Creadur Rat::Command
Line #67
Archived 1 artifacts
Archive block size is 32768
Received 0 blocks and 7019 bytes
Compression is 0.0%
Took 74 ms
[JENKINS] Archiving <https://builds.apache.org/job/Creadur-Rat-Site-Latest-Jdk/ws/apache-rat-core/pom.xml>
to org.apache.rat/apache-rat-core/0.12-SNAPSHOT/apache-rat-core-0.12-SNAPSHOT.pom
Sending artifact delta relative to Creadur-Rat-Site-Latest-Jdk » Apache Creadur Rat::Core
#67
Archived 1 artifacts
Archive block size is 32768
Received 0 blocks and 4323 bytes
Compression is 0.0%
Took 80 ms
channel stopped

Mime
View raw message