creadur-dev mailing list archives

Site index · List index
Message view « Date » · « Thread »
Top « Date » · « Thread »
From Apache Jenkins Server <jenk...@builds.apache.org>
Subject Build failed in Jenkins: Creadur-Whisker-Site-Latest-Jdk #9
Date Tue, 14 Oct 2014 21:23:01 GMT
See <https://builds.apache.org/job/Creadur-Whisker-Site-Latest-Jdk/9/changes>

Changes:

[pottlinger] Adding pluginManagement for maven-plugin-plugin

* This fixes the problem when generating javadoc automatically that version/author are empty.
* BUT: site:site does not work since a plugin-plugin:2.7 cannot be downloaded - I don't see
any references to that version.

------------------------------------------
[...truncated 3161 lines...]
[INFO] Fork Value is true
[INFO] Done FindBugs Analysis....
[INFO] Generating "Plugin Management" report    --- maven-project-info-reports-plugin:2.7:plugin-management
[INFO] Generating "Distribution Management" report --- maven-project-info-reports-plugin:2.7:distribution-management
[INFO] Generating "Dependency Information" report --- maven-project-info-reports-plugin:2.7:dependency-info
[INFO] Generating "Source Repository" report    --- maven-project-info-reports-plugin:2.7:scm
[INFO] Generating "Mailing Lists" report        --- maven-project-info-reports-plugin:2.7:mailing-list
[INFO] Generating "Issue Tracking" report       --- maven-project-info-reports-plugin:2.7:issue-tracking
[INFO] Generating "Continuous Integration" report --- maven-project-info-reports-plugin:2.7:cim
[INFO] Generating "Project Plugins" report      --- maven-project-info-reports-plugin:2.7:plugins
[INFO] Generating "Project License" report      --- maven-project-info-reports-plugin:2.7:license
[INFO] Generating "Dependency Management" report --- maven-project-info-reports-plugin:2.7:dependency-management
[INFO] Generating "Project Team" report         --- maven-project-info-reports-plugin:2.7:project-team
[INFO] Generating "Project Summary" report      --- maven-project-info-reports-plugin:2.7:summary
[INFO] Generating "Dependencies" report         --- maven-project-info-reports-plugin:2.7:dependencies
[JENKINS] Archiving site from <https://builds.apache.org/job/Creadur-Whisker-Site-Latest-Jdk/ws/apache-whisker-cli/target/site>
to /x1/jenkins/jenkins-home/jobs/Creadur-Whisker-Site-Latest-Jdk/site/apache-whisker-cli
[INFO]                                                                         
[INFO] ------------------------------------------------------------------------
[INFO] Building Apache Whisker::Maven Plugin 0.2-SNAPSHOT
[INFO] ------------------------------------------------------------------------
[INFO] 
[INFO] --- maven-clean-plugin:2.5:clean (default-clean) @ apache-whisker-maven-plugin ---
[INFO] Deleting <https://builds.apache.org/job/Creadur-Whisker-Site-Latest-Jdk/ws/apache-whisker-maven-plugin/target>
[INFO] 
[INFO] --- maven-site-plugin:3.4:site (default-site) @ apache-whisker-maven-plugin ---
[INFO] configuring report plugin org.apache.rat:apache-rat-plugin:0.11
[INFO] configuring report plugin org.apache.maven.plugins:maven-project-info-reports-plugin:2.7
[INFO] configuring report plugin org.apache.maven.plugins:maven-surefire-report-plugin:2.17
[INFO] preparing 'report' report requires '[surefire]test' forked phase execution
[INFO] 
[INFO] --- maven-enforcer-plugin:1.3.1:enforce (enforce-bytecode-version) @ apache-whisker-maven-plugin
---
[INFO] 
[INFO] --- apache-rat-plugin:0.11:check (default) @ apache-whisker-maven-plugin ---
[INFO] 51 implicit excludes (use -debug for more details).
[INFO] Exclude: src/site/resources/*.dia
[INFO] 60 resources included (use -debug for more details)
Warning:  org.apache.xerces.jaxp.SAXParserImpl$JAXPSAXParser: Property 'http://www.oracle.com/xml/jaxp/properties/entityExpansionLimit'
is not recognized.
Compiler warnings:
  WARNING:  'org.apache.xerces.jaxp.SAXParserImpl: Property 'http://javax.xml.XMLConstants/property/accessExternalDTD'
is not recognized.'
Warning:  org.apache.xerces.parsers.SAXParser: Feature 'http://javax.xml.XMLConstants/feature/secure-processing'
is not recognized.
Warning:  org.apache.xerces.parsers.SAXParser: Property 'http://javax.xml.XMLConstants/property/accessExternalDTD'
is not recognized.
Warning:  org.apache.xerces.parsers.SAXParser: Property 'http://www.oracle.com/xml/jaxp/properties/entityExpansionLimit'
is not recognized.
[INFO] Rat check: Summary of files. Unapproved: 0 unknown: 0 generated: 0 approved: 58 licence.
[INFO] 
[INFO] --- maven-plugin-plugin:3.3:helpmojo (help-goal) @ apache-whisker-maven-plugin ---
[INFO] Using 'UTF-8' encoding to read mojo metadata.
[INFO] Applying mojo extractor for language: java
[INFO] Mojo extractor for language: java found 0 mojo descriptors.
[INFO] Applying mojo extractor for language: bsh
[INFO] Mojo extractor for language: bsh found 0 mojo descriptors.
[INFO] Applying mojo extractor for language: java-annotations
[INFO] Mojo extractor for language: java-annotations found 0 mojo descriptors.
[INFO] 
[INFO] --- maven-plugin-plugin:3.3:descriptor (default-descriptor) @ apache-whisker-maven-plugin
---
[INFO] Using 'UTF-8' encoding to read mojo metadata.
[INFO] Applying mojo extractor for language: java
[INFO] Mojo extractor for language: java found 0 mojo descriptors.
[INFO] Applying mojo extractor for language: bsh
[INFO] Mojo extractor for language: bsh found 0 mojo descriptors.
[INFO] Applying mojo extractor for language: java-annotations
[INFO] Mojo extractor for language: java-annotations found 0 mojo descriptors.
[INFO] 
[INFO] --- maven-remote-resources-plugin:1.5:process (default) @ apache-whisker-maven-plugin
---
[INFO] 
[INFO] --- maven-resources-plugin:2.6:resources (default-resources) @ apache-whisker-maven-plugin
---
[INFO] Using 'UTF-8' encoding to copy filtered resources.
[INFO] skip non existing resourceDirectory <https://builds.apache.org/job/Creadur-Whisker-Site-Latest-Jdk/ws/apache-whisker-maven-plugin/src/main/resources>
[INFO] Copying 3 resources
[INFO] 
[INFO] --- maven-compiler-plugin:3.1:compile (default-compile) @ apache-whisker-maven-plugin
---
[INFO] Changes detected - recompiling the module!
[INFO] Compiling 3 source files to <https://builds.apache.org/job/Creadur-Whisker-Site-Latest-Jdk/ws/apache-whisker-maven-plugin/target/classes>
[INFO] 
[INFO] --- maven-plugin-plugin:3.3:descriptor (mojo-descriptor) @ apache-whisker-maven-plugin
---
[INFO] Using 'UTF-8' encoding to read mojo metadata.
[INFO] Applying mojo extractor for language: java
[INFO] Mojo extractor for language: java found 0 mojo descriptors.
[INFO] Applying mojo extractor for language: bsh
[INFO] Mojo extractor for language: bsh found 0 mojo descriptors.
[INFO] Applying mojo extractor for language: java-annotations
[INFO] Mojo extractor for language: java-annotations found 2 mojo descriptors.
[INFO] 
[INFO] --- animal-sniffer-maven-plugin:1.11:check (check-java-compatibility) @ apache-whisker-maven-plugin
---
[INFO] Checking unresolved references to org.codehaus.mojo.signature:java16:1.0
[INFO] 
[INFO] --- maven-resources-plugin:2.6:testResources (default-testResources) @ apache-whisker-maven-plugin
---
[INFO] Not copying test resources
[INFO] 
[INFO] --- maven-compiler-plugin:3.1:testCompile (default-testCompile) @ apache-whisker-maven-plugin
---
[INFO] Not compiling test sources
[INFO] 
[INFO] --- maven-surefire-plugin:2.16:test (default-test) @ apache-whisker-maven-plugin ---
[INFO] Tests are skipped.
[INFO] configuring report plugin org.apache.maven.plugins:maven-jxr-plugin:2.4
[INFO] configuring report plugin org.apache.maven.plugins:maven-plugin-plugin:2.17
Downloading: http://repo.maven.apache.org/maven2/org/apache/maven/plugins/maven-plugin-plugin/2.17/maven-plugin-plugin-2.17.pom
[WARNING] The POM for org.apache.maven.plugins:maven-plugin-plugin:jar:2.17 is missing, no
dependency information available
[INFO] ------------------------------------------------------------------------
[INFO] Reactor Summary:
[INFO] 
[INFO] Apache Whisker .................................... SUCCESS [1:19.069s]
[INFO] Apache Whisker::Model ............................. SUCCESS [26.782s]
[INFO] Apache Whisker::Scan .............................. SUCCESS [18.080s]
[INFO] Apache Whisker::XML ............................... SUCCESS [23.214s]
[INFO] Apache Whisker::App ............................... SUCCESS [42.353s]
[INFO] Apache Whisker::Output(velocity) .................. SUCCESS [27.364s]
[INFO] Apache Whisker::Command Line Interface ............ SUCCESS [26.739s]
[INFO] Apache Whisker::Maven Plugin ...................... FAILURE [5.707s]
[INFO] ------------------------------------------------------------------------
[INFO] BUILD FAILURE
[INFO] ------------------------------------------------------------------------
[INFO] Total time: 4:17.555s
[INFO] Finished at: Tue Oct 14 21:22:55 UTC 2014
[INFO] Final Memory: 106M/1465M
[INFO] ------------------------------------------------------------------------
Waiting for Jenkins to finish collecting data
[ERROR] Failed to execute goal org.apache.maven.plugins:maven-site-plugin:3.4:site (default-site)
on project apache-whisker-maven-plugin: failed to get report for org.apache.maven.plugins:maven-plugin-plugin:
Plugin org.apache.maven.plugins:maven-plugin-plugin:2.17 or one of its dependencies could
not be resolved: Failed to read artifact descriptor for org.apache.maven.plugins:maven-plugin-plugin:jar:2.17:
Could not find artifact org.apache.maven.plugins:maven-plugin-plugin:pom:2.17 in central (http://repo.maven.apache.org/maven2)
-> [Help 1]
org.apache.maven.lifecycle.LifecycleExecutionException: Failed to execute goal org.apache.maven.plugins:maven-site-plugin:3.4:site
(default-site) on project apache-whisker-maven-plugin: failed to get report for org.apache.maven.plugins:maven-plugin-plugin
	at org.apache.maven.lifecycle.internal.MojoExecutor.execute(MojoExecutor.java:217)
	at org.apache.maven.lifecycle.internal.MojoExecutor.execute(MojoExecutor.java:153)
	at org.apache.maven.lifecycle.internal.MojoExecutor.execute(MojoExecutor.java:145)
	at org.apache.maven.lifecycle.internal.LifecycleModuleBuilder.buildProject(LifecycleModuleBuilder.java:84)
	at org.apache.maven.lifecycle.internal.LifecycleModuleBuilder.buildProject(LifecycleModuleBuilder.java:59)
	at org.apache.maven.lifecycle.internal.LifecycleStarter.singleThreadedBuild(LifecycleStarter.java:183)
	at org.apache.maven.lifecycle.internal.LifecycleStarter.execute(LifecycleStarter.java:161)
	at org.apache.maven.DefaultMaven.doExecute(DefaultMaven.java:320)
	at org.apache.maven.DefaultMaven.execute(DefaultMaven.java:156)
	at org.jvnet.hudson.maven3.launcher.Maven3Launcher.main(Maven3Launcher.java:117)
	at sun.reflect.NativeMethodAccessorImpl.invoke0(Native Method)
	at sun.reflect.NativeMethodAccessorImpl.invoke(NativeMethodAccessorImpl.java:62)
	at sun.reflect.DelegatingMethodAccessorImpl.invoke(DelegatingMethodAccessorImpl.java:43)
	at java.lang.reflect.Method.invoke(Method.java:483)
	at org.codehaus.plexus.classworlds.launcher.Launcher.launchStandard(Launcher.java:329)
	at org.codehaus.plexus.classworlds.launcher.Launcher.launch(Launcher.java:239)
	at org.jvnet.hudson.maven3.agent.Maven3Main.launch(Maven3Main.java:178)
	at sun.reflect.NativeMethodAccessorImpl.invoke0(Native Method)
	at sun.reflect.NativeMethodAccessorImpl.invoke(NativeMethodAccessorImpl.java:62)
	at sun.reflect.DelegatingMethodAccessorImpl.invoke(DelegatingMethodAccessorImpl.java:43)
	at java.lang.reflect.Method.invoke(Method.java:483)
	at hudson.maven.Maven3Builder.call(Maven3Builder.java:134)
	at hudson.maven.Maven3Builder.call(Maven3Builder.java:69)
	at hudson.remoting.UserRequest.perform(UserRequest.java:118)
	at hudson.remoting.UserRequest.perform(UserRequest.java:48)
	at hudson.remoting.Request$2.run(Request.java:328)
	at hudson.remoting.InterceptingExecutorService$1.call(InterceptingExecutorService.java:72)
	at java.util.concurrent.FutureTask.run(FutureTask.java:266)
	at java.util.concurrent.ThreadPoolExecutor.runWorker(ThreadPoolExecutor.java:1142)
	at java.util.concurrent.ThreadPoolExecutor$Worker.run(ThreadPoolExecutor.java:617)
	at java.lang.Thread.run(Thread.java:745)
Caused by: org.apache.maven.plugin.MojoExecutionException: failed to get report for org.apache.maven.plugins:maven-plugin-plugin
	at org.apache.maven.reporting.exec.DefaultMavenReportExecutor.buildMavenReports(DefaultMavenReportExecutor.java:156)
	at org.apache.maven.plugins.site.render.AbstractSiteRenderingMojo.getReports(AbstractSiteRenderingMojo.java:239)
	at org.apache.maven.plugins.site.render.SiteMojo.execute(SiteMojo.java:124)
	at org.apache.maven.plugin.DefaultBuildPluginManager.executeMojo(DefaultBuildPluginManager.java:101)
	at org.apache.maven.lifecycle.internal.MojoExecutor.execute(MojoExecutor.java:209)
	... 30 more
Caused by: org.apache.maven.plugin.PluginResolutionException: Plugin org.apache.maven.plugins:maven-plugin-plugin:2.17
or one of its dependencies could not be resolved: Failed to read artifact descriptor for org.apache.maven.plugins:maven-plugin-plugin:jar:2.17
	at org.apache.maven.plugin.internal.DefaultPluginDependenciesResolver.resolve(DefaultPluginDependenciesResolver.java:129)
	at org.apache.maven.plugin.internal.DefaultMavenPluginManager.getPluginDescriptor(DefaultMavenPluginManager.java:142)
	at sun.reflect.GeneratedMethodAccessor130.invoke(Unknown Source)
	at sun.reflect.DelegatingMethodAccessorImpl.invoke(DelegatingMethodAccessorImpl.java:43)
	at java.lang.reflect.Method.invoke(Method.java:483)
	at org.apache.maven.reporting.exec.DefaultMavenPluginManagerHelper.getPluginDescriptor(DefaultMavenPluginManagerHelper.java:132)
	at org.apache.maven.reporting.exec.DefaultMavenReportExecutor.buildReportPlugin(DefaultMavenReportExecutor.java:178)
	at org.apache.maven.reporting.exec.DefaultMavenReportExecutor.buildMavenReports(DefaultMavenReportExecutor.java:151)
	... 34 more
Caused by: org.sonatype.aether.resolution.ArtifactDescriptorException: Failed to read artifact
descriptor for org.apache.maven.plugins:maven-plugin-plugin:jar:2.17
	at org.apache.maven.repository.internal.DefaultArtifactDescriptorReader.loadPom(DefaultArtifactDescriptorReader.java:296)
	at org.apache.maven.repository.internal.DefaultArtifactDescriptorReader.readArtifactDescriptor(DefaultArtifactDescriptorReader.java:186)
	at org.sonatype.aether.impl.internal.DefaultRepositorySystem.readArtifactDescriptor(DefaultRepositorySystem.java:279)
	at org.apache.maven.plugin.internal.DefaultPluginDependenciesResolver.resolve(DefaultPluginDependenciesResolver.java:115)
	... 41 more
Caused by: org.sonatype.aether.resolution.ArtifactResolutionException: Could not find artifact
org.apache.maven.plugins:maven-plugin-plugin:pom:2.17 in central (http://repo.maven.apache.org/maven2)
	at org.sonatype.aether.impl.internal.DefaultArtifactResolver.resolve(DefaultArtifactResolver.java:538)
	at org.sonatype.aether.impl.internal.DefaultArtifactResolver.resolveArtifacts(DefaultArtifactResolver.java:216)
	at org.sonatype.aether.impl.internal.DefaultArtifactResolver.resolveArtifact(DefaultArtifactResolver.java:193)
	at org.apache.maven.repository.internal.DefaultArtifactDescriptorReader.loadPom(DefaultArtifactDescriptorReader.java:281)
	... 44 more
Caused by: org.sonatype.aether.transfer.ArtifactNotFoundException: Could not find artifact
org.apache.maven.plugins:maven-plugin-plugin:pom:2.17 in central (http://repo.maven.apache.org/maven2)
	at org.sonatype.aether.connector.wagon.WagonRepositoryConnector$4.wrap(WagonRepositoryConnector.java:947)
	at org.sonatype.aether.connector.wagon.WagonRepositoryConnector$4.wrap(WagonRepositoryConnector.java:941)
	at org.sonatype.aether.connector.wagon.WagonRepositoryConnector$GetTask.run(WagonRepositoryConnector.java:669)
	at org.sonatype.aether.util.concurrency.RunnableErrorForwarder$1.run(RunnableErrorForwarder.java:60)
	... 3 more
[ERROR] 
[ERROR] Re-run Maven using the -X switch to enable full debug logging.
[ERROR] 
[ERROR] For more information about the errors and possible solutions, please read the following
articles:
[ERROR] [Help 1] http://cwiki.apache.org/confluence/display/MAVEN/MojoExecutionException
[ERROR] 
[ERROR] After correcting the problems, you can resume the build with the command
[ERROR]   mvn <goals> -rf :apache-whisker-maven-plugin
[JENKINS] Archiving <https://builds.apache.org/job/Creadur-Whisker-Site-Latest-Jdk/ws/pom.xml>
to org.apache.creadur.whisker/apache-whisker/0.2-SNAPSHOT/apache-whisker-0.2-SNAPSHOT.pom
Sending artifact delta relative to Creadur-Whisker-Site-Latest-Jdk » Apache Whisker #6
Archived 1 artifacts
Archive block size is 32768
Received 0 blocks and 16778 bytes
Compression is 0.0%
Took 31 ms
[JENKINS] Archiving <https://builds.apache.org/job/Creadur-Whisker-Site-Latest-Jdk/ws/apache-whisker-model/pom.xml>
to org.apache.creadur.whisker/apache-whisker-model/0.2-SNAPSHOT/apache-whisker-model-0.2-SNAPSHOT.pom
Sending artifact delta relative to Creadur-Whisker-Site-Latest-Jdk » Apache Whisker::Model
#6
Archived 1 artifacts
Archive block size is 32768
Received 0 blocks and 1957 bytes
Compression is 0.0%
Took 46 ms
[JENKINS] Archiving <https://builds.apache.org/job/Creadur-Whisker-Site-Latest-Jdk/ws/apache-whisker-maven-plugin/pom.xml>
to org.apache.creadur.whisker/apache-whisker-maven-plugin/0.2-SNAPSHOT/apache-whisker-maven-plugin-0.2-SNAPSHOT.pom
Sending artifact delta relative to Creadur-Whisker-Site-Latest-Jdk » Apache Whisker::Maven
Plugin #6
Archived 1 artifacts
Archive block size is 32768
Received 0 blocks and 7437 bytes
Compression is 0.0%
Took 47 ms
[JENKINS] Archiving <https://builds.apache.org/job/Creadur-Whisker-Site-Latest-Jdk/ws/apache-whisker-xml/pom.xml>
to org.apache.creadur.whisker/apache-whisker-xml/0.2-SNAPSHOT/apache-whisker-xml-0.2-SNAPSHOT.pom
Sending artifact delta relative to Creadur-Whisker-Site-Latest-Jdk » Apache Whisker::XML
#6
Archived 1 artifacts
Archive block size is 32768
Received 0 blocks and 2227 bytes
Compression is 0.0%
Took 47 ms
[JENKINS] Archiving <https://builds.apache.org/job/Creadur-Whisker-Site-Latest-Jdk/ws/apache-whisker-scan/pom.xml>
to org.apache.creadur.whisker/apache-whisker-scan/0.2-SNAPSHOT/apache-whisker-scan-0.2-SNAPSHOT.pom
Sending artifact delta relative to Creadur-Whisker-Site-Latest-Jdk » Apache Whisker::Scan
#6
Archived 1 artifacts
Archive block size is 32768
Received 0 blocks and 1827 bytes
Compression is 0.0%
Took 36 ms
[JENKINS] Archiving <https://builds.apache.org/job/Creadur-Whisker-Site-Latest-Jdk/ws/apache-whisker-app/pom.xml>
to org.apache.creadur.whisker/apache-whisker-app/0.2-SNAPSHOT/apache-whisker-app-0.2-SNAPSHOT.pom
Sending artifact delta relative to Creadur-Whisker-Site-Latest-Jdk » Apache Whisker::App
#6
Archived 1 artifacts
Archive block size is 32768
Received 0 blocks and 2590 bytes
Compression is 0.0%
Took 28 ms
[JENKINS] Archiving <https://builds.apache.org/job/Creadur-Whisker-Site-Latest-Jdk/ws/apache-whisker-cli/pom.xml>
to org.apache.creadur.whisker/apache-whisker-cli/0.2-SNAPSHOT/apache-whisker-cli-0.2-SNAPSHOT.pom
Sending artifact delta relative to Creadur-Whisker-Site-Latest-Jdk » Apache Whisker::Command
Line Interface #6
Archived 1 artifacts
Archive block size is 32768
Received 0 blocks and 4979 bytes
Compression is 0.0%
Took 44 ms
[JENKINS] Archiving <https://builds.apache.org/job/Creadur-Whisker-Site-Latest-Jdk/ws/apache-whisker-velocity/pom.xml>
to org.apache.creadur.whisker/apache-whisker-velocity/0.2-SNAPSHOT/apache-whisker-velocity-0.2-SNAPSHOT.pom
Sending artifact delta relative to Creadur-Whisker-Site-Latest-Jdk » Apache Whisker::Output(velocity)
#6
Archived 1 artifacts
Archive block size is 32768
Received 0 blocks and 3024 bytes
Compression is 0.0%
Took 45 ms
channel stopped

Mime
View raw message