creadur-dev mailing list archives

Site index · List index
Message view « Date » · « Thread »
Top « Date » · « Thread »
From Apache Jenkins Server <jenk...@builds.apache.org>
Subject Build failed in Jenkins: Creadur-Rat-Site #44
Date Wed, 01 Oct 2014 22:42:31 GMT
See <https://builds.apache.org/job/Creadur-Rat-Site/44/>

------------------------------------------
[...truncated 2498 lines...]
Downloading: http://repo.maven.apache.org/maven2/org/apache/maven/scm/maven-scm-provider-starteam/1.8/maven-scm-provider-starteam-1.8.jar
Downloaded: http://repo.maven.apache.org/maven2/org/apache/maven/scm/maven-scm-provider-hg/1.8/maven-scm-provider-hg-1.8.jar
(65 KB at 3397.6 KB/sec)
Downloading: http://repo.maven.apache.org/maven2/org/apache/maven/scm/maven-scm-provider-svn-commons/1.8/maven-scm-provider-svn-commons-1.8.jar
Downloaded: http://repo.maven.apache.org/maven2/regexp/regexp/1.3/regexp-1.3.jar (25 KB at
1460.8 KB/sec)
Downloading: http://repo.maven.apache.org/maven2/org/apache/maven/scm/maven-scm-provider-svnexe/1.8/maven-scm-provider-svnexe-1.8.jar
Downloaded: http://repo.maven.apache.org/maven2/org/jsoup/jsoup/1.6.1/jsoup-1.6.1.jar (275
KB at 7431.9 KB/sec)
Downloading: http://repo.maven.apache.org/maven2/org/apache/maven/scm/maven-scm-provider-cvs-commons/1.8/maven-scm-provider-cvs-commons-1.8.jar
Downloaded: http://repo.maven.apache.org/maven2/org/apache/maven/scm/maven-scm-provider-starteam/1.8/maven-scm-provider-starteam-1.8.jar
(73 KB at 3821.3 KB/sec)
Downloading: http://repo.maven.apache.org/maven2/org/apache/maven/scm/maven-scm-provider-cvsexe/1.8/maven-scm-provider-cvsexe-1.8.jar
Downloaded: http://repo.maven.apache.org/maven2/org/apache/maven/scm/maven-scm-provider-perforce/1.8/maven-scm-provider-perforce-1.8.jar
(80 KB at 3993.6 KB/sec)
Downloading: http://repo.maven.apache.org/maven2/org/apache/maven/scm/maven-scm-provider-cvsjava/1.8/maven-scm-provider-cvsjava-1.8.jar
Downloaded: http://repo.maven.apache.org/maven2/org/apache/maven/scm/maven-scm-provider-svn-commons/1.8/maven-scm-provider-svn-commons-1.8.jar
(40 KB at 2194.4 KB/sec)
Downloading: http://repo.maven.apache.org/maven2/org/netbeans/lib/cvsclient/20060125/cvsclient-20060125.jar
Downloaded: http://repo.maven.apache.org/maven2/org/apache/maven/scm/maven-scm-provider-svnexe/1.8/maven-scm-provider-svnexe-1.8.jar
(75 KB at 3944.8 KB/sec)
Downloading: http://repo.maven.apache.org/maven2/ch/ethz/ganymed/ganymed-ssh2/build210/ganymed-ssh2-build210.jar
Downloaded: http://repo.maven.apache.org/maven2/org/apache/maven/scm/maven-scm-provider-cvs-commons/1.8/maven-scm-provider-cvs-commons-1.8.jar
(79 KB at 4333.7 KB/sec)
Downloading: http://repo.maven.apache.org/maven2/org/apache/maven/scm/maven-scm-provider-gitexe/1.8/maven-scm-provider-gitexe-1.8.jar
Downloaded: http://repo.maven.apache.org/maven2/org/apache/maven/scm/maven-scm-provider-cvsexe/1.8/maven-scm-provider-cvsexe-1.8.jar
(30 KB at 1618.7 KB/sec)
Downloading: http://repo.maven.apache.org/maven2/org/apache/maven/scm/maven-scm-provider-git-commons/1.8/maven-scm-provider-git-commons-1.8.jar
Downloaded: http://repo.maven.apache.org/maven2/org/apache/maven/scm/maven-scm-provider-cvsjava/1.8/maven-scm-provider-cvsjava-1.8.jar
(43 KB at 2356.6 KB/sec)
Downloading: http://repo.maven.apache.org/maven2/org/apache/maven/doxia/doxia-logging-api/1.4/doxia-logging-api-1.4.jar
Downloaded: http://repo.maven.apache.org/maven2/org/apache/maven/scm/maven-scm-provider-gitexe/1.8/maven-scm-provider-gitexe-1.8.jar
(62 KB at 3395.0 KB/sec)
Downloading: http://repo.maven.apache.org/maven2/org/apache/maven/doxia/doxia-core/1.4/doxia-core-1.4.jar
Downloaded: http://repo.maven.apache.org/maven2/org/apache/maven/scm/maven-scm-provider-git-commons/1.8/maven-scm-provider-git-commons-1.8.jar
(37 KB at 2052.4 KB/sec)
Downloading: http://repo.maven.apache.org/maven2/org/apache/maven/doxia/doxia-module-xhtml/1.4/doxia-module-xhtml-1.4.jar
Downloaded: http://repo.maven.apache.org/maven2/org/apache/maven/doxia/doxia-logging-api/1.4/doxia-logging-api-1.4.jar
(12 KB at 613.7 KB/sec)
Downloading: http://repo.maven.apache.org/maven2/org/codehaus/plexus/plexus-interpolation/1.9/plexus-interpolation-1.9.jar
Downloaded: http://repo.maven.apache.org/maven2/ch/ethz/ganymed/ganymed-ssh2/build210/ganymed-ssh2-build210.jar
(240 KB at 9962.2 KB/sec)
Downloading: http://repo.maven.apache.org/maven2/commons-validator/commons-validator/1.4.0/commons-validator-1.4.0.jar
Downloaded: http://repo.maven.apache.org/maven2/org/apache/maven/doxia/doxia-module-xhtml/1.4/doxia-module-xhtml-1.4.jar
(16 KB at 883.9 KB/sec)
Downloading: http://repo.maven.apache.org/maven2/commons-beanutils/commons-beanutils/1.8.3/commons-beanutils-1.8.3.jar
Downloaded: http://repo.maven.apache.org/maven2/org/codehaus/plexus/plexus-interpolation/1.9/plexus-interpolation-1.9.jar
(50 KB at 2762.9 KB/sec)
Downloading: http://repo.maven.apache.org/maven2/joda-time/joda-time/1.6.2/joda-time-1.6.2.jar
Downloaded: http://repo.maven.apache.org/maven2/org/apache/maven/doxia/doxia-core/1.4/doxia-core-1.4.jar
(162 KB at 8051.5 KB/sec)
Downloaded: http://repo.maven.apache.org/maven2/commons-validator/commons-validator/1.4.0/commons-validator-1.4.0.jar
(173 KB at 8637.5 KB/sec)
Downloaded: http://repo.maven.apache.org/maven2/org/netbeans/lib/cvsclient/20060125/cvsclient-20060125.jar
(605 KB at 8755.4 KB/sec)
Downloaded: http://repo.maven.apache.org/maven2/commons-beanutils/commons-beanutils/1.8.3/commons-beanutils-1.8.3.jar
(227 KB at 9063.2 KB/sec)
Downloaded: http://repo.maven.apache.org/maven2/joda-time/joda-time/1.6.2/joda-time-1.6.2.jar
(531 KB at 17107.0 KB/sec)
[INFO] configuring report plugin org.apache.rat:apache-rat-plugin:0.11
[INFO] Parent project loaded from repository: org.apache:apache:pom:14
Downloading: http://repo.maven.apache.org/maven2/org/apache/apache/14/apache-14-site_en.xml
Downloading: http://repo.maven.apache.org/maven2/org/apache/apache/14/apache-14-site.xml
Downloading: http://repo.maven.apache.org/maven2/org/apache/maven/skins/maven-default-skin/1.0/maven-default-skin-1.0.jar
Downloaded: http://repo.maven.apache.org/maven2/org/apache/maven/skins/maven-default-skin/1.0/maven-default-skin-1.0.jar
(8 KB at 362.6 KB/sec)
[INFO] Rendering site with org.apache.maven.skins:maven-default-skin:jar:1.0 skin.
[INFO] Skipped "Surefire Report" report (maven-surefire-report-plugin:2.17:report), file "surefire-report.html"
already exists for the English version.
[INFO] Rendering 3 Doxia documents: 2 apt, 1 xdoc
[INFO] Generating "Surefire Report" report      --- maven-surefire-report-plugin:2.17:report-only
[INFO] Generating "JavaDocs" report             --- maven-javadoc-plugin:2.9.1:aggregate
Downloading: http://repo.maven.apache.org/maven2/org/apache/maven/plugin-tools/maven-plugin-tools-javadoc/3.3/maven-plugin-tools-javadoc-3.3.pom
Downloaded: http://repo.maven.apache.org/maven2/org/apache/maven/plugin-tools/maven-plugin-tools-javadoc/3.3/maven-plugin-tools-javadoc-3.3.pom
(5 KB at 138.1 KB/sec)
Downloading: http://repo.maven.apache.org/maven2/org/apache/maven/plugin-tools/maven-plugin-tools-javadoc/3.3/maven-plugin-tools-javadoc-3.3.jar
Downloaded: http://repo.maven.apache.org/maven2/org/apache/maven/plugin-tools/maven-plugin-tools-javadoc/3.3/maven-plugin-tools-javadoc-3.3.jar
(32 KB at 1254.1 KB/sec)
[WARNING] Unable to auto-detect Taglet class names from '/jenkins/maven-repositories/0/org/apache/maven/plugin-tools/maven-plugin-tools-javadoc/3.3/maven-plugin-tools-javadoc-3.3.jar'.
Try to specify them with <taglets/>.
Downloading: http://repo.maven.apache.org/maven2/org/easytesting/fest-assert/1.4/fest-assert-1.4.pom
Downloaded: http://repo.maven.apache.org/maven2/org/easytesting/fest-assert/1.4/fest-assert-1.4.pom
(3 KB at 128.9 KB/sec)
Downloading: http://repo.maven.apache.org/maven2/org/easytesting/fest/1.0.8/fest-1.0.8.pom
Downloaded: http://repo.maven.apache.org/maven2/org/easytesting/fest/1.0.8/fest-1.0.8.pom
(12 KB at 695.1 KB/sec)
Downloading: http://repo.maven.apache.org/maven2/org/easytesting/fest-util/1.1.6/fest-util-1.1.6.pom
Downloaded: http://repo.maven.apache.org/maven2/org/easytesting/fest-util/1.1.6/fest-util-1.1.6.pom
(2 KB at 84.6 KB/sec)
Downloading: http://repo.maven.apache.org/maven2/junit/junit/3.8.2/junit-3.8.2.jar
Downloading: http://repo.maven.apache.org/maven2/org/apache/maven/maven-plugin-descriptor/2.2.1/maven-plugin-descriptor-2.2.1.jar
Downloading: http://repo.maven.apache.org/maven2/org/easytesting/fest-assert/1.4/fest-assert-1.4.jar
Downloading: http://repo.maven.apache.org/maven2/org/easytesting/fest-util/1.1.6/fest-util-1.1.6.jar
Downloaded: http://repo.maven.apache.org/maven2/org/apache/maven/maven-plugin-descriptor/2.2.1/maven-plugin-descriptor-2.2.1.jar
(39 KB at 2131.3 KB/sec)
Downloaded: http://repo.maven.apache.org/maven2/org/easytesting/fest-assert/1.4/fest-assert-1.4.jar
(77 KB at 4032.2 KB/sec)
Downloaded: http://repo.maven.apache.org/maven2/junit/junit/3.8.2/junit-3.8.2.jar (118 KB
at 4712.5 KB/sec)
Downloaded: http://repo.maven.apache.org/maven2/org/easytesting/fest-util/1.1.6/fest-util-1.1.6.jar
(31 KB at 488.8 KB/sec)
[JENKINS] Archiving site from <https://builds.apache.org/job/Creadur-Rat-Site/ws/target/site>
to /x1/jenkins/jenkins-home/jobs/Creadur-Rat-Site/site
[INFO] ------------------------------------------------------------------------
[INFO] Reactor Summary:
[INFO] 
[INFO] Apache Creadur Rat ................................ FAILURE [3:30.363s]
[INFO] Apache Creadur Rat::Core .......................... SKIPPED
[INFO] Apache Creadur Rat::Plugin4Maven .................. SKIPPED
[INFO] Apache Creadur Rat::Tasks4Ant ..................... SKIPPED
[INFO] Apache Creadur Rat::Command Line .................. SKIPPED
[INFO] ------------------------------------------------------------------------
[INFO] BUILD FAILURE
[INFO] ------------------------------------------------------------------------
[INFO] Total time: 3:41.503s
[INFO] Finished at: Wed Oct 01 22:41:43 UTC 2014
[INFO] Final Memory: 34M/134M
[INFO] ------------------------------------------------------------------------
Waiting for Jenkins to finish collecting data
[ERROR] Failed to execute goal org.apache.maven.plugins:maven-site-plugin:3.4:site (default-site)
on project apache-rat-project: Error generating maven-javadoc-plugin:2.9.1:aggregate: Unable
to resolve artifact:groupId = 'org.apache.maven.plugin-tools'
[ERROR] artifactId = 'maven-plugin-tools-javadoc'
[ERROR] version = '3.3': Missing:
[ERROR] ----------
[ERROR] 1) com.sun:tools:jar:1.4.2
[ERROR] 
[ERROR] Try downloading the file manually from the project website.
[ERROR] 
[ERROR] Then, install it using the command:
[ERROR] mvn install:install-file -DgroupId=com.sun -DartifactId=tools -Dversion=1.4.2 -Dpackaging=jar
-Dfile=/path/to/file
[ERROR] 
[ERROR] Alternatively, if you host your own repository you can deploy the file there:
[ERROR] mvn deploy:deploy-file -DgroupId=com.sun -DartifactId=tools -Dversion=1.4.2 -Dpackaging=jar
-Dfile=/path/to/file -Durl=[url] -DrepositoryId=[id]
[ERROR] 
[ERROR] Path to dependency:
[ERROR] 1) org.apache.maven.plugin-tools:maven-plugin-tools-javadoc:jar:3.3
[ERROR] 2) com.sun:tools:jar:1.4.2
[ERROR] 
[ERROR] ----------
[ERROR] 1 required artifact is missing.
[ERROR] 
[ERROR] for artifact:
[ERROR] org.apache.maven.plugin-tools:maven-plugin-tools-javadoc:jar:3.3
[ERROR] 
[ERROR] from the specified remote repositories:
[ERROR] Nexus (http://repository.apache.org/snapshots, releases=false, snapshots=true),
[ERROR] central (http://repo.maven.apache.org/maven2, releases=true, snapshots=false)
[ERROR] -> [Help 1]
org.apache.maven.lifecycle.LifecycleExecutionException: Failed to execute goal org.apache.maven.plugins:maven-site-plugin:3.4:site
(default-site) on project apache-rat-project: Error generating maven-javadoc-plugin:2.9.1:aggregate:
Unable to resolve artifact:groupId = 'org.apache.maven.plugin-tools'
artifactId = 'maven-plugin-tools-javadoc'
version = '3.3'
	at org.apache.maven.lifecycle.internal.MojoExecutor.execute(MojoExecutor.java:217)
	at org.apache.maven.lifecycle.internal.MojoExecutor.execute(MojoExecutor.java:153)
	at org.apache.maven.lifecycle.internal.MojoExecutor.execute(MojoExecutor.java:145)
	at org.apache.maven.lifecycle.internal.LifecycleModuleBuilder.buildProject(LifecycleModuleBuilder.java:84)
	at org.apache.maven.lifecycle.internal.LifecycleModuleBuilder.buildProject(LifecycleModuleBuilder.java:59)
	at org.apache.maven.lifecycle.internal.LifecycleStarter.singleThreadedBuild(LifecycleStarter.java:183)
	at org.apache.maven.lifecycle.internal.LifecycleStarter.execute(LifecycleStarter.java:161)
	at org.apache.maven.DefaultMaven.doExecute(DefaultMaven.java:320)
	at org.apache.maven.DefaultMaven.execute(DefaultMaven.java:156)
	at org.jvnet.hudson.maven3.launcher.Maven3Launcher.main(Maven3Launcher.java:117)
	at sun.reflect.NativeMethodAccessorImpl.invoke0(Native Method)
	at sun.reflect.NativeMethodAccessorImpl.invoke(NativeMethodAccessorImpl.java:57)
	at sun.reflect.DelegatingMethodAccessorImpl.invoke(DelegatingMethodAccessorImpl.java:43)
	at java.lang.reflect.Method.invoke(Method.java:606)
	at org.codehaus.plexus.classworlds.launcher.Launcher.launchStandard(Launcher.java:329)
	at org.codehaus.plexus.classworlds.launcher.Launcher.launch(Launcher.java:239)
	at org.jvnet.hudson.maven3.agent.Maven3Main.launch(Maven3Main.java:178)
	at sun.reflect.NativeMethodAccessorImpl.invoke0(Native Method)
	at sun.reflect.NativeMethodAccessorImpl.invoke(NativeMethodAccessorImpl.java:57)
	at sun.reflect.DelegatingMethodAccessorImpl.invoke(DelegatingMethodAccessorImpl.java:43)
	at java.lang.reflect.Method.invoke(Method.java:606)
	at hudson.maven.Maven3Builder.call(Maven3Builder.java:134)
	at hudson.maven.Maven3Builder.call(Maven3Builder.java:69)
	at hudson.remoting.UserRequest.perform(UserRequest.java:118)
	at hudson.remoting.UserRequest.perform(UserRequest.java:48)
	at hudson.remoting.Request$2.run(Request.java:328)
	at hudson.remoting.InterceptingExecutorService$1.call(InterceptingExecutorService.java:72)
	at java.util.concurrent.FutureTask.run(FutureTask.java:262)
	at java.util.concurrent.ThreadPoolExecutor.runWorker(ThreadPoolExecutor.java:1145)
	at java.util.concurrent.ThreadPoolExecutor$Worker.run(ThreadPoolExecutor.java:615)
	at java.lang.Thread.run(Thread.java:745)
Caused by: org.apache.maven.plugin.MojoExecutionException: Error generating maven-javadoc-plugin:2.9.1:aggregate:
Unable to resolve artifact:groupId = 'org.apache.maven.plugin-tools'
artifactId = 'maven-plugin-tools-javadoc'
version = '3.3'
	at org.apache.maven.plugins.site.render.SiteMojo.execute(SiteMojo.java:146)
	at org.apache.maven.plugin.DefaultBuildPluginManager.executeMojo(DefaultBuildPluginManager.java:101)
	at org.apache.maven.lifecycle.internal.MojoExecutor.execute(MojoExecutor.java:209)
	... 30 more
Caused by: org.apache.maven.doxia.siterenderer.RendererException: Error generating maven-javadoc-plugin:2.9.1:aggregate:
Unable to resolve artifact:groupId = 'org.apache.maven.plugin-tools'
artifactId = 'maven-plugin-tools-javadoc'
version = '3.3'
	at org.apache.maven.plugins.site.render.ReportDocumentRenderer.renderDocument(ReportDocumentRenderer.java:239)
	at org.apache.maven.doxia.siterenderer.DefaultSiteRenderer.renderModule(DefaultSiteRenderer.java:311)
	at org.apache.maven.doxia.siterenderer.DefaultSiteRenderer.render(DefaultSiteRenderer.java:129)
	at org.apache.maven.plugins.site.render.SiteMojo.renderLocale(SiteMojo.java:182)
	at org.apache.maven.plugins.site.render.SiteMojo.execute(SiteMojo.java:141)
	... 32 more
Caused by: org.apache.maven.reporting.MavenReportException: Unable to resolve artifact:groupId
= 'org.apache.maven.plugin-tools'
artifactId = 'maven-plugin-tools-javadoc'
version = '3.3'
	at org.apache.maven.plugin.javadoc.AbstractJavadocMojo.getArtifactsAbsolutePath(AbstractJavadocMojo.java:3333)
	at org.apache.maven.plugin.javadoc.AbstractJavadocMojo.getTagletPath(AbstractJavadocMojo.java:2885)
	at org.apache.maven.plugin.javadoc.AbstractJavadocMojo.addStandardDocletOptions(AbstractJavadocMojo.java:4737)
	at org.apache.maven.plugin.javadoc.AbstractJavadocMojo.executeReport(AbstractJavadocMojo.java:1954)
	at org.apache.maven.plugin.javadoc.JavadocReport.generate(JavadocReport.java:130)
	at org.apache.maven.plugins.site.render.ReportDocumentRenderer.renderDocument(ReportDocumentRenderer.java:233)
	... 36 more
Caused by: org.apache.maven.artifact.resolver.MultipleArtifactsNotFoundException: Missing:
----------
1) com.sun:tools:jar:1.4.2

  Try downloading the file manually from the project website.

  Then, install it using the command: 
      mvn install:install-file -DgroupId=com.sun -DartifactId=tools -Dversion=1.4.2 -Dpackaging=jar
-Dfile=/path/to/file

  Alternatively, if you host your own repository you can deploy the file there: 
      mvn deploy:deploy-file -DgroupId=com.sun -DartifactId=tools -Dversion=1.4.2 -Dpackaging=jar
-Dfile=/path/to/file -Durl=[url] -DrepositoryId=[id]

  Path to dependency: 
  	1) org.apache.maven.plugin-tools:maven-plugin-tools-javadoc:jar:3.3
  	2) com.sun:tools:jar:1.4.2

----------
1 required artifact is missing.

for artifact: 
  org.apache.maven.plugin-tools:maven-plugin-tools-javadoc:jar:3.3

from the specified remote repositories:
  Nexus (http://repository.apache.org/snapshots, releases=false, snapshots=true),
  central (http://repo.maven.apache.org/maven2, releases=true, snapshots=false)

	at org.apache.maven.artifact.resolver.DefaultResolutionErrorHandler.throwErrors(DefaultResolutionErrorHandler.java:71)
	at org.apache.maven.artifact.resolver.DefaultArtifactResolver.resolveWithExceptions(DefaultArtifactResolver.java:326)
	at org.apache.maven.artifact.resolver.DefaultArtifactResolver.resolveTransitively(DefaultArtifactResolver.java:314)
	at org.apache.maven.artifact.resolver.DefaultArtifactResolver.resolveTransitively(DefaultArtifactResolver.java:293)
	at org.apache.maven.artifact.resolver.DefaultArtifactResolver.resolveTransitively(DefaultArtifactResolver.java:271)
	at org.apache.maven.artifact.resolver.DefaultArtifactResolver.resolveTransitively(DefaultArtifactResolver.java:256)
	at org.apache.maven.artifact.resolver.DefaultArtifactResolver.resolveTransitively(DefaultArtifactResolver.java:278)
	at org.apache.maven.plugin.javadoc.AbstractJavadocMojo.getArtifactsAbsolutePath(AbstractJavadocMojo.java:3314)
	... 41 more
[ERROR] 
[ERROR] Re-run Maven using the -X switch to enable full debug logging.
[ERROR] 
[ERROR] For more information about the errors and possible solutions, please read the following
articles:
[ERROR] [Help 1] http://cwiki.apache.org/confluence/display/MAVEN/MojoExecutionException
[JENKINS] Archiving <https://builds.apache.org/job/Creadur-Rat-Site/ws/apache-rat-plugin/pom.xml>
to org.apache.rat/apache-rat-plugin/0.12-SNAPSHOT/apache-rat-plugin-0.12-SNAPSHOT.pom
Sending artifact delta relative to Creadur-Rat-Site » Apache Creadur Rat::Plugin4Maven #43
Archived 1 artifacts
Archive block size is 32768
Received 0 blocks and 8988 bytes
Compression is 0.0%
Took 20 sec
[JENKINS] Archiving <https://builds.apache.org/job/Creadur-Rat-Site/ws/apache-rat-tasks/pom.xml>
to org.apache.rat/apache-rat-tasks/0.12-SNAPSHOT/apache-rat-tasks-0.12-SNAPSHOT.pom
Sending artifact delta relative to Creadur-Rat-Site » Apache Creadur Rat::Tasks4Ant #43
Archived 1 artifacts
Archive block size is 32768
Received 0 blocks and 6322 bytes
Compression is 0.0%
Took 0.28 sec
[JENKINS] Archiving <https://builds.apache.org/job/Creadur-Rat-Site/ws/pom.xml> to org.apache.rat/apache-rat-project/0.12-SNAPSHOT/apache-rat-project-0.12-SNAPSHOT.pom
Sending artifact delta relative to Creadur-Rat-Site » Apache Creadur Rat #43
Archived 1 artifacts
Archive block size is 32768
Received 0 blocks and 21411 bytes
Compression is 0.0%
Took 0.36 sec
[JENKINS] Archiving <https://builds.apache.org/job/Creadur-Rat-Site/ws/apache-rat/pom.xml>
to org.apache.rat/apache-rat/0.12-SNAPSHOT/apache-rat-0.12-SNAPSHOT.pom
Sending artifact delta relative to Creadur-Rat-Site » Apache Creadur Rat::Command Line #43
Archived 1 artifacts
Archive block size is 32768
Received 0 blocks and 7053 bytes
Compression is 0.0%
Took 2.7 sec
[JENKINS] Archiving <https://builds.apache.org/job/Creadur-Rat-Site/ws/apache-rat-core/pom.xml>
to org.apache.rat/apache-rat-core/0.12-SNAPSHOT/apache-rat-core-0.12-SNAPSHOT.pom
Sending artifact delta relative to Creadur-Rat-Site » Apache Creadur Rat::Core #43
Archived 1 artifacts
Archive block size is 32768
Received 0 blocks and 4202 bytes
Compression is 0.0%
Took 0.35 sec
channel stopped

Mime
View raw message