creadur-dev mailing list archives

Site index · List index
Message view « Date » · « Thread »
Top « Date » · « Thread »
From "P. Ottlinger" <pottlin...@apache.org>
Subject Fwd: Build failed in Jenkins: Creadur-Whisker-Site-Latest-Jdk #9 -request for help / mvn problems
Date Tue, 14 Oct 2014 21:26:47 GMT
Hi everyone,

I'm not really sure how the build can be fixed.

I've introduced a pluginManagement section to prevent a javadoc-plugin
error that complained about the HelpMojo's empty @version/author ...
but I don't really get where the
org.apache.maven.plugins:maven-plugin-plugin:jar:2.17
dependency comes from.

mvn dependency:tree does not show any active import/usage.

Any help is greatly appreciated -
thanks,

Phil


-------- Weitergeleitete Nachricht --------
Betreff: Build failed in Jenkins: Creadur-Whisker-Site-Latest-Jdk #9
Datum: Tue, 14 Oct 2014 21:23:01 +0000 (UTC)
Von: Apache Jenkins Server <jenkins@builds.apache.org>
Antwort an: dev@creadur.apache.org
An: dev@creadur.apache.org, pottlinger@apache.org

See
<https://builds.apache.org/job/Creadur-Whisker-Site-Latest-Jdk/9/changes>

<snip>
------------------------------------------------------------------------
[INFO] Reactor Summary:
[INFO]
[INFO] Apache Whisker .................................... SUCCESS
[1:19.069s]
[INFO] Apache Whisker::Model ............................. SUCCESS [26.782s]
[INFO] Apache Whisker::Scan .............................. SUCCESS [18.080s]
[INFO] Apache Whisker::XML ............................... SUCCESS [23.214s]
[INFO] Apache Whisker::App ............................... SUCCESS [42.353s]
[INFO] Apache Whisker::Output(velocity) .................. SUCCESS [27.364s]
[INFO] Apache Whisker::Command Line Interface ............ SUCCESS [26.739s]
[INFO] Apache Whisker::Maven Plugin ...................... FAILURE [5.707s]
[INFO]
------------------------------------------------------------------------
[INFO] BUILD FAILURE
[INFO]
------------------------------------------------------------------------
[INFO] Total time: 4:17.555s
[INFO] Finished at: Tue Oct 14 21:22:55 UTC 2014
[INFO] Final Memory: 106M/1465M
[INFO]
------------------------------------------------------------------------
Waiting for Jenkins to finish collecting data
[ERROR] Failed to execute goal
org.apache.maven.plugins:maven-site-plugin:3.4:site (default-site) on
project apache-whisker-maven-plugin: failed to get report for
org.apache.maven.plugins:maven-plugin-plugin: Plugin
org.apache.maven.plugins:maven-plugin-plugin:2.17 or one of its
dependencies could not be resolved: Failed to read artifact descriptor
for org.apache.maven.plugins:maven-plugin-plugin:jar:2.17: Could not
find artifact org.apache.maven.plugins:maven-plugin-plugin:pom:2.17 in
central (http://repo.maven.apache.org/maven2) -> [Help 1]
org.apache.maven.lifecycle.LifecycleExecutionException: Failed to
execute goal org.apache.maven.plugins:maven-site-plugin:3.4:site
(default-site) on project apache-whisker-maven-plugin: failed to get
report for org.apache.maven.plugins:maven-plugin-plugin
	at
org.apache.maven.lifecycle.internal.MojoExecutor.execute(MojoExecutor.java:217)
	at
org.apache.maven.lifecycle.internal.MojoExecutor.execute(MojoExecutor.java:153)
	at
org.apache.maven.lifecycle.internal.MojoExecutor.execute(MojoExecutor.java:145)
	at
org.apache.maven.lifecycle.internal.LifecycleModuleBuilder.buildProject(LifecycleModuleBuilder.java:84)
	at
org.apache.maven.lifecycle.internal.LifecycleModuleBuilder.buildProject(LifecycleModuleBuilder.java:59)
	at
org.apache.maven.lifecycle.internal.LifecycleStarter.singleThreadedBuild(LifecycleStarter.java:183)
	at
org.apache.maven.lifecycle.internal.LifecycleStarter.execute(LifecycleStarter.java:161)
	at org.apache.maven.DefaultMaven.doExecute(DefaultMaven.java:320)
	at org.apache.maven.DefaultMaven.execute(DefaultMaven.java:156)
	at
org.jvnet.hudson.maven3.launcher.Maven3Launcher.main(Maven3Launcher.java:117)
	at sun.reflect.NativeMethodAccessorImpl.invoke0(Native Method)
	at
sun.reflect.NativeMethodAccessorImpl.invoke(NativeMethodAccessorImpl.java:62)
	at
sun.reflect.DelegatingMethodAccessorImpl.invoke(DelegatingMethodAccessorImpl.java:43)
	at java.lang.reflect.Method.invoke(Method.java:483)
	at
org.codehaus.plexus.classworlds.launcher.Launcher.launchStandard(Launcher.java:329)
	at
org.codehaus.plexus.classworlds.launcher.Launcher.launch(Launcher.java:239)
	at org.jvnet.hudson.maven3.agent.Maven3Main.launch(Maven3Main.java:178)
	at sun.reflect.NativeMethodAccessorImpl.invoke0(Native Method)
	at
sun.reflect.NativeMethodAccessorImpl.invoke(NativeMethodAccessorImpl.java:62)
	at
sun.reflect.DelegatingMethodAccessorImpl.invoke(DelegatingMethodAccessorImpl.java:43)
	at java.lang.reflect.Method.invoke(Method.java:483)
	at hudson.maven.Maven3Builder.call(Maven3Builder.java:134)
	at hudson.maven.Maven3Builder.call(Maven3Builder.java:69)
	at hudson.remoting.UserRequest.perform(UserRequest.java:118)
	at hudson.remoting.UserRequest.perform(UserRequest.java:48)
	at hudson.remoting.Request$2.run(Request.java:328)
	at
hudson.remoting.InterceptingExecutorService$1.call(InterceptingExecutorService.java:72)
	at java.util.concurrent.FutureTask.run(FutureTask.java:266)
	at
java.util.concurrent.ThreadPoolExecutor.runWorker(ThreadPoolExecutor.java:1142)
	at
java.util.concurrent.ThreadPoolExecutor$Worker.run(ThreadPoolExecutor.java:617)
	at java.lang.Thread.run(Thread.java:745)
Caused by: org.apache.maven.plugin.MojoExecutionException: failed to get
report for org.apache.maven.plugins:maven-plugin-plugin
	at
org.apache.maven.reporting.exec.DefaultMavenReportExecutor.buildMavenReports(DefaultMavenReportExecutor.java:156)
	at
org.apache.maven.plugins.site.render.AbstractSiteRenderingMojo.getReports(AbstractSiteRenderingMojo.java:239)
	at org.apache.maven.plugins.site.render.SiteMojo.execute(SiteMojo.java:124)
	at
org.apache.maven.plugin.DefaultBuildPluginManager.executeMojo(DefaultBuildPluginManager.java:101)
	at
org.apache.maven.lifecycle.internal.MojoExecutor.execute(MojoExecutor.java:209)
	... 30 more
Caused by: org.apache.maven.plugin.PluginResolutionException: Plugin
org.apache.maven.plugins:maven-plugin-plugin:2.17 or one of its
dependencies could not be resolved: Failed to read artifact descriptor
for org.apache.maven.plugins:maven-plugin-plugin:jar:2.17
	at
org.apache.maven.plugin.internal.DefaultPluginDependenciesResolver.resolve(DefaultPluginDependenciesResolver.java:129)
	at
org.apache.maven.plugin.internal.DefaultMavenPluginManager.getPluginDescriptor(DefaultMavenPluginManager.java:142)
	at sun.reflect.GeneratedMethodAccessor130.invoke(Unknown Source)
	at
sun.reflect.DelegatingMethodAccessorImpl.invoke(DelegatingMethodAccessorImpl.java:43)
	at java.lang.reflect.Method.invoke(Method.java:483)
	at
org.apache.maven.reporting.exec.DefaultMavenPluginManagerHelper.getPluginDescriptor(DefaultMavenPluginManagerHelper.java:132)
	at
org.apache.maven.reporting.exec.DefaultMavenReportExecutor.buildReportPlugin(DefaultMavenReportExecutor.java:178)
	at
org.apache.maven.reporting.exec.DefaultMavenReportExecutor.buildMavenReports(DefaultMavenReportExecutor.java:151)
	... 34 more
Caused by: org.sonatype.aether.resolution.ArtifactDescriptorException:
Failed to read artifact descriptor for
org.apache.maven.plugins:maven-plugin-plugin:jar:2.17
	at
org.apache.maven.repository.internal.DefaultArtifactDescriptorReader.loadPom(DefaultArtifactDescriptorReader.java:296)
	at
org.apache.maven.repository.internal.DefaultArtifactDescriptorReader.readArtifactDescriptor(DefaultArtifactDescriptorReader.java:186)
	at
org.sonatype.aether.impl.internal.DefaultRepositorySystem.readArtifactDescriptor(DefaultRepositorySystem.java:279)
	at
org.apache.maven.plugin.internal.DefaultPluginDependenciesResolver.resolve(DefaultPluginDependenciesResolver.java:115)
	... 41 more
Caused by: org.sonatype.aether.resolution.ArtifactResolutionException:
Could not find artifact
org.apache.maven.plugins:maven-plugin-plugin:pom:2.17 in central
(http://repo.maven.apache.org/maven2)
	at
org.sonatype.aether.impl.internal.DefaultArtifactResolver.resolve(DefaultArtifactResolver.java:538)
	at
org.sonatype.aether.impl.internal.DefaultArtifactResolver.resolveArtifacts(DefaultArtifactResolver.java:216)
	at
org.sonatype.aether.impl.internal.DefaultArtifactResolver.resolveArtifact(DefaultArtifactResolver.java:193)
	at
org.apache.maven.repository.internal.DefaultArtifactDescriptorReader.loadPom(DefaultArtifactDescriptorReader.java:281)
	... 44 more
Caused by: org.sonatype.aether.transfer.ArtifactNotFoundException: Could
not find artifact org.apache.maven.plugins:maven-plugin-plugin:pom:2.17
in central (http://repo.maven.apache.org/maven2)
	at
org.sonatype.aether.connector.wagon.WagonRepositoryConnector$4.wrap(WagonRepositoryConnector.java:947)
	at
org.sonatype.aether.connector.wagon.WagonRepositoryConnector$4.wrap(WagonRepositoryConnector.java:941)
	at
org.sonatype.aether.connector.wagon.WagonRepositoryConnector$GetTask.run(WagonRepositoryConnector.java:669)
	at
org.sonatype.aether.util.concurrency.RunnableErrorForwarder$1.run(RunnableErrorForwarder.java:60)
	... 3 more
[ERROR]
[ERROR] Re-run Maven using the -X switch to enable full debug logging.
[ERROR]
[ERROR] For more information about the errors and possible solutions,
please read the following articles:
[ERROR] [Help 1]
http://cwiki.apache.org/confluence/display/MAVEN/MojoExecutionException
[ERROR]
[ERROR] After correcting the problems, you can resume the build with the
command
[ERROR]   mvn <goals> -rf :apache-whisker-maven-plugin



Mime
View raw message