creadur-dev mailing list archives

Site index · List index
Message view « Date » · « Thread »
Top « Date » · « Thread »
From Apache Jenkins Server <jenk...@builds.apache.org>
Subject Build failed in Jenkins: Creadur-Rat-Site #45
Date Fri, 03 Oct 2014 21:12:10 GMT
See <https://builds.apache.org/job/Creadur-Rat-Site/45/changes>

Changes:

[pottlinger] RAT-174 CDDL still too slow

* Applied patch from Chris Burroughs to replace Pattern-Matchers with basic String operations.
Let's see if CDDL-users complain, but restore performance.

------------------------------------------
[...truncated 976 lines...]
Generating <https://builds.apache.org/job/Creadur-Rat-Site/ws/target/site/apidocs/org/apache/rat/anttasks/class-use/SubstringLicenseMatcher.html...>
Generating <https://builds.apache.org/job/Creadur-Rat-Site/ws/target/site/apidocs/org/apache/rat/anttasks/class-use/SubstringLicenseMatcher.Pattern.html...>
Generating <https://builds.apache.org/job/Creadur-Rat-Site/ws/target/site/apidocs/org/apache/rat/anttasks/class-use/Report.html...>
Generating <https://builds.apache.org/job/Creadur-Rat-Site/ws/target/site/apidocs/org/apache/rat/anttasks/class-use/Report.Format.html...>
Generating <https://builds.apache.org/job/Creadur-Rat-Site/ws/target/site/apidocs/org/apache/rat/anttasks/class-use/Report.AddLicenseHeaders.html...>
Generating <https://builds.apache.org/job/Creadur-Rat-Site/ws/target/site/apidocs/org/apache/rat/anttasks/class-use/FullTextLicenseMatcher.html...>
Generating <https://builds.apache.org/job/Creadur-Rat-Site/ws/target/site/apidocs/package-use.html...>
Generating <https://builds.apache.org/job/Creadur-Rat-Site/ws/target/site/apidocs/org/apache/rat/package-use.html...>
Generating <https://builds.apache.org/job/Creadur-Rat-Site/ws/target/site/apidocs/org/apache/rat/analysis/package-use.html...>
Generating <https://builds.apache.org/job/Creadur-Rat-Site/ws/target/site/apidocs/org/apache/rat/analysis/generation/package-use.html...>
Generating <https://builds.apache.org/job/Creadur-Rat-Site/ws/target/site/apidocs/org/apache/rat/analysis/license/package-use.html...>
Generating <https://builds.apache.org/job/Creadur-Rat-Site/ws/target/site/apidocs/org/apache/rat/analysis/util/package-use.html...>
Generating <https://builds.apache.org/job/Creadur-Rat-Site/ws/target/site/apidocs/org/apache/rat/annotation/package-use.html...>
Generating <https://builds.apache.org/job/Creadur-Rat-Site/ws/target/site/apidocs/org/apache/rat/anttasks/package-use.html...>
Generating <https://builds.apache.org/job/Creadur-Rat-Site/ws/target/site/apidocs/org/apache/rat/api/package-use.html...>
Generating <https://builds.apache.org/job/Creadur-Rat-Site/ws/target/site/apidocs/org/apache/rat/config/package-use.html...>
Generating <https://builds.apache.org/job/Creadur-Rat-Site/ws/target/site/apidocs/org/apache/rat/document/package-use.html...>
Generating <https://builds.apache.org/job/Creadur-Rat-Site/ws/target/site/apidocs/org/apache/rat/document/impl/package-use.html...>
Generating <https://builds.apache.org/job/Creadur-Rat-Site/ws/target/site/apidocs/org/apache/rat/document/impl/guesser/package-use.html...>
Generating <https://builds.apache.org/job/Creadur-Rat-Site/ws/target/site/apidocs/org/apache/rat/document/impl/util/package-use.html...>
Generating <https://builds.apache.org/job/Creadur-Rat-Site/ws/target/site/apidocs/org/apache/rat/header/package-use.html...>
Generating <https://builds.apache.org/job/Creadur-Rat-Site/ws/target/site/apidocs/org/apache/rat/license/package-use.html...>
Generating <https://builds.apache.org/job/Creadur-Rat-Site/ws/target/site/apidocs/org/apache/rat/mp/package-use.html...>
Generating <https://builds.apache.org/job/Creadur-Rat-Site/ws/target/site/apidocs/org/apache/rat/policy/package-use.html...>
Generating <https://builds.apache.org/job/Creadur-Rat-Site/ws/target/site/apidocs/org/apache/rat/report/package-use.html...>
Generating <https://builds.apache.org/job/Creadur-Rat-Site/ws/target/site/apidocs/org/apache/rat/report/claim/package-use.html...>
Generating <https://builds.apache.org/job/Creadur-Rat-Site/ws/target/site/apidocs/org/apache/rat/report/claim/impl/package-use.html...>
Generating <https://builds.apache.org/job/Creadur-Rat-Site/ws/target/site/apidocs/org/apache/rat/report/claim/impl/xml/package-use.html...>
Generating <https://builds.apache.org/job/Creadur-Rat-Site/ws/target/site/apidocs/org/apache/rat/report/claim/util/package-use.html...>
Generating <https://builds.apache.org/job/Creadur-Rat-Site/ws/target/site/apidocs/org/apache/rat/report/xml/package-use.html...>
Generating <https://builds.apache.org/job/Creadur-Rat-Site/ws/target/site/apidocs/org/apache/rat/report/xml/writer/package-use.html...>
Generating <https://builds.apache.org/job/Creadur-Rat-Site/ws/target/site/apidocs/org/apache/rat/report/xml/writer/impl/base/package-use.html...>
Generating <https://builds.apache.org/job/Creadur-Rat-Site/ws/target/site/apidocs/org/apache/rat/walker/package-use.html...>
Building index for all the packages and classes...
Generating <https://builds.apache.org/job/Creadur-Rat-Site/ws/target/site/apidocs/overview-tree.html...>
Generating <https://builds.apache.org/job/Creadur-Rat-Site/ws/target/site/apidocs/index-all.html...>
Generating <https://builds.apache.org/job/Creadur-Rat-Site/ws/target/site/apidocs/deprecated-list.html...>
Building index for all classes...
Generating <https://builds.apache.org/job/Creadur-Rat-Site/ws/target/site/apidocs/allclasses-frame.html...>
Generating <https://builds.apache.org/job/Creadur-Rat-Site/ws/target/site/apidocs/allclasses-noframe.html...>
Generating <https://builds.apache.org/job/Creadur-Rat-Site/ws/target/site/apidocs/index.html...>
Generating <https://builds.apache.org/job/Creadur-Rat-Site/ws/target/site/apidocs/overview-summary.html...>
Generating <https://builds.apache.org/job/Creadur-Rat-Site/ws/target/site/apidocs/help-doc.html...>
Note: Custom tags that could override future standard tags:  @requiresDependencyResolution,
@requiresReports, @execute, @configurator, @aggregator, @threadSafe, @instantiationStrategy,
@executionStrategy, @goal, @requiresOnline, @parameter, @requiresDirectInvocation, @inheritByDefault,
@component, @requiresProject, @required, @readonly, @phase, @requiresDependencyCollection.
To avoid potential overrides, use at least one period character (.) in custom tag names.
[INFO] Generating "Source Xref" report          --- maven-jxr-plugin:2.4:aggregate
[INFO] Generating "Test Source Xref" report     --- maven-jxr-plugin:2.4:test-aggregate
[INFO] Generating "Dependencies" report         --- maven-project-info-reports-plugin:2.7:dependencies
[INFO] Generating "Project Team" report         --- maven-project-info-reports-plugin:2.7:project-team
[INFO] Generating "Mailing Lists" report        --- maven-project-info-reports-plugin:2.7:mailing-list
[INFO] Generating "Issue Tracking" report       --- maven-project-info-reports-plugin:2.7:issue-tracking
[INFO] Generating "Continuous Integration" report --- maven-project-info-reports-plugin:2.7:cim
[INFO] Generating "Project License" report      --- maven-project-info-reports-plugin:2.7:license
[INFO] Generating "Source Repository" report    --- maven-project-info-reports-plugin:2.7:scm
[INFO] Generating "Rat Report" report           --- apache-rat-plugin:0.11:rat
[INFO] 55 implicit excludes (use -debug for more details).
[INFO] Exclude: BUILD.txt
[INFO] Exclude: apache-rat/README*.txt
[INFO] Exclude: apache-rat-core/src/test/resources/**
[INFO] Exclude: apache-rat*/target/**
[INFO] Exclude: apache-rat-plugin/src/test/resources/**
[INFO] Exclude: apache-rat-plugin/src/it/**
[INFO] Exclude: apache-rat-tasks/src/test/resources/**
[INFO] 14 resources included (use -debug for more details)
Warning:  org.apache.xerces.jaxp.SAXParserImpl$JAXPSAXParser: Property 'http://www.oracle.com/xml/jaxp/properties/entityExpansionLimit'
is not recognized.
Compiler warnings:
  WARNING:  'org.apache.xerces.jaxp.SAXParserImpl: Property 'http://javax.xml.XMLConstants/property/accessExternalDTD'
is not recognized.'
Warning:  org.apache.xerces.parsers.SAXParser: Feature 'http://javax.xml.XMLConstants/feature/secure-processing'
is not recognized.
Warning:  org.apache.xerces.parsers.SAXParser: Property 'http://javax.xml.XMLConstants/property/accessExternalDTD'
is not recognized.
Warning:  org.apache.xerces.parsers.SAXParser: Property 'http://www.oracle.com/xml/jaxp/properties/entityExpansionLimit'
is not recognized.
[JENKINS] Archiving site from <https://builds.apache.org/job/Creadur-Rat-Site/ws/target/site>
to /x1/jenkins/jenkins-home/jobs/Creadur-Rat-Site/site
[INFO]                                                                         
[INFO] ------------------------------------------------------------------------
[INFO] Building Apache Creadur Rat::Core 0.12-SNAPSHOT
[INFO] ------------------------------------------------------------------------
[INFO] 
[INFO] --- maven-clean-plugin:2.5:clean (default-clean) @ apache-rat-core ---
[INFO] Deleting <https://builds.apache.org/job/Creadur-Rat-Site/ws/apache-rat-core/target>
[INFO] 
[INFO] --- maven-antrun-plugin:1.7:run (copy-site-resources) @ apache-rat-core ---
[INFO] Executing tasks

main:
     [copy] Warning: Could not find file <https://builds.apache.org/job/Creadur-Rat-Site/ws/apache-rat-core/RELEASE_NOTES.txt>
to copy.
[INFO] Executed tasks
[INFO] 
[INFO] --- maven-site-plugin:3.4:site (default-site) @ apache-rat-core ---
[INFO] configuring report plugin org.apache.maven.plugins:maven-surefire-report-plugin:2.17
[INFO] preparing 'report' report requires '[surefire]test' forked phase execution
[INFO] 
[INFO] --- maven-enforcer-plugin:1.3.1:enforce (enforce-bytecode-version) @ apache-rat-core
---
[INFO] 
[INFO] --- apache-rat-plugin:0.11:check (default) @ apache-rat-core ---
[INFO] 51 implicit excludes (use -debug for more details).
[INFO] Exclude: src/test/resources/appliedAL20/bad/*.*
[INFO] Exclude: src/test/resources/oasis/bad/*.*
[INFO] Exclude: src/test/resources/elements/Source.java
[INFO] Exclude: src/test/resources/elements/ILoggerFactory.java
[INFO] Exclude: src/test/resources/elements/sub/Empty.txt
[INFO] Exclude: src/test/resources/violations/bad.txt
[INFO] Exclude: src/test/resources/violations/FilterTest.cs
[INFO] Exclude: src/test/resources/binaries/Image-png.not
[INFO] 158 resources included (use -debug for more details)
Warning:  org.apache.xerces.jaxp.SAXParserImpl$JAXPSAXParser: Property 'http://www.oracle.com/xml/jaxp/properties/entityExpansionLimit'
is not recognized.
Compiler warnings:
  WARNING:  'org.apache.xerces.jaxp.SAXParserImpl: Property 'http://javax.xml.XMLConstants/property/accessExternalDTD'
is not recognized.'
Warning:  org.apache.xerces.parsers.SAXParser: Feature 'http://javax.xml.XMLConstants/feature/secure-processing'
is not recognized.
Warning:  org.apache.xerces.parsers.SAXParser: Property 'http://javax.xml.XMLConstants/property/accessExternalDTD'
is not recognized.
Warning:  org.apache.xerces.parsers.SAXParser: Property 'http://www.oracle.com/xml/jaxp/properties/entityExpansionLimit'
is not recognized.
[INFO] Rat check: Summary of files. Unapproved: 0 unknown: 0 generated: 0 approved: 150 licence.
[INFO] 
[INFO] --- maven-remote-resources-plugin:1.5:process (default) @ apache-rat-core ---
[INFO] 
[INFO] --- maven-resources-plugin:2.6:resources (default-resources) @ apache-rat-core ---
[INFO] Using 'UTF-8' encoding to copy filtered resources.
[INFO] Copying 1 resource
[INFO] skip non existing resourceDirectory <https://builds.apache.org/job/Creadur-Rat-Site/ws/apache-rat-core/src/main/filtered-resources>
[INFO] Copying 1 resource to META-INF
[INFO] Copying 3 resources
[INFO] 
[INFO] --- maven-compiler-plugin:3.1:compile (default-compile) @ apache-rat-core ---
[INFO] Changes detected - recompiling the module!
[INFO] Compiling 91 source files to <https://builds.apache.org/job/Creadur-Rat-Site/ws/apache-rat-core/target/classes>
[INFO] -------------------------------------------------------------
[ERROR] COMPILATION ERROR : 
[INFO] -------------------------------------------------------------
[ERROR] <https://builds.apache.org/job/Creadur-Rat-Site/ws/apache-rat-core/src/main/java/org/apache/rat/analysis/license/CDDL1License.java>:[59,5]
method does not override a method from its superclass
[INFO] 1 error
[INFO] -------------------------------------------------------------
[INFO] ------------------------------------------------------------------------
[INFO] Reactor Summary:
[INFO] 
[INFO] Apache Creadur Rat ................................ SUCCESS [57.502s]
[INFO] Apache Creadur Rat::Core .......................... FAILURE [6.018s]
[INFO] Apache Creadur Rat::Plugin4Maven .................. SKIPPED
[INFO] Apache Creadur Rat::Tasks4Ant ..................... SKIPPED
[INFO] Apache Creadur Rat::Command Line .................. SKIPPED
[INFO] ------------------------------------------------------------------------
[INFO] BUILD FAILURE
[INFO] ------------------------------------------------------------------------
[INFO] Total time: 1:08.465s
[INFO] Finished at: Fri Oct 03 21:12:07 UTC 2014
[INFO] Final Memory: 37M/730M
[INFO] ------------------------------------------------------------------------
Waiting for Jenkins to finish collecting data[ERROR] Failed to execute goal org.apache.maven.plugins:maven-site-plugin:3.4:site
(default-site) on project apache-rat-core: failed to get report for org.apache.maven.plugins:maven-surefire-report-plugin:
Failed to execute goal org.apache.maven.plugins:maven-compiler-plugin:3.1:compile (default-compile)
on project apache-rat-core: Compilation failure
[ERROR] <https://builds.apache.org/job/Creadur-Rat-Site/ws/apache-rat-core/src/main/java/org/apache/rat/analysis/license/CDDL1License.java>:[59,5]
method does not override a method from its superclass
[ERROR] -> [Help 1]
org.apache.maven.lifecycle.LifecycleExecutionException: Failed to execute goal org.apache.maven.plugins:maven-site-plugin:3.4:site
(default-site) on project apache-rat-core: failed to get report for org.apache.maven.plugins:maven-surefire-report-plugin
	at org.apache.maven.lifecycle.internal.MojoExecutor.execute(MojoExecutor.java:217)
	at org.apache.maven.lifecycle.internal.MojoExecutor.execute(MojoExecutor.java:153)
	at org.apache.maven.lifecycle.internal.MojoExecutor.execute(MojoExecutor.java:145)
	at org.apache.maven.lifecycle.internal.LifecycleModuleBuilder.buildProject(LifecycleModuleBuilder.java:84)
	at org.apache.maven.lifecycle.internal.LifecycleModuleBuilder.buildProject(LifecycleModuleBuilder.java:59)
	at org.apache.maven.lifecycle.internal.LifecycleStarter.singleThreadedBuild(LifecycleStarter.java:183)
	at org.apache.maven.lifecycle.internal.LifecycleStarter.execute(LifecycleStarter.java:161)
	at org.apache.maven.DefaultMaven.doExecute(DefaultMaven.java:320)
	at org.apache.maven.DefaultMaven.execute(DefaultMaven.java:156)
	at org.jvnet.hudson.maven3.launcher.Maven3Launcher.main(Maven3Launcher.java:117)
	at sun.reflect.NativeMethodAccessorImpl.invoke0(Native Method)
	at sun.reflect.NativeMethodAccessorImpl.invoke(NativeMethodAccessorImpl.java:57)
	at sun.reflect.DelegatingMethodAccessorImpl.invoke(DelegatingMethodAccessorImpl.java:43)
	at java.lang.reflect.Method.invoke(Method.java:606)
	at org.codehaus.plexus.classworlds.launcher.Launcher.launchStandard(Launcher.java:329)
	at org.codehaus.plexus.classworlds.launcher.Launcher.launch(Launcher.java:239)
	at org.jvnet.hudson.maven3.agent.Maven3Main.launch(Maven3Main.java:178)
	at sun.reflect.NativeMethodAccessorImpl.invoke0(Native Method)
	at sun.reflect.NativeMethodAccessorImpl.invoke(NativeMethodAccessorImpl.java:57)
	at sun.reflect.DelegatingMethodAccessorImpl.invoke(DelegatingMethodAccessorImpl.java:43)
	at java.lang.reflect.Method.invoke(Method.java:606)
	at hudson.maven.Maven3Builder.call(Maven3Builder.java:134)
	at hudson.maven.Maven3Builder.call(Maven3Builder.java:69)
	at hudson.remoting.UserRequest.perform(UserRequest.java:118)
	at hudson.remoting.UserRequest.perform(UserRequest.java:48)
	at hudson.remoting.Request$2.run(Request.java:328)
	at hudson.remoting.InterceptingExecutorService$1.call(InterceptingExecutorService.java:72)
	at java.util.concurrent.FutureTask.run(FutureTask.java:262)
	at java.util.concurrent.ThreadPoolExecutor.runWorker(ThreadPoolExecutor.java:1145)
	at java.util.concurrent.ThreadPoolExecutor$Worker.run(ThreadPoolExecutor.java:615)
	at java.lang.Thread.run(Thread.java:745)
Caused by: org.apache.maven.plugin.MojoExecutionException: failed to get report for org.apache.maven.plugins:maven-surefire-report-plugin
	at org.apache.maven.reporting.exec.DefaultMavenReportExecutor.buildMavenReports(DefaultMavenReportExecutor.java:156)
	at org.apache.maven.plugins.site.render.AbstractSiteRenderingMojo.getReports(AbstractSiteRenderingMojo.java:239)
	at org.apache.maven.plugins.site.render.SiteMojo.execute(SiteMojo.java:124)
	at org.apache.maven.plugin.DefaultBuildPluginManager.executeMojo(DefaultBuildPluginManager.java:101)
	at org.apache.maven.lifecycle.internal.MojoExecutor.execute(MojoExecutor.java:209)
	... 30 more
Caused by: org.apache.maven.lifecycle.LifecycleExecutionException: Failed to execute goal
org.apache.maven.plugins:maven-compiler-plugin:3.1:compile (default-compile) on project apache-rat-core:
Compilation failure
<https://builds.apache.org/job/Creadur-Rat-Site/ws/apache-rat-core/src/main/java/org/apache/rat/analysis/license/CDDL1License.java>:[59,5]
method does not override a method from its superclass

	at org.apache.maven.lifecycle.internal.MojoExecutor.execute(MojoExecutor.java:213)
	at org.apache.maven.lifecycle.internal.MojoExecutor.execute(MojoExecutor.java:153)
	at org.apache.maven.lifecycle.internal.MojoExecutor.execute(MojoExecutor.java:145)
	at org.apache.maven.lifecycle.internal.MojoExecutor.executeForkedExecutions(MojoExecutor.java:365)
	at org.apache.maven.lifecycle.DefaultLifecycleExecutor.executeForkedExecutions(DefaultLifecycleExecutor.java:173)
	at org.apache.maven.reporting.exec.DefaultMavenReportExecutor.buildReportPlugin(DefaultMavenReportExecutor.java:309)
	at org.apache.maven.reporting.exec.DefaultMavenReportExecutor.buildMavenReports(DefaultMavenReportExecutor.java:151)
	... 34 more
Caused by: org.apache.maven.plugin.compiler.CompilationFailureException: Compilation failure
<https://builds.apache.org/job/Creadur-Rat-Site/ws/apache-rat-core/src/main/java/org/apache/rat/analysis/license/CDDL1License.java>:[59,5]
method does not override a method from its superclass

	at org.apache.maven.plugin.compiler.AbstractCompilerMojo.execute(AbstractCompilerMojo.java:858)
	at org.apache.maven.plugin.compiler.CompilerMojo.execute(CompilerMojo.java:129)
	at org.apache.maven.plugin.DefaultBuildPluginManager.executeMojo(DefaultBuildPluginManager.java:101)
	at org.apache.maven.lifecycle.internal.MojoExecutor.execute(MojoExecutor.java:209)
	... 40 more
[ERROR] 
[ERROR] Re-run Maven using the -X switch to enable full debug logging.
[ERROR] 
[ERROR] For more information about the errors and possible solutions, please read the following
articles:
[ERROR] [Help 1] http://cwiki.apache.org/confluence/display/MAVEN/MojoExecutionException
[ERROR] 
[ERROR] After correcting the problems, you can resume the build with the command
[ERROR]   mvn <goals> -rf :apache-rat-core

[JENKINS] Archiving <https://builds.apache.org/job/Creadur-Rat-Site/ws/apache-rat-plugin/pom.xml>
to org.apache.rat/apache-rat-plugin/0.12-SNAPSHOT/apache-rat-plugin-0.12-SNAPSHOT.pom
Sending artifact delta relative to Creadur-Rat-Site » Apache Creadur Rat::Plugin4Maven #43
Archived 1 artifacts
Archive block size is 32768
Received 0 blocks and 8988 bytes
Compression is 0.0%
Took 47 ms
[JENKINS] Archiving <https://builds.apache.org/job/Creadur-Rat-Site/ws/apache-rat-tasks/pom.xml>
to org.apache.rat/apache-rat-tasks/0.12-SNAPSHOT/apache-rat-tasks-0.12-SNAPSHOT.pom
Sending artifact delta relative to Creadur-Rat-Site » Apache Creadur Rat::Tasks4Ant #43
Archived 1 artifacts
Archive block size is 32768
Received 0 blocks and 6322 bytes
Compression is 0.0%
Took 47 ms
[JENKINS] Archiving <https://builds.apache.org/job/Creadur-Rat-Site/ws/pom.xml> to org.apache.rat/apache-rat-project/0.12-SNAPSHOT/apache-rat-project-0.12-SNAPSHOT.pom
Sending artifact delta relative to Creadur-Rat-Site » Apache Creadur Rat #43
Archived 1 artifacts
Archive block size is 32768
Received 0 blocks and 21411 bytes
Compression is 0.0%
Took 47 ms
[JENKINS] Archiving <https://builds.apache.org/job/Creadur-Rat-Site/ws/apache-rat/pom.xml>
to org.apache.rat/apache-rat/0.12-SNAPSHOT/apache-rat-0.12-SNAPSHOT.pom
Sending artifact delta relative to Creadur-Rat-Site » Apache Creadur Rat::Command Line #43
Archived 1 artifacts
Archive block size is 32768
Received 0 blocks and 7053 bytes
Compression is 0.0%
Took 45 ms
[JENKINS] Archiving <https://builds.apache.org/job/Creadur-Rat-Site/ws/apache-rat-core/pom.xml>
to org.apache.rat/apache-rat-core/0.12-SNAPSHOT/apache-rat-core-0.12-SNAPSHOT.pom
Sending artifact delta relative to Creadur-Rat-Site » Apache Creadur Rat::Core #43
Archived 1 artifacts
Archive block size is 32768
Received 0 blocks and 4202 bytes
Compression is 0.0%
Took 45 ms
channel stopped

Mime
View raw message