creadur-dev mailing list archives

Site index · List index
Message view « Date » · « Thread »
Top « Date » · « Thread »
From Apache Jenkins Server <jenk...@builds.apache.org>
Subject Build failed in Jenkins: Creadur-Rat-Site #21
Date Mon, 01 Sep 2014 09:08:37 GMT
See <https://builds.apache.org/job/Creadur-Rat-Site/21/changes>

Changes:

[pottlinger] RAT-172: Filter source code management system directories and ignore files

* Extracted information about revision control systems into an enum SourceCodeManagementSystems
with tests.
* Use these SCM information when generating RAT plugin's default excludes.
* Refactored Exclusions to be Sets instead of Lists to prevent a slow RAT run on many duplicate
exclusions.
* Introduced mockito and unit tests. 
* ExclusionHelperTest verifies that behaviour; AbstractRatMojo is cleaner now to only encapsulate
mvn related stuff.

------------------------------------------
[...truncated 1224 lines...]
Generating <https://builds.apache.org/job/Creadur-Rat-Site/ws/apache-rat-core/target/site/apidocs/org/apache/rat/analysis/license/class-use/GPL3License.html...>
Generating <https://builds.apache.org/job/Creadur-Rat-Site/ws/apache-rat-core/target/site/apidocs/org/apache/rat/analysis/license/class-use/ApacheSoftwareLicense20.html...>
Generating <https://builds.apache.org/job/Creadur-Rat-Site/ws/apache-rat-core/target/site/apidocs/org/apache/rat/analysis/license/class-use/W3CDocLicense.html...>
Generating <https://builds.apache.org/job/Creadur-Rat-Site/ws/apache-rat-core/target/site/apidocs/org/apache/rat/analysis/license/class-use/CopyrightHeader.html...>
Generating <https://builds.apache.org/job/Creadur-Rat-Site/ws/apache-rat-core/target/site/apidocs/org/apache/rat/analysis/license/class-use/TMF854LicenseHeader.html...>
Generating <https://builds.apache.org/job/Creadur-Rat-Site/ws/apache-rat-core/target/site/apidocs/org/apache/rat/analysis/generation/class-use/JavaDocLicenseNotRequired.html...>
Generating <https://builds.apache.org/job/Creadur-Rat-Site/ws/apache-rat-core/target/site/apidocs/org/apache/rat/analysis/generation/class-use/GeneratedLicenseNotRequired.html...>
Generating <https://builds.apache.org/job/Creadur-Rat-Site/ws/apache-rat-core/target/site/apidocs/org/apache/rat/report/class-use/AbstractReport.html...>
Generating <https://builds.apache.org/job/Creadur-Rat-Site/ws/apache-rat-core/target/site/apidocs/org/apache/rat/report/class-use/IReportable.html...>
Generating <https://builds.apache.org/job/Creadur-Rat-Site/ws/apache-rat-core/target/site/apidocs/org/apache/rat/report/class-use/RatReport.html...>
Generating <https://builds.apache.org/job/Creadur-Rat-Site/ws/apache-rat-core/target/site/apidocs/org/apache/rat/report/claim/impl/class-use/ClaimAggregator.html...>
Generating <https://builds.apache.org/job/Creadur-Rat-Site/ws/apache-rat-core/target/site/apidocs/org/apache/rat/report/claim/impl/class-use/AbstractClaimReporter.html...>
Generating <https://builds.apache.org/job/Creadur-Rat-Site/ws/apache-rat-core/target/site/apidocs/org/apache/rat/report/claim/impl/xml/class-use/SimpleXmlClaimReporter.html...>
Generating <https://builds.apache.org/job/Creadur-Rat-Site/ws/apache-rat-core/target/site/apidocs/org/apache/rat/report/claim/util/class-use/LicenseAddingReport.html...>
Generating <https://builds.apache.org/job/Creadur-Rat-Site/ws/apache-rat-core/target/site/apidocs/org/apache/rat/report/claim/util/class-use/ClaimReporterMultiplexer.html...>
Generating <https://builds.apache.org/job/Creadur-Rat-Site/ws/apache-rat-core/target/site/apidocs/org/apache/rat/report/claim/class-use/ClaimStatistic.html...>
Generating <https://builds.apache.org/job/Creadur-Rat-Site/ws/apache-rat-core/target/site/apidocs/org/apache/rat/report/xml/class-use/XmlReportFactory.html...>
Generating <https://builds.apache.org/job/Creadur-Rat-Site/ws/apache-rat-core/target/site/apidocs/org/apache/rat/report/xml/writer/impl/base/class-use/XmlWriter.html...>
Generating <https://builds.apache.org/job/Creadur-Rat-Site/ws/apache-rat-core/target/site/apidocs/org/apache/rat/report/xml/writer/class-use/OperationNotAllowedException.html...>
Generating <https://builds.apache.org/job/Creadur-Rat-Site/ws/apache-rat-core/target/site/apidocs/org/apache/rat/report/xml/writer/class-use/IXmlWriter.html...>
Generating <https://builds.apache.org/job/Creadur-Rat-Site/ws/apache-rat-core/target/site/apidocs/org/apache/rat/report/xml/writer/class-use/InvalidXmlException.html...>
Generating <https://builds.apache.org/job/Creadur-Rat-Site/ws/apache-rat-core/target/site/apidocs/org/apache/rat/report/xml/writer/class-use/XmlWriterUtils.html...>
Generating <https://builds.apache.org/job/Creadur-Rat-Site/ws/apache-rat-core/target/site/apidocs/org/apache/rat/license/class-use/CDDL1LicenseFamily.html...>
Generating <https://builds.apache.org/job/Creadur-Rat-Site/ws/apache-rat-core/target/site/apidocs/org/apache/rat/license/class-use/GPL1LicenseFamily.html...>
Generating <https://builds.apache.org/job/Creadur-Rat-Site/ws/apache-rat-core/target/site/apidocs/org/apache/rat/license/class-use/SimpleLicenseFamily.html...>
Generating <https://builds.apache.org/job/Creadur-Rat-Site/ws/apache-rat-core/target/site/apidocs/org/apache/rat/license/class-use/Apache20LicenseFamily.html...>
Generating <https://builds.apache.org/job/Creadur-Rat-Site/ws/apache-rat-core/target/site/apidocs/org/apache/rat/license/class-use/OASISLicenseFamily.html...>
Generating <https://builds.apache.org/job/Creadur-Rat-Site/ws/apache-rat-core/target/site/apidocs/org/apache/rat/license/class-use/GPL2LicenseFamily.html...>
Generating <https://builds.apache.org/job/Creadur-Rat-Site/ws/apache-rat-core/target/site/apidocs/org/apache/rat/license/class-use/AcademicFree21LicenseFamily.html...>
Generating <https://builds.apache.org/job/Creadur-Rat-Site/ws/apache-rat-core/target/site/apidocs/org/apache/rat/license/class-use/MITLicenseFamily.html...>
Generating <https://builds.apache.org/job/Creadur-Rat-Site/ws/apache-rat-core/target/site/apidocs/org/apache/rat/license/class-use/GPL3LicenseFamily.html...>
Generating <https://builds.apache.org/job/Creadur-Rat-Site/ws/apache-rat-core/target/site/apidocs/org/apache/rat/license/class-use/W3CDocumentLicenseFamily.html...>
Generating <https://builds.apache.org/job/Creadur-Rat-Site/ws/apache-rat-core/target/site/apidocs/org/apache/rat/license/class-use/ModifiedBSDLicenseFamily.html...>
Generating <https://builds.apache.org/job/Creadur-Rat-Site/ws/apache-rat-core/target/site/apidocs/org/apache/rat/license/class-use/W3CSoftwareLicenseFamily.html...>
Generating <https://builds.apache.org/job/Creadur-Rat-Site/ws/apache-rat-core/target/site/apidocs/org/apache/rat/license/class-use/ILicenseFamily.html...>
Generating <https://builds.apache.org/job/Creadur-Rat-Site/ws/apache-rat-core/target/site/apidocs/org/apache/rat/config/class-use/SourceCodeManagementSystems.html...>
Generating <https://builds.apache.org/job/Creadur-Rat-Site/ws/apache-rat-core/target/site/apidocs/org/apache/rat/policy/class-use/DefaultPolicy.html...>
Generating <https://builds.apache.org/job/Creadur-Rat-Site/ws/apache-rat-core/target/site/apidocs/org/apache/rat/annotation/class-use/AbstractLicenceAppender.html...>
Generating <https://builds.apache.org/job/Creadur-Rat-Site/ws/apache-rat-core/target/site/apidocs/org/apache/rat/annotation/class-use/ApacheV2LicenceAppender.html...>
Generating <https://builds.apache.org/job/Creadur-Rat-Site/ws/apache-rat-core/target/site/apidocs/org/apache/rat/document/impl/guesser/class-use/BinaryGuesser.html...>
Generating <https://builds.apache.org/job/Creadur-Rat-Site/ws/apache-rat-core/target/site/apidocs/org/apache/rat/document/impl/guesser/class-use/NoteGuesser.html...>
Generating <https://builds.apache.org/job/Creadur-Rat-Site/ws/apache-rat-core/target/site/apidocs/org/apache/rat/document/impl/guesser/class-use/ArchiveGuesser.html...>
Generating <https://builds.apache.org/job/Creadur-Rat-Site/ws/apache-rat-core/target/site/apidocs/org/apache/rat/document/impl/guesser/class-use/GuessUtils.html...>
Generating <https://builds.apache.org/job/Creadur-Rat-Site/ws/apache-rat-core/target/site/apidocs/org/apache/rat/document/impl/class-use/AbstractMonolithicDocument.html...>
Generating <https://builds.apache.org/job/Creadur-Rat-Site/ws/apache-rat-core/target/site/apidocs/org/apache/rat/document/impl/class-use/MonolithicFileDocument.html...>
Generating <https://builds.apache.org/job/Creadur-Rat-Site/ws/apache-rat-core/target/site/apidocs/org/apache/rat/document/impl/class-use/ArchiveEntryDocument.html...>
Generating <https://builds.apache.org/job/Creadur-Rat-Site/ws/apache-rat-core/target/site/apidocs/org/apache/rat/document/impl/class-use/DocumentImplUtils.html...>
Generating <https://builds.apache.org/job/Creadur-Rat-Site/ws/apache-rat-core/target/site/apidocs/org/apache/rat/document/impl/class-use/FileDocument.html...>
Generating <https://builds.apache.org/job/Creadur-Rat-Site/ws/apache-rat-core/target/site/apidocs/org/apache/rat/document/impl/util/class-use/DocumentAnalyserMultiplexer.html...>
Generating <https://builds.apache.org/job/Creadur-Rat-Site/ws/apache-rat-core/target/site/apidocs/org/apache/rat/document/class-use/CompositeDocumentException.html...>
Generating <https://builds.apache.org/job/Creadur-Rat-Site/ws/apache-rat-core/target/site/apidocs/org/apache/rat/document/class-use/IDocumentAnalyser.html...>
Generating <https://builds.apache.org/job/Creadur-Rat-Site/ws/apache-rat-core/target/site/apidocs/org/apache/rat/document/class-use/RatDocumentAnalysisException.html...>
Generating <https://builds.apache.org/job/Creadur-Rat-Site/ws/apache-rat-core/target/site/apidocs/org/apache/rat/document/class-use/ToNameTransformer.html...>
Generating <https://builds.apache.org/job/Creadur-Rat-Site/ws/apache-rat-core/target/site/apidocs/org/apache/rat/document/class-use/UnsuitableDocumentException.html...>
Generating <https://builds.apache.org/job/Creadur-Rat-Site/ws/apache-rat-core/target/site/apidocs/org/apache/rat/package-use.html...>
Generating <https://builds.apache.org/job/Creadur-Rat-Site/ws/apache-rat-core/target/site/apidocs/org/apache/rat/analysis/package-use.html...>
Generating <https://builds.apache.org/job/Creadur-Rat-Site/ws/apache-rat-core/target/site/apidocs/org/apache/rat/analysis/generation/package-use.html...>
Generating <https://builds.apache.org/job/Creadur-Rat-Site/ws/apache-rat-core/target/site/apidocs/org/apache/rat/analysis/license/package-use.html...>
Generating <https://builds.apache.org/job/Creadur-Rat-Site/ws/apache-rat-core/target/site/apidocs/org/apache/rat/analysis/util/package-use.html...>
Generating <https://builds.apache.org/job/Creadur-Rat-Site/ws/apache-rat-core/target/site/apidocs/org/apache/rat/annotation/package-use.html...>
Generating <https://builds.apache.org/job/Creadur-Rat-Site/ws/apache-rat-core/target/site/apidocs/org/apache/rat/api/package-use.html...>
Generating <https://builds.apache.org/job/Creadur-Rat-Site/ws/apache-rat-core/target/site/apidocs/org/apache/rat/config/package-use.html...>
Generating <https://builds.apache.org/job/Creadur-Rat-Site/ws/apache-rat-core/target/site/apidocs/org/apache/rat/document/package-use.html...>
Generating <https://builds.apache.org/job/Creadur-Rat-Site/ws/apache-rat-core/target/site/apidocs/org/apache/rat/document/impl/package-use.html...>
Generating <https://builds.apache.org/job/Creadur-Rat-Site/ws/apache-rat-core/target/site/apidocs/org/apache/rat/document/impl/guesser/package-use.html...>
Generating <https://builds.apache.org/job/Creadur-Rat-Site/ws/apache-rat-core/target/site/apidocs/org/apache/rat/document/impl/util/package-use.html...>
Generating <https://builds.apache.org/job/Creadur-Rat-Site/ws/apache-rat-core/target/site/apidocs/org/apache/rat/header/package-use.html...>
Generating <https://builds.apache.org/job/Creadur-Rat-Site/ws/apache-rat-core/target/site/apidocs/org/apache/rat/license/package-use.html...>
Generating <https://builds.apache.org/job/Creadur-Rat-Site/ws/apache-rat-core/target/site/apidocs/org/apache/rat/policy/package-use.html...>
Generating <https://builds.apache.org/job/Creadur-Rat-Site/ws/apache-rat-core/target/site/apidocs/org/apache/rat/report/package-use.html...>
Generating <https://builds.apache.org/job/Creadur-Rat-Site/ws/apache-rat-core/target/site/apidocs/org/apache/rat/report/claim/package-use.html...>
Generating <https://builds.apache.org/job/Creadur-Rat-Site/ws/apache-rat-core/target/site/apidocs/org/apache/rat/report/claim/impl/package-use.html...>
Generating <https://builds.apache.org/job/Creadur-Rat-Site/ws/apache-rat-core/target/site/apidocs/org/apache/rat/report/claim/impl/xml/package-use.html...>
Generating <https://builds.apache.org/job/Creadur-Rat-Site/ws/apache-rat-core/target/site/apidocs/org/apache/rat/report/claim/util/package-use.html...>
Generating <https://builds.apache.org/job/Creadur-Rat-Site/ws/apache-rat-core/target/site/apidocs/org/apache/rat/report/xml/package-use.html...>
Generating <https://builds.apache.org/job/Creadur-Rat-Site/ws/apache-rat-core/target/site/apidocs/org/apache/rat/report/xml/writer/package-use.html...>
Generating <https://builds.apache.org/job/Creadur-Rat-Site/ws/apache-rat-core/target/site/apidocs/org/apache/rat/report/xml/writer/impl/base/package-use.html...>
Generating <https://builds.apache.org/job/Creadur-Rat-Site/ws/apache-rat-core/target/site/apidocs/org/apache/rat/walker/package-use.html...>
Building index for all the packages and classes...
Generating <https://builds.apache.org/job/Creadur-Rat-Site/ws/apache-rat-core/target/site/apidocs/overview-tree.html...>
Generating <https://builds.apache.org/job/Creadur-Rat-Site/ws/apache-rat-core/target/site/apidocs/index-all.html...>
Generating <https://builds.apache.org/job/Creadur-Rat-Site/ws/apache-rat-core/target/site/apidocs/deprecated-list.html...>
Building index for all classes...
Generating <https://builds.apache.org/job/Creadur-Rat-Site/ws/apache-rat-core/target/site/apidocs/allclasses-frame.html...>
Generating <https://builds.apache.org/job/Creadur-Rat-Site/ws/apache-rat-core/target/site/apidocs/allclasses-noframe.html...>
Generating <https://builds.apache.org/job/Creadur-Rat-Site/ws/apache-rat-core/target/site/apidocs/index.html...>
Generating <https://builds.apache.org/job/Creadur-Rat-Site/ws/apache-rat-core/target/site/apidocs/overview-summary.html...>
Generating <https://builds.apache.org/job/Creadur-Rat-Site/ws/apache-rat-core/target/site/apidocs/help-doc.html...>
Note: Custom tags that could override future standard tags:  @requiresDependencyResolution,
@requiresReports, @execute, @configurator, @aggregator, @threadSafe, @instantiationStrategy,
@executionStrategy, @goal, @requiresOnline, @parameter, @requiresDirectInvocation, @inheritByDefault,
@component, @requiresProject, @required, @readonly, @phase, @requiresDependencyCollection.
To avoid potential overrides, use at least one period character (.) in custom tag names.
[JENKINS] Archiving  javadoc
[INFO] Generating "Test Source Xref" report.
[INFO] Generating "Source Xref" report.
[INFO] Generating "PMD" report.
[INFO] Generating "CPD" report.
[INFO] Generating "Source Repository" report.
[INFO] Generating "Mailing Lists" report.
[INFO] Generating "Issue Tracking" report.
[INFO] Generating "Continuous Integration" report.
[INFO] Generating "Project License" report.
[INFO] Generating "Project Team" report.
[INFO] Generating "Dependencies" report.
[JENKINS] Archiving site from <https://builds.apache.org/job/Creadur-Rat-Site/ws/apache-rat-core/target/site>
to /x1/jenkins/jenkins-home/jobs/Creadur-Rat-Site/site/apache-rat-core
[INFO] ------------------------------------------------------------------------
[INFO] Building Apache Creadur Rat::Plugin4Maven
[INFO]    task-segment: [clean, site]
[INFO] ------------------------------------------------------------------------
[INFO] [clean:clean {execution: default-clean}]
[INFO] Deleting <https://builds.apache.org/job/Creadur-Rat-Site/ws/apache-rat-plugin/target>
[INFO] [antrun:run {execution: copy-site-resources}]
[INFO] Executing tasks

main:
     [copy] Warning: Could not find file <https://builds.apache.org/job/Creadur-Rat-Site/ws/apache-rat-plugin/RELEASE_NOTES.txt>
to copy.
[INFO] Executed tasks
[INFO] Preparing surefire-report:report
[INFO] [enforcer:enforce {execution: enforce-bytecode-version}]
Downloading: http://repository.apache.org/snapshots/org/apache/rat/apache-rat-core/0.12-SNAPSHOT/apache-rat-core-0.12-20140821.235028-17.pom
4K downloaded  (apache-rat-core-0.12-20140821.235028-17.pom)
[INFO] [plugin:helpmojo {execution: help-goal}]
[INFO] Using 'UTF-8' encoding to read mojo metadata.
[INFO] Applying mojo extractor for language: java-annotations
[INFO] Mojo extractor for language: java-annotations found 0 mojo descriptors.
[INFO] Applying mojo extractor for language: java
[INFO] Mojo extractor for language: java found 0 mojo descriptors.
[INFO] Applying mojo extractor for language: bsh
[INFO] Mojo extractor for language: bsh found 0 mojo descriptors.
[INFO] [plugin:descriptor {execution: default-descriptor}]
[INFO] Using 'UTF-8' encoding to read mojo metadata.
[INFO] Applying mojo extractor for language: java-annotations
[INFO] Mojo extractor for language: java-annotations found 0 mojo descriptors.
[INFO] Applying mojo extractor for language: java
[INFO] Mojo extractor for language: java found 0 mojo descriptors.
[INFO] Applying mojo extractor for language: bsh
[INFO] Mojo extractor for language: bsh found 0 mojo descriptors.
[INFO] [remote-resources:process {execution: default}]
[INFO] [resources:resources {execution: default-resources}]
[INFO] Using 'UTF-8' encoding to copy filtered resources.
[INFO] Copying 1 resource
[INFO] Copying 1 resource
[INFO] Copying 1 resource to META-INF
[INFO] Copying 3 resources
[INFO] [compiler:compile {execution: default-compile}]
[INFO] Changes detected - recompiling the module!
[INFO] Compiling 9 source files to <https://builds.apache.org/job/Creadur-Rat-Site/ws/apache-rat-plugin/target/classes>
[INFO] -------------------------------------------------------------
[ERROR] COMPILATION ERROR : 
[INFO] -------------------------------------------------------------
[ERROR] <https://builds.apache.org/job/Creadur-Rat-Site/ws/apache-rat-plugin/src/main/java/org/apache/rat/mp/ExclusionHelper.java>:[9,29]
package org.apache.rat.config does not exist
[ERROR] <https://builds.apache.org/job/Creadur-Rat-Site/ws/apache-rat-plugin/src/main/java/org/apache/rat/mp/AbstractRatMojo.java>:[52,29]
package org.apache.rat.config does not exist
[ERROR] <https://builds.apache.org/job/Creadur-Rat-Site/ws/apache-rat-plugin/src/main/java/org/apache/rat/mp/ExclusionHelper.java>:[70,40]
cannot find symbol
symbol  : variable SourceCodeManagementSystems
location: class org.apache.rat.mp.ExclusionHelper
[INFO] 3 errors 
[INFO] -------------------------------------------------------------
ERROR: Could not find local repository for 2.2.1
[INFO] ------------------------------------------------------------------------
[ERROR] BUILD FAILURE
[INFO] ------------------------------------------------------------------------
[INFO] Compilation failure

<https://builds.apache.org/job/Creadur-Rat-Site/ws/apache-rat-plugin/src/main/java/org/apache/rat/mp/ExclusionHelper.java>:[9,29]
package org.apache.rat.config does not exist
<https://builds.apache.org/job/Creadur-Rat-Site/ws/apache-rat-plugin/src/main/java/org/apache/rat/mp/AbstractRatMojo.java>:[52,29]
package org.apache.rat.config does not exist
<https://builds.apache.org/job/Creadur-Rat-Site/ws/apache-rat-plugin/src/main/java/org/apache/rat/mp/ExclusionHelper.java>:[70,40]
cannot find symbol
symbol  : variable SourceCodeManagementSystems
location: class org.apache.rat.mp.ExclusionHelper

[INFO] ------------------------------------------------------------------------
[INFO] Trace
org.apache.maven.BuildFailureException: Compilation failure
	at org.apache.maven.lifecycle.DefaultLifecycleExecutor.executeGoals(DefaultLifecycleExecutor.java:715)
	at org.apache.maven.lifecycle.DefaultLifecycleExecutor.executeGoalWithLifecycle(DefaultLifecycleExecutor.java:556)
	at org.apache.maven.lifecycle.DefaultLifecycleExecutor.forkProjectLifecycle(DefaultLifecycleExecutor.java:1205)
	at org.apache.maven.lifecycle.DefaultLifecycleExecutor.forkLifecycle(DefaultLifecycleExecutor.java:1038)
	at org.apache.maven.lifecycle.DefaultLifecycleExecutor.executeGoals(DefaultLifecycleExecutor.java:663)
	at org.apache.maven.lifecycle.DefaultLifecycleExecutor.executeGoalWithLifecycle(DefaultLifecycleExecutor.java:556)
	at org.apache.maven.lifecycle.DefaultLifecycleExecutor.executeGoal(DefaultLifecycleExecutor.java:535)
	at org.apache.maven.lifecycle.DefaultLifecycleExecutor.executeGoalAndHandleFailures(DefaultLifecycleExecutor.java:387)
	at org.apache.maven.lifecycle.DefaultLifecycleExecutor.executeTaskSegments(DefaultLifecycleExecutor.java:348)
	at org.apache.maven.lifecycle.DefaultLifecycleExecutor.execute(DefaultLifecycleExecutor.java:180)
	at org.apache.maven.lifecycle.LifecycleExecutorInterceptor.execute(LifecycleExecutorInterceptor.java:65)
	at org.apache.maven.DefaultMaven.doExecute(DefaultMaven.java:328)
	at org.apache.maven.DefaultMaven.execute(DefaultMaven.java:138)
	at org.apache.maven.cli.MavenCli.main(MavenCli.java:362)
	at sun.reflect.NativeMethodAccessorImpl.invoke0(Native Method)
	at sun.reflect.NativeMethodAccessorImpl.invoke(NativeMethodAccessorImpl.java:57)
	at sun.reflect.DelegatingMethodAccessorImpl.invoke(DelegatingMethodAccessorImpl.java:43)
	at java.lang.reflect.Method.invoke(Method.java:606)
	at org.codehaus.classworlds.Launcher.launchEnhanced(Launcher.java:315)
	at org.codehaus.classworlds.Launcher.launch(Launcher.java:255)
	at hudson.maven.agent.Main.launch(Main.java:205)
	at hudson.maven.MavenBuilder.call(MavenBuilder.java:154)
	at hudson.maven.Maven2Builder.call(Maven2Builder.java:79)
	at hudson.maven.Maven2Builder.call(Maven2Builder.java:55)
	at hudson.remoting.UserRequest.perform(UserRequest.java:118)
	at hudson.remoting.UserRequest.perform(UserRequest.java:48)
	at hudson.remoting.Request$2.run(Request.java:328)
	at hudson.remoting.InterceptingExecutorService$1.call(InterceptingExecutorService.java:72)
	at java.util.concurrent.FutureTask.run(FutureTask.java:262)
	at java.util.concurrent.ThreadPoolExecutor.runWorker(ThreadPoolExecutor.java:1145)
	at java.util.concurrent.ThreadPoolExecutor$Worker.run(ThreadPoolExecutor.java:615)
	at java.lang.Thread.run(Thread.java:745)
Caused by: org.apache.maven.plugin.compiler.CompilationFailureException: Compilation failure
	at org.apache.maven.plugin.compiler.AbstractCompilerMojo.execute(AbstractCompilerMojo.java:858)
	at org.apache.maven.plugin.compiler.CompilerMojo.execute(CompilerMojo.java:129)
	at org.apache.maven.plugin.DefaultPluginManager.executeMojo(DefaultPluginManager.java:490)
	at hudson.maven.agent.PluginManagerInterceptor.executeMojo(PluginManagerInterceptor.java:182)
	at org.apache.maven.lifecycle.DefaultLifecycleExecutor.executeGoals(DefaultLifecycleExecutor.java:694)
	... 31 more
[INFO] ------------------------------------------------------------------------
[INFO] Total time: 2 minutes 29 seconds
[INFO] Finished at: Mon Sep 01 09:09:32 UTC 2014
[INFO] Final Memory: 187M/2506M
[INFO] ------------------------------------------------------------------------
[JENKINS] Archiving <https://builds.apache.org/job/Creadur-Rat-Site/ws/apache-rat-plugin/pom.xml>
to org.apache.rat/apache-rat-plugin/0.12-SNAPSHOT/apache-rat-plugin-0.12-SNAPSHOT.pom
Sending artifact delta relative to Creadur-Rat-Site ? Apache Creadur Rat::Plugin4Maven #20
Archived 1 artifacts
Archive block size is 32768
Received 0 blocks and 9342 bytes
Compression is 0.0%
Took 0.14 sec
[JENKINS] Archiving <https://builds.apache.org/job/Creadur-Rat-Site/ws/apache-rat-tasks/pom.xml>
to org.apache.rat/apache-rat-tasks/0.12-SNAPSHOT/apache-rat-tasks-0.12-SNAPSHOT.pom
Sending artifact delta relative to Creadur-Rat-Site ? Apache Creadur Rat::Tasks4Ant #20
Archived 1 artifacts
Archive block size is 32768
Received 0 blocks and 6674 bytes
Compression is 0.0%
Took 0.1 sec
[JENKINS] Archiving <https://builds.apache.org/job/Creadur-Rat-Site/ws/pom.xml> to org.apache.rat/apache-rat-project/0.12-SNAPSHOT/apache-rat-project-0.12-SNAPSHOT.pom
Sending artifact delta relative to Creadur-Rat-Site ? Apache Creadur Rat #20
Archived 1 artifacts
Archive block size is 32768
Received 0 blocks and 20380 bytes
Compression is 0.0%
Took 0.11 sec
[JENKINS] Archiving <https://builds.apache.org/job/Creadur-Rat-Site/ws/apache-rat/pom.xml>
to org.apache.rat/apache-rat/0.12-SNAPSHOT/apache-rat-0.12-SNAPSHOT.pom
Sending artifact delta relative to Creadur-Rat-Site ? Apache Creadur Rat::Command Line #20
Archived 1 artifacts
Archive block size is 32768
Received 0 blocks and 7384 bytes
Compression is 0.0%
Took 2.1 sec
[JENKINS] Archiving <https://builds.apache.org/job/Creadur-Rat-Site/ws/apache-rat-core/pom.xml>
to org.apache.rat/apache-rat-core/0.12-SNAPSHOT/apache-rat-core-0.12-SNAPSHOT.pom
Sending artifact delta relative to Creadur-Rat-Site ? Apache Creadur Rat::Core #20
Archived 1 artifacts
Archive block size is 32768
Received 0 blocks and 4321 bytes
Compression is 0.0%
Took 0.13 sec
channel stopped

Mime
View raw message