creadur-dev mailing list archives

Site index · List index
Message view « Date » · « Thread »
Top « Date » · « Thread »
From Apache Jenkins Server <jenk...@builds.apache.org>
Subject Build failed in Jenkins: Creadur-Rat-ParentPom #17
Date Tue, 16 Sep 2014 22:31:55 GMT
See <https://builds.apache.org/job/Creadur-Rat-ParentPom/17/changes>

Changes:

[sebb] RAT-177 - final arrays should be private

------------------------------------------
[...truncated 289 lines...]
A         apache-rat-core/src/test/java/org/apache/rat/report/xml/writer/impl
A         apache-rat-core/src/test/java/org/apache/rat/report/xml/writer/impl/base
AU        apache-rat-core/src/test/java/org/apache/rat/report/xml/writer/impl/base/XmlWriterTest.java
AU        apache-rat-core/src/test/java/org/apache/rat/report/xml/XmlUtils.java
A         apache-rat-core/src/test/java/org/apache/rat/report/claim
A         apache-rat-core/src/test/java/org/apache/rat/report/claim/util
A         apache-rat-core/src/test/java/org/apache/rat/report/claim/impl
A         apache-rat-core/src/test/java/org/apache/rat/report/claim/impl/xml
AU        apache-rat-core/src/test/java/org/apache/rat/report/claim/impl/xml/MockClaimReporter.java
AU        apache-rat-core/src/test/java/org/apache/rat/ReportTransformerTest.java
A         apache-rat-core/src/test/java/org/apache/rat/document
A         apache-rat-core/src/test/java/org/apache/rat/document/impl
A         apache-rat-core/src/test/java/org/apache/rat/document/impl/guesser
AU        apache-rat-core/src/test/java/org/apache/rat/document/impl/guesser/ArchiveGuesserTest.java
AU        apache-rat-core/src/test/java/org/apache/rat/document/impl/guesser/BinaryGuesserTest.java
AU        apache-rat-core/src/test/java/org/apache/rat/document/impl/guesser/NoteGuesserTest.java
AU        apache-rat-core/src/test/java/org/apache/rat/document/impl/guesser/GuessUtilsTest.java
A         apache-rat-core/src/test/java/org/apache/rat/document/impl/util
AU        apache-rat-core/src/test/java/org/apache/rat/document/impl/util/DocumentAnalyserMultiplexerTest.java
AU        apache-rat-core/src/test/java/org/apache/rat/document/impl/SingularFileDocumentTest.java
AU        apache-rat-core/src/test/java/org/apache/rat/document/MockLocation.java
AU        apache-rat-core/src/test/java/org/apache/rat/document/ToNameTransformerTest.java
AU        apache-rat-core/src/test/java/org/apache/rat/document/MockDocumentAnalyser.java
AU        apache-rat-core/src/test/java/org/apache/rat/document/MockDocument.java
A         apache-rat-core/src/test/java/org/apache/rat/policy
AU        apache-rat-core/src/test/java/org/apache/rat/policy/DefaultPolicyTest.java
A         apache-rat-core/src/test/java/org/apache/rat/test
A         apache-rat-core/src/test/java/org/apache/rat/test/utils
AU        apache-rat-core/src/test/java/org/apache/rat/test/utils/Resources.java
A         apache-rat-core/src/test/java/org/apache/rat/analysis
AU        apache-rat-core/src/test/java/org/apache/rat/analysis/HeaderCheckWorkerTest.java
AU        apache-rat-core/src/test/java/org/apache/rat/analysis/MockLicenseMatcher.java
A         apache-rat-core/src/test/java/org/apache/rat/analysis/license
AU        apache-rat-core/src/test/java/org/apache/rat/analysis/license/DirectoryScanner.java
AU        apache-rat-core/src/test/java/org/apache/rat/analysis/license/W3CLicenseTest.java
AU        apache-rat-core/src/test/java/org/apache/rat/analysis/license/AppliedApacheSoftwareLicense20Test.java
AU        apache-rat-core/src/test/java/org/apache/rat/analysis/license/ApacheSoftwareLicense20Test.java
AU        apache-rat-core/src/test/java/org/apache/rat/analysis/license/CopyrightHeaderTest.java
AU        apache-rat-core/src/test/java/org/apache/rat/analysis/license/OASISLicenseTest.java
AU        apache-rat-core/src/test/java/org/apache/rat/analysis/license/CDDL1LicenseTest.java
AU        apache-rat-core/src/test/java/org/apache/rat/analysis/license/GPL123LicenseTest.java
AU        apache-rat-core/src/test/java/org/apache/rat/analysis/license/MITLicenseTest.java
AU        apache-rat-core/src/test/java/org/apache/rat/analysis/license/MockStandardLicense.java
AU        apache-rat-core/src/test/java/org/apache/rat/analysis/AnalyserFactoryTest.java
A         apache-rat-core/src/test/java/org/apache/rat/analysis/generation
AU        apache-rat-core/src/test/java/org/apache/rat/analysis/generation/GeneratedLicenseNotRequiredTest.java
AU        apache-rat-core/src/test/java/org/apache/rat/analysis/generation/JavaDocLicenseNotRequiredTest.java
A         apache-rat-core/src/test/java/org/apache/rat/analysis/util
AU        apache-rat-core/src/test/java/org/apache/rat/analysis/util/MatcherMultiplexerTest.java
A         apache-rat-core/src/test/java/org/apache/rat/config
A         apache-rat-core/src/test/java/org/apache/rat/config/SourceCodeManagementSystemsTest.java
A         apache-rat-core/src/test/java/org/apache/rat/walker
AU        apache-rat-core/src/test/java/org/apache/rat/walker/FileNameComparatorTest.java
AU        apache-rat-core/pom.xml
AU        BUILD.txt
AU        ant-task-examples.xml
AU        NOTICE
A         apache-rat-plugin
A         apache-rat-plugin/src
A         apache-rat-plugin/src/changes
AU        apache-rat-plugin/src/changes/changes.xml
A         apache-rat-plugin/src/it
A         apache-rat-plugin/src/it/it4_RAT-168
A         apache-rat-plugin/src/it/it4_RAT-168/invoker.properties
A         apache-rat-plugin/src/it/it4_RAT-168/verify.groovy
A         apache-rat-plugin/src/it/it4_RAT-168/pom.xml
A         apache-rat-plugin/src/it/it1
AU        apache-rat-plugin/src/it/it1/invoker.properties
A         apache-rat-plugin/src/it/it1/verify.groovy
AU        apache-rat-plugin/src/it/it1/pom.xml
AU        apache-rat-plugin/src/it/it1/src.apt
AU        apache-rat-plugin/src/it/settings.xml
A         apache-rat-plugin/src/test
A         apache-rat-plugin/src/test/java
A         apache-rat-plugin/src/test/java/org
A         apache-rat-plugin/src/test/java/org/apache
A         apache-rat-plugin/src/test/java/org/apache/rat
A         apache-rat-plugin/src/test/java/org/apache/rat/mp
A         apache-rat-plugin/src/test/java/org/apache/rat/mp/ExclusionHelperTest.java
AU        apache-rat-plugin/src/test/java/org/apache/rat/mp/RatCheckMojoTest.java
A         apache-rat-plugin/src/test/java/org/apache/rat/mp/RatTestHelpers.java
A         apache-rat-plugin/src/test/resources
A         apache-rat-plugin/src/test/resources/unit
A         apache-rat-plugin/src/test/resources/unit/it1
AU        apache-rat-plugin/src/test/resources/unit/it1/pom.xml
A         apache-rat-plugin/src/test/resources/unit/it2
AU        apache-rat-plugin/src/test/resources/unit/it2/src.txt
AU        apache-rat-plugin/src/test/resources/unit/it2/pom.xml
A         apache-rat-plugin/src/test/resources/unit/it3
AU        apache-rat-plugin/src/test/resources/unit/it3/pom.xml
AU        apache-rat-plugin/src/test/resources/unit/it3/src.apt
A         apache-rat-plugin/src/main
A         apache-rat-plugin/src/main/java
A         apache-rat-plugin/src/main/java/org
A         apache-rat-plugin/src/main/java/org/apache
A         apache-rat-plugin/src/main/java/org/apache/rat
A         apache-rat-plugin/src/main/java/org/apache/rat/mp
AU        apache-rat-plugin/src/main/java/org/apache/rat/mp/AbstractRatMojo.java
AU        apache-rat-plugin/src/main/java/org/apache/rat/mp/FilesReportable.java
AU        apache-rat-plugin/src/main/java/org/apache/rat/mp/RatCheckException.java
AU        apache-rat-plugin/src/main/java/org/apache/rat/mp/LicenseFamilySpecification.java
AU        apache-rat-plugin/src/main/java/org/apache/rat/mp/RatReportMojo.java
A         apache-rat-plugin/src/main/java/org/apache/rat/mp/ExclusionHelper.java
AU        apache-rat-plugin/src/main/java/org/apache/rat/mp/RatCheckMojo.java
AU        apache-rat-plugin/src/main/java/org/apache/rat/mp/HeaderMatcherSpecification.java
A         apache-rat-plugin/src/main/filtered-resources
A         apache-rat-plugin/src/main/filtered-resources/org
A         apache-rat-plugin/src/main/filtered-resources/org/apache
A         apache-rat-plugin/src/main/filtered-resources/org/apache/rat
A         apache-rat-plugin/src/main/filtered-resources/org/apache/rat/mp
AU        apache-rat-plugin/src/main/filtered-resources/org/apache/rat/mp/rat-report.properties
A         apache-rat-plugin/src/main/resources
A         apache-rat-plugin/src/main/resources/org
A         apache-rat-plugin/src/main/resources/org/apache
A         apache-rat-plugin/src/main/resources/org/apache/rat
A         apache-rat-plugin/src/main/resources/org/apache/rat/mp
AU        apache-rat-plugin/src/main/resources/org/apache/rat/mp/package.html
A         apache-rat-plugin/src/site
A         apache-rat-plugin/src/site/resources
A         apache-rat-plugin/src/site/resources/css
AU        apache-rat-plugin/src/site/resources/css/site.css
A         apache-rat-plugin/src/site/fml
AU        apache-rat-plugin/src/site/fml/faq.fml
AU        apache-rat-plugin/src/site/site.xml
A         apache-rat-plugin/src/site/apt
AU        apache-rat-plugin/src/site/apt/usage.apt.vm
AU        apache-rat-plugin/src/site/apt/index.apt
A         apache-rat-plugin/src/site/apt/examples
AU        apache-rat-plugin/src/site/apt/examples/basic.apt.vm
AU        apache-rat-plugin/src/site/apt/examples/site.apt.vm
AU        apache-rat-plugin/src/site/apt/examples/verify.apt.vm
AU        apache-rat-plugin/src/site/apt/examples/custom-license.apt.vm
AU        apache-rat-plugin/pom.xml
AU        LICENSE
 U        .
At revision 1625422
Parsing POMs
maven3-agent.jar already up to date
maven3-interceptor.jar already up to date
maven3-interceptor-commons.jar already up to date
[Creadur-Rat-ParentPom] $ /home/jenkins/tools/java/latest1.5/bin/java -cp /jenkins/maven3-agent.jar:/jenkins/tools/hudson.tasks.Maven_MavenInstallation/Maven_3.0.5/boot/plexus-classworlds-2.4.jar
org.jvnet.hudson.maven3.agent.Maven3Main /jenkins/tools/hudson.tasks.Maven_MavenInstallation/Maven_3.0.5
/tmp/slave.jar /jenkins/maven3-interceptor.jar /jenkins/maven3-interceptor-commons.jar 44149
<===[JENKINS REMOTchannel started
ING CAPACITY]===>   ERROR: [JENKINS-18403] JDK 5 not supported to run Maven; retrying with
slave Java and setting compile/test properties to point to /home/jenkins/tools/java/latest1.5
maven3-agent.jar already up to date
maven3-interceptor.jar already up to date
maven3-interceptor-commons.jar already up to date
[Creadur-Rat-ParentPom] $ /usr/lib/jvm/java-7-openjdk-amd64/jre/bin/java -cp /jenkins/maven3-agent.jar:/jenkins/tools/hudson.tasks.Maven_MavenInstallation/Maven_3.0.5/boot/plexus-classworlds-2.4.jar
org.jvnet.hudson.maven3.agent.Maven3Main /jenkins/tools/hudson.tasks.Maven_MavenInstallation/Maven_3.0.5
/tmp/slave.jar /jenkins/maven3-interceptor.jar /jenkins/maven3-interceptor-commons.jar 53430
<===[JENKINS REMOTING CAPACITY]===>   channel started
log4j:WARN No appenders could be found for logger (org.apache.commons.beanutils.converters.BooleanConverter).
log4j:WARN Please initialize the log4j system properly.
Executing Maven:  -B -f <https://builds.apache.org/job/Creadur-Rat-ParentPom/ws/pom.xml>
-Dmaven.repo.local=/jenkins/maven-repositories/0 clean install -N -e -B
[INFO] Error stacktraces are turned on.
[INFO] Scanning for projects...
[INFO]                                                                         
[INFO] ------------------------------------------------------------------------
[INFO] Building Apache Creadur Rat 0.12-SNAPSHOT
[INFO] ------------------------------------------------------------------------
[INFO] 
[INFO] --- maven-clean-plugin:2.5:clean (default-clean) @ apache-rat-project ---
[INFO] 
[INFO] --- maven-enforcer-plugin:1.3.1:enforce (enforce-bytecode-version) @ apache-rat-project
---
[INFO] 
[INFO] --- apache-rat-plugin:0.11:check (default) @ apache-rat-project ---
[INFO] 55 implicit excludes (use -debug for more details).
[INFO] Exclude: BUILD.txt
[INFO] Exclude: apache-rat/README*.txt
[INFO] Exclude: apache-rat-core/src/test/resources/**
[INFO] Exclude: apache-rat*/target/**
[INFO] Exclude: apache-rat-plugin/src/test/resources/**
[INFO] Exclude: apache-rat-plugin/src/it/**
[INFO] Exclude: apache-rat-tasks/src/test/resources/**
[INFO] 14 resources included (use -debug for more details)
Warning:  org.apache.xerces.jaxp.SAXParserImpl$JAXPSAXParser: Property 'http://www.oracle.com/xml/jaxp/properties/entityExpansionLimit'
is not recognized.
Compiler warnings:
  WARNING:  'org.apache.xerces.jaxp.SAXParserImpl: Property 'http://javax.xml.XMLConstants/property/accessExternalDTD'
is not recognized.'
Warning:  org.apache.xerces.parsers.SAXParser: Feature 'http://javax.xml.XMLConstants/feature/secure-processing'
is not recognized.
Warning:  org.apache.xerces.parsers.SAXParser: Property 'http://javax.xml.XMLConstants/property/accessExternalDTD'
is not recognized.
Warning:  org.apache.xerces.parsers.SAXParser: Property 'http://www.oracle.com/xml/jaxp/properties/entityExpansionLimit'
is not recognized.
[INFO] Rat check: Summary of files. Unapproved: 0 unknown: 0 generated: 0 approved: 10 licence.
[INFO] 
[INFO] --- maven-remote-resources-plugin:1.5:process (default) @ apache-rat-project ---
[INFO] 
[INFO] --- animal-sniffer-maven-plugin:1.11:check (check-java-1.5-compat) @ apache-rat-project
---
[INFO] Checking unresolved references to org.codehaus.mojo.signature:java15:1.0
[INFO] 
[INFO] --- maven-site-plugin:3.4:attach-descriptor (attach-descriptor) @ apache-rat-project
---
[INFO] 
[INFO] --- maven-install-plugin:2.5.1:install (default-install) @ apache-rat-project ---
[INFO] Installing <https://builds.apache.org/job/Creadur-Rat-ParentPom/ws/pom.xml> to
/jenkins/maven-repositories/0/org/apache/rat/apache-rat-project/0.12-SNAPSHOT/apache-rat-project-0.12-SNAPSHOT.pom
[INFO] Installing <https://builds.apache.org/job/Creadur-Rat-ParentPom/ws/target/apache-rat-project-0.12-SNAPSHOT-site.xml>
to /jenkins/maven-repositories/0/org/apache/rat/apache-rat-project/0.12-SNAPSHOT/apache-rat-project-0.12-SNAPSHOT-site.xml
[INFO] ------------------------------------------------------------------------
[INFO] BUILD SUCCESS
[INFO] ------------------------------------------------------------------------
[INFO] Total time: 1:17.224s
[INFO] Finished at: Tue Sep 16 22:31:46 UTC 2014
[INFO] Final Memory: 16M/112M
[INFO] ------------------------------------------------------------------------
Waiting for Jenkins to finish collecting data
[JENKINS] Archiving <https://builds.apache.org/job/Creadur-Rat-ParentPom/ws/pom.xml>
to org.apache.rat/apache-rat-project/0.12-SNAPSHOT/apache-rat-project-0.12-SNAPSHOT.pom
[JENKINS] Archiving <https://builds.apache.org/job/Creadur-Rat-ParentPom/ws/target/apache-rat-project-0.12-SNAPSHOT-site.xml>
to org.apache.rat/apache-rat-project/0.12-SNAPSHOT/apache-rat-project-0.12-SNAPSHOT-site.xml
Sending artifact delta relative to Creadur-Rat-ParentPom ยป Apache Creadur Rat #16
Archived 2 artifacts
Archive block size is 32768
Received 0 blocks and 26562 bytes
Compression is 0.0%
Took 0.36 sec
channel stopped
Maven RedeployPublisher use remote jenkins-ubuntu-1404-4gb-ac0 maven settings from : /home/jenkins/.m2/settings.xml
[INFO] Deployment in https://repository.apache.org/content/repositories/snapshots (id=apache.snapshots.https,uniqueVersion=true)
Deploying the main artifact apache-rat-project-0.12-SNAPSHOT.pom
Downloading: https://repository.apache.org/content/repositories/snapshots/org/apache/rat/apache-rat-project/0.12-SNAPSHOT/maven-metadata.xml
Downloaded: https://repository.apache.org/content/repositories/snapshots/org/apache/rat/apache-rat-project/0.12-SNAPSHOT/maven-metadata.xml
(820 B at 1.7 KB/sec)
Uploading: https://repository.apache.org/content/repositories/snapshots/org/apache/rat/apache-rat-project/0.12-SNAPSHOT/apache-rat-project-0.12-20140916.223155-48.pom
ERROR: Failed to deploy artifacts: Could not transfer artifact org.apache.rat:apache-rat-project:pom:0.12-20140916.223155-48
from/to apache.snapshots.https (https://repository.apache.org/content/repositories/snapshots):
Failed to transfer file: https://repository.apache.org/content/repositories/snapshots/org/apache/rat/apache-rat-project/0.12-SNAPSHOT/apache-rat-project-0.12-20140916.223155-48.pom.
Return code is: 401, ReasonPhrase: Unauthorized.
org.apache.maven.artifact.deployer.ArtifactDeploymentException: Failed to deploy artifacts:
Could not transfer artifact org.apache.rat:apache-rat-project:pom:0.12-20140916.223155-48
from/to apache.snapshots.https (https://repository.apache.org/content/repositories/snapshots):
Failed to transfer file: https://repository.apache.org/content/repositories/snapshots/org/apache/rat/apache-rat-project/0.12-SNAPSHOT/apache-rat-project-0.12-20140916.223155-48.pom.
Return code is: 401, ReasonPhrase: Unauthorized.
	at org.apache.maven.artifact.deployer.DefaultArtifactDeployer.deploy(DefaultArtifactDeployer.java:143)
	at hudson.maven.reporters.MavenArtifactRecord.deploy(MavenArtifactRecord.java:193)
	at hudson.maven.RedeployPublisher.perform(RedeployPublisher.java:176)
	at hudson.tasks.BuildStepMonitor$1.perform(BuildStepMonitor.java:20)
	at hudson.model.AbstractBuild$AbstractBuildExecution.perform(AbstractBuild.java:804)
	at hudson.model.AbstractBuild$AbstractBuildExecution.performAllBuildSteps(AbstractBuild.java:776)
	at hudson.maven.MavenModuleSetBuild$MavenModuleSetBuildExecution.post2(MavenModuleSetBuild.java:1040)
	at hudson.model.AbstractBuild$AbstractBuildExecution.post(AbstractBuild.java:725)
	at hudson.model.Run.execute(Run.java:1701)
	at hudson.maven.MavenModuleSetBuild.run(MavenModuleSetBuild.java:529)
	at hudson.model.ResourceController.execute(ResourceController.java:88)
	at hudson.model.Executor.run(Executor.java:231)
Caused by: org.eclipse.aether.deployment.DeploymentException: Failed to deploy artifacts:
Could not transfer artifact org.apache.rat:apache-rat-project:pom:0.12-20140916.223155-48
from/to apache.snapshots.https (https://repository.apache.org/content/repositories/snapshots):
Failed to transfer file: https://repository.apache.org/content/repositories/snapshots/org/apache/rat/apache-rat-project/0.12-SNAPSHOT/apache-rat-project-0.12-20140916.223155-48.pom.
Return code is: 401, ReasonPhrase: Unauthorized.
	at org.eclipse.aether.internal.impl.DefaultDeployer.deploy(DefaultDeployer.java:341)
	at org.eclipse.aether.internal.impl.DefaultDeployer.deploy(DefaultDeployer.java:269)
	at org.eclipse.aether.internal.impl.DefaultRepositorySystem.deploy(DefaultRepositorySystem.java:413)
	at org.apache.maven.artifact.deployer.DefaultArtifactDeployer.deploy(DefaultArtifactDeployer.java:139)
	... 11 more
Caused by: org.eclipse.aether.transfer.ArtifactTransferException: Could not transfer artifact
org.apache.rat:apache-rat-project:pom:0.12-20140916.223155-48 from/to apache.snapshots.https
(https://repository.apache.org/content/repositories/snapshots): Failed to transfer file: https://repository.apache.org/content/repositories/snapshots/org/apache/rat/apache-rat-project/0.12-SNAPSHOT/apache-rat-project-0.12-20140916.223155-48.pom.
Return code is: 401, ReasonPhrase: Unauthorized.
	at org.eclipse.aether.connector.wagon.WagonRepositoryConnector$6.wrap(WagonRepositoryConnector.java:1016)
	at org.eclipse.aether.connector.wagon.WagonRepositoryConnector$6.wrap(WagonRepositoryConnector.java:1004)
	at org.eclipse.aether.connector.wagon.WagonRepositoryConnector$PutTask.run(WagonRepositoryConnector.java:895)
	at org.eclipse.aether.connector.wagon.WagonRepositoryConnector.put(WagonRepositoryConnector.java:522)
	at org.eclipse.aether.internal.impl.DefaultDeployer.deploy(DefaultDeployer.java:335)
	... 14 more
Caused by: org.apache.maven.wagon.TransferFailedException: Failed to transfer file: https://repository.apache.org/content/repositories/snapshots/org/apache/rat/apache-rat-project/0.12-SNAPSHOT/apache-rat-project-0.12-20140916.223155-48.pom.
Return code is: 401, ReasonPhrase: Unauthorized.
	at org.apache.maven.wagon.shared.http4.AbstractHttpClientWagon.put(AbstractHttpClientWagon.java:626)
	at org.apache.maven.wagon.shared.http4.AbstractHttpClientWagon.put(AbstractHttpClientWagon.java:524)
	at org.apache.maven.wagon.shared.http4.AbstractHttpClientWagon.put(AbstractHttpClientWagon.java:505)
	at org.apache.maven.wagon.shared.http4.AbstractHttpClientWagon.put(AbstractHttpClientWagon.java:485)
	at org.eclipse.aether.connector.wagon.WagonRepositoryConnector$PutTask.run(WagonRepositoryConnector.java:871)
	... 16 more
[INFO] Deployment failed after 3.2 sec
Build step 'Deploy artifacts to Maven repository' changed build result to FAILURE

Mime
View raw message