creadur-dev mailing list archives

Site index · List index
Message view « Date » · « Thread »
Top « Date » · « Thread »
From Apache Jenkins Server <jenk...@builds.apache.org>
Subject Build failed in Jenkins: Creadur-Rat #80
Date Sun, 03 Aug 2014 18:00:08 GMT
See <https://builds.apache.org/job/Creadur-Rat/80/>

------------------------------------------
[...truncated 341 lines...]
AU        apache-rat-plugin/src/test/invoker/it1/invoker.properties
A         apache-rat-plugin/src/test/invoker/it1/verify.groovy
AU        apache-rat-plugin/src/test/invoker/it1/pom.xml
AU        apache-rat-plugin/src/test/invoker/it1/src.apt
A         apache-rat-plugin/src/test/it1
AU        apache-rat-plugin/src/test/it1/pom.xml
A         apache-rat-plugin/src/test/it2
AU        apache-rat-plugin/src/test/it2/pom.xml
AU        apache-rat-plugin/src/test/it2/src.txt
A         apache-rat-plugin/src/main
A         apache-rat-plugin/src/main/java
A         apache-rat-plugin/src/main/java/org
A         apache-rat-plugin/src/main/java/org/apache
A         apache-rat-plugin/src/main/java/org/apache/rat
A         apache-rat-plugin/src/main/java/org/apache/rat/mp
AU        apache-rat-plugin/src/main/java/org/apache/rat/mp/LicenseFamilySpecification.java
AU        apache-rat-plugin/src/main/java/org/apache/rat/mp/RatReportMojo.java
AU        apache-rat-plugin/src/main/java/org/apache/rat/mp/RatCheckMojo.java
AU        apache-rat-plugin/src/main/java/org/apache/rat/mp/HeaderMatcherSpecification.java
AU        apache-rat-plugin/src/main/java/org/apache/rat/mp/AbstractRatMojo.java
AU        apache-rat-plugin/src/main/java/org/apache/rat/mp/FilesReportable.java
AU        apache-rat-plugin/src/main/java/org/apache/rat/mp/RatCheckException.java
A         apache-rat-plugin/src/main/filtered-resources
A         apache-rat-plugin/src/main/filtered-resources/org
A         apache-rat-plugin/src/main/filtered-resources/org/apache
A         apache-rat-plugin/src/main/filtered-resources/org/apache/rat
A         apache-rat-plugin/src/main/filtered-resources/org/apache/rat/mp
AU        apache-rat-plugin/src/main/filtered-resources/org/apache/rat/mp/rat-report.properties
A         apache-rat-plugin/src/main/resources
A         apache-rat-plugin/src/main/resources/org
A         apache-rat-plugin/src/main/resources/org/apache
A         apache-rat-plugin/src/main/resources/org/apache/rat
A         apache-rat-plugin/src/main/resources/org/apache/rat/mp
AU        apache-rat-plugin/src/main/resources/org/apache/rat/mp/package.html
A         apache-rat-plugin/src/site
AU        apache-rat-plugin/src/site/site.xml
A         apache-rat-plugin/src/site/apt
AU        apache-rat-plugin/src/site/apt/usage.apt.vm
AU        apache-rat-plugin/src/site/apt/index.apt
A         apache-rat-plugin/src/site/apt/examples
AU        apache-rat-plugin/src/site/apt/examples/custom-license.apt.vm
AU        apache-rat-plugin/src/site/apt/examples/basic.apt.vm
AU        apache-rat-plugin/src/site/apt/examples/site.apt.vm
AU        apache-rat-plugin/src/site/apt/examples/verify.apt.vm
A         apache-rat-plugin/src/site/resources
A         apache-rat-plugin/src/site/resources/css
AU        apache-rat-plugin/src/site/resources/css/site.css
A         apache-rat-plugin/src/site/fml
AU        apache-rat-plugin/src/site/fml/faq.fml
A         apache-rat-plugin/src/changes
AU        apache-rat-plugin/src/changes/changes.xml
AU        LICENSE
A         apache-rat
AU        apache-rat/README-CLI.txt
A         apache-rat/src
A         apache-rat/src/main
A         apache-rat/src/main/assembly
AU        apache-rat/src/main/assembly/src.xml
AU        apache-rat/src/main/assembly/bin.xml
A         apache-rat/src/site
AU        apache-rat/src/site/site.xml
A         apache-rat/src/site/apt
AU        apache-rat/src/site/apt/index.apt.vm
A         apache-rat/src/site/resources
A         apache-rat/src/site/resources/css
AU        apache-rat/src/site/resources/css/site.css
AU        apache-rat/pom.xml
AU        apache-rat/README-ANT.txt
AU        apache-rat/README.txt
 U        .
At revision 1615422
no change for http://svn.apache.org/repos/asf/creadur/rat/trunk since the previous build
Parsing POMs
maven-agent.jar already up to date
classworlds.jar already up to date
maven-interceptor.jar already up to date
maven2.1-interceptor.jar already up to date
[Creadur-Rat] $ /home/hudson/tools/java/latest1.5/bin/java -cp /home/jenkins/jenkins-slave/maven-agent.jar:/home/jenkins/jenkins-slave/classworlds.jar
hudson.maven.agent.Main /home/hudson/tools/maven/apache-maven-2.2.1 /home/jenkins/jenkins-slave/slave.jar
/home/jenkins/jenkins-slave/maven-interceptor.jar 44637 /home/jenkins/jenkins-slave/maven2.1-interceptor.jar
<===[JENKINS REMOTING CAPACITY]===>   channel started
ERROR: [JENKINS-18403] JDK 5 not supported to run Maven; retrying with slave Java and setting
compile/test properties to point to /home/hudson/tools/java/latest1.5
maven-agent.jar already up to date
classworlds.jar already up to date
maven-interceptor.jar already up to date
maven2.1-interceptor.jar already up to date
[Creadur-Rat] $ /home/jenkins/tools/java/jdk1.7.0_55/jre/bin/java -cp /home/jenkins/jenkins-slave/maven-agent.jar:/home/jenkins/jenkins-slave/classworlds.jar
hudson.maven.agent.Main /home/hudson/tools/maven/apache-maven-2.2.1 /home/jenkins/jenkins-slave/slave.jar
/home/jenkins/jenkins-slave/maven-interceptor.jar 39174 /home/jenkins/jenkins-slave/maven2.1-interceptor.jar
<===[JENKINS REMOTING CAPACITY]===>   channel started
log4j:WARN No appenders could be found for logger (org.apache.commons.beanutils.converters.BooleanConverter).
log4j:WARN Please initialize the log4j system properly.
Executing Maven:  -B -f <https://builds.apache.org/job/Creadur-Rat/ws/pom.xml> -Dmaven.repo.local=/home/jenkins/jenkins-slave/maven-repositories/1
clean install -B -U -e -fae -V -Prun-its
+ Error stacktraces are turned on.
Apache Maven 2.2.1 (r801777; 2009-08-06 19:16:01+0000)
Java version: 1.7.0_55
Java home: /home/jenkins/tools/java/jdk1.7.0_55/jre
Default locale: en_US, platform encoding: ANSI_X3.4-1968
OS name: "linux" version: "3.13.0-24-generic" arch: "amd64" Family: "unix"
[INFO] Scanning for projects...
[WARNING] 
	Profile with id: 'run-its' has not been activated.

[INFO] Reactor build order: 
[INFO]   Apache Creadur Rat
[INFO]   Apache Creadur Rat::Core
[INFO]   Apache Creadur Rat::Plugin4Maven
[INFO]   Apache Creadur Rat::Tasks4Ant
[INFO]   Apache Creadur Rat::Command Line
[INFO] ------------------------------------------------------------------------
[INFO] Building Apache Creadur Rat
[INFO]    task-segment: [clean, install]
[INFO] ------------------------------------------------------------------------
[INFO] [clean:clean {execution: default-clean}]
[INFO] [remote-resources:process {execution: default}]
[INFO] [site:attach-descriptor {execution: default-attach-descriptor}]
[INFO] [install:install {execution: default-install}]
[INFO] Installing <https://builds.apache.org/job/Creadur-Rat/ws/pom.xml> to /home/jenkins/jenkins-slave/maven-repositories/1/org/apache/rat/apache-rat-project/0.11-SNAPSHOT/apache-rat-project-0.11-SNAPSHOT.pom
[INFO] Installing <https://builds.apache.org/job/Creadur-Rat/ws/target/apache-rat-project-0.11-SNAPSHOT-site.xml>
to /home/jenkins/jenkins-slave/maven-repositories/1/org/apache/rat/apache-rat-project/0.11-SNAPSHOT/apache-rat-project-0.11-SNAPSHOT-site.xml
[INFO] ------------------------------------------------------------------------
[INFO] Building Apache Creadur Rat::Core
[INFO]    task-segment: [clean, install]
[INFO] ------------------------------------------------------------------------
[INFO] [clean:clean {execution: default-clean}]
[INFO] [remote-resources:process {execution: default}]
Downloading: http://repo1.maven.org/maven2/org/apache/commons/commons-lang3/3.3.2/commons-lang3-3.3.2.jar
403K downloaded  (commons-lang3-3.3.2.jar)
[INFO] [resources:resources {execution: default-resources}]
[INFO] Using 'UTF-8' encoding to copy filtered resources.
[INFO] Copying 1 resource
[INFO] skip non existing resourceDirectory <https://builds.apache.org/job/Creadur-Rat/ws/apache-rat-core/src/main/filtered-resources>
[INFO] Copying 1 resource to META-INF
[INFO] Copying 3 resources
[INFO] [compiler:compile {execution: default-compile}]
[INFO] Changes detected - recompiling the module!
[INFO] Compiling 90 source files to <https://builds.apache.org/job/Creadur-Rat/ws/apache-rat-core/target/classes>
[INFO] -------------------------------------------------------------
[ERROR] COMPILATION ERROR : 
[INFO] -------------------------------------------------------------
[ERROR] <https://builds.apache.org/job/Creadur-Rat/ws/apache-rat-core/src/main/java/org/apache/rat/document/impl/guesser/GuessUtils.java>:[23,-1]
cannot access org.apache.commons.lang3.StringUtils
bad class file: /home/jenkins/jenkins-slave/maven-repositories/1/org/apache/commons/commons-lang3/3.3.2/commons-lang3-3.3.2.jar(org/apache/commons/lang3/StringUtils.class)
class file has wrong version 50.0, should be 49.0
[INFO] 1 error
[INFO] -------------------------------------------------------------
[INFO] ------------------------------------------------------------------------
[INFO] SKIPPING Apache Creadur Rat::Plugin4Maven
[INFO]    task-segment: [clean, install]
[INFO] This project has been banned from further executions due to previous failures.
[INFO] ------------------------------------------------------------------------
[INFO] ------------------------------------------------------------------------
[INFO] SKIPPING Apache Creadur Rat::Tasks4Ant
[INFO]    task-segment: [clean, install]
[INFO] This project has been banned from further executions due to previous failures.
[INFO] ------------------------------------------------------------------------
[INFO] ------------------------------------------------------------------------
[INFO] SKIPPING Apache Creadur Rat::Command Line
[INFO]    task-segment: [clean, install]
[INFO] This project has been banned from further executions due to previous failures.
[INFO] ------------------------------------------------------------------------
[INFO] 
[INFO] 
[INFO] ------------------------------------------------------------------------
[INFO] Reactor Summary:
[INFO] ------------------------------------------------------------------------
[INFO] Apache Creadur Rat .................................... SUCCESS [8.973s]
[INFO] Apache Creadur Rat::Core .............................. FAILED [3.294s]
[INFO] Apache Creadur Rat::Plugin4Maven ...................... SKIPPED (dependency build failed
or was skipped)
[INFO] Apache Creadur Rat::Tasks4Ant ......................... SKIPPED (dependency build failed
or was skipped)
[INFO] Apache Creadur Rat::Command Line ...................... SKIPPED (dependency build failed
or was skipped)
[INFO] ------------------------------------------------------------------------
[INFO] Error for project: Apache Creadur Rat::Core (during install)
[INFO] ------------------------------------------------------------------------
[INFO] Compilation failure
<https://builds.apache.org/job/Creadur-Rat/ws/apache-rat-core/src/main/java/org/apache/rat/document/impl/guesser/GuessUtils.java>:[23,-1]
cannot access org.apache.commons.lang3.StringUtils
bad class file: /home/jenkins/jenkins-slave/maven-repositories/1/org/apache/commons/commons-lang3/3.3.2/commons-lang3-3.3.2.jar(org/apache/commons/lang3/StringUtils.class)
class file has wrong version 50.0, should be 49.0

[INFO] ------------------------------------------------------------------------
[INFO] Trace
org.apache.maven.BuildFailureException: Compilation failure
<https://builds.apache.org/job/Creadur-Rat/ws/apache-rat-core/src/main/java/org/apache/rat/document/impl/guesser/GuessUtils.java>:[23,-1]
cannot access org.apache.commons.lang3.StringUtils
bad class file: /home/jenkins/jenkins-slave/maven-repositories/1/org/apache/commons/commons-lang3/3.3.2/commons-lang3-3.3.2.jar(org/apache/commons/lang3/StringUtils.class)
class file has wrong version 50.0, should be 49.0

	at org.apache.maven.lifecycle.DefaultLifecycleExecutor.executeGoals(DefaultLifecycleExecutor.java:715)
	at org.apache.maven.lifecycle.DefaultLifecycleExecutor.executeGoalWithLifecycle(DefaultLifecycleExecutor.java:556)
	at org.apache.maven.lifecycle.DefaultLifecycleExecutor.executeGoal(DefaultLifecycleExecutor.java:535)
	at org.apache.maven.lifecycle.DefaultLifecycleExecutor.executeGoalAndHandleFailures(DefaultLifecycleExecutor.java:387)
	at org.apache.maven.lifecycle.DefaultLifecycleExecutor.executeTaskSegments(DefaultLifecycleExecutor.java:348)
	at org.apache.maven.lifecycle.DefaultLifecycleExecutor.execute(DefaultLifecycleExecutor.java:180)
	at org.apache.maven.lifecycle.LifecycleExecutorInterceptor.execute(LifecycleExecutorInterceptor.java:65)
	at org.apache.maven.DefaultMaven.doExecute(DefaultMaven.java:328)
	at org.apache.maven.DefaultMaven.execute(DefaultMaven.java:138)
	at org.apache.maven.cli.MavenCli.main(MavenCli.java:362)
	at sun.reflect.NativeMethodAccessorImpl.invoke0(Native Method)
	at sun.reflect.NativeMethodAccessorImpl.invoke(NativeMethodAccessorImpl.java:57)
	at sun.reflect.DelegatingMethodAccessorImpl.invoke(DelegatingMethodAccessorImpl.java:43)
	at java.lang.reflect.Method.invoke(Method.java:606)
	at org.codehaus.classworlds.Launcher.launchEnhanced(Launcher.java:315)
	at org.codehaus.classworlds.Launcher.launch(Launcher.java:255)
	at hudson.maven.agent.Main.launch(Main.java:205)
	at hudson.maven.MavenBuilder.call(MavenBuilder.java:154)
	at hudson.maven.Maven2Builder.call(Maven2Builder.java:79)
	at hudson.maven.Maven2Builder.call(Maven2Builder.java:55)
	at hudson.remoting.UserRequest.perform(UserRequest.java:118)
	at hudson.remoting.UserRequest.perform(UserRequest.java:48)
	at hudson.remoting.Request$2.run(Request.java:328)
	at hudson.remoting.InterceptingExecutorService$1.call(InterceptingExecutorService.java:72)
	at java.util.concurrent.FutureTask.run(FutureTask.java:262)
	at java.util.concurrent.ThreadPoolExecutor.runWorker(ThreadPoolExecutor.java:1145)
	at java.util.concurrent.ThreadPoolExecutor$Worker.run(ThreadPoolExecutor.java:615)
	at java.lang.Thread.run(Thread.java:745)
Caused by: org.apache.maven.plugin.compiler.CompilationFailureException: Compilation failure
<https://builds.apache.org/job/Creadur-Rat/ws/apache-rat-core/src/main/java/org/apache/rat/document/impl/guesser/GuessUtils.java>:[23,-1]
cannot access org.apache.commons.lang3.StringUtils
bad class file: /home/jenkins/jenkins-slave/maven-repositories/1/org/apache/commons/commons-lang3/3.3.2/commons-lang3-3.3.2.jar(org/apache/commons/lang3/StringUtils.class)
class file has wrong version 50.0, should be 49.0

	at org.apache.maven.plugin.compiler.AbstractCompilerMojo.execute(AbstractCompilerMojo.java:858)
	at org.apache.maven.plugin.compiler.CompilerMojo.execute(CompilerMojo.java:129)
	at org.apache.maven.plugin.DefaultPluginManager.executeMojo(DefaultPluginManager.java:490)
	at hudson.maven.agent.PluginManagerInterceptor.executeMojo(PluginManagerInterceptor.java:182)
	at org.apache.maven.lifecycle.DefaultLifecycleExecutor.executeGoals(DefaultLifecycleExecutor.java:694)
	... 27 more
[INFO] ------------------------------------------------------------------------
[INFO] BUILD ERRORS
[INFO] ------------------------------------------------------------------------
[INFO] Total time: 17 seconds
[INFO] Finished at: Sun Aug 03 18:01:03 UTC 2014
[INFO] Final Memory: 48M/907M
[INFO] ------------------------------------------------------------------------
[JENKINS] Archiving /home/jenkins/jenkins-slave/maven-repositories/1/org/apache/rat/apache-rat-project/0.11-SNAPSHOT/apache-rat-project-0.11-SNAPSHOT.pom
to org.apache.rat/apache-rat-project/0.11-SNAPSHOT/apache-rat-project-0.11-SNAPSHOT.pom
[JENKINS] Archiving <https://builds.apache.org/job/Creadur-Rat/ws/target/apache-rat-project-0.11-SNAPSHOT-site.xml>
to org.apache.rat/apache-rat-project/0.11-SNAPSHOT/apache-rat-project-0.11-SNAPSHOT-site.xml
/home/jenkins/jenkins-slave/maven-repositories/1/org/apache/rat/apache-rat-project/0.11-SNAPSHOT/apache-rat-project-0.11-SNAPSHOT.pom
is not inside <https://builds.apache.org/job/Creadur-Rat/ws/;> will archive in a separate
pass
Sending artifact delta relative to Creadur-Rat ? Apache Creadur Rat #79
Archived 1 artifacts
Archive block size is 32768
Received 0 blocks and 5153 bytes
Compression is 0.0%
Took 44 ms
Sending artifact delta relative to Creadur-Rat ? Apache Creadur Rat #79
Archived 1 artifacts
Archive block size is 32768
Received 0 blocks and 16038 bytes
Compression is 0.0%
Took 47 ms
[JENKINS] Archiving <https://builds.apache.org/job/Creadur-Rat/ws/apache-rat-core/pom.xml>
to org.apache.rat/apache-rat-core/0.11-SNAPSHOT/apache-rat-core-0.11-SNAPSHOT.pom
Sending artifact delta relative to Creadur-Rat ? Apache Creadur Rat::Core #79
Archived 1 artifacts
Archive block size is 32768
Received 0 blocks and 4077 bytes
Compression is 0.0%
Took 55 ms
channel stopped

Mime
View raw message