creadur-dev mailing list archives

Site index · List index
Message view « Date » · « Thread »
Top « Date » · « Thread »
From Apache Jenkins Server <jenk...@builds.apache.org>
Subject Build failed in Jenkins: Creadur-Whisker #9
Date Fri, 22 Aug 2014 21:09:34 GMT
See <https://builds.apache.org/job/Creadur-Whisker/9/changes>

Changes:

[pottlinger] WHSIKER-12 Problems with MOJO on CI

- Upgrading maven-plugin-stuff in order to hopefully get a green build on CI.
- Added mojo-attribute that no project is required to run this plugin.

------------------------------------------
[...truncated 834 lines...]
[INFO] Including commons-logging:commons-logging-api:jar:1.1 in the shaded jar.
[INFO] Including commons-cli:commons-cli:jar:1.2 in the shaded jar.
[INFO] Including org.apache.creadur.whisker:apache-whisker-scan:jar:0.2-SNAPSHOT in the shaded
jar.
[INFO] Including org.apache.creadur.whisker:apache-whisker-xml:jar:0.2-SNAPSHOT in the shaded
jar.
[INFO] Including org.jdom:jdom:jar:1.1.3 in the shaded jar.
[INFO] Including org.apache.commons:commons-lang3:jar:3.3.2 in the shaded jar.
[INFO] Including org.apache.creadur.whisker:apache-whisker-model:jar:0.2-SNAPSHOT in the shaded
jar.
[INFO] Including org.apache.creadur.whisker:apache-whisker-velocity:jar:0.2-SNAPSHOT in the
shaded jar.
[INFO] Including org.apache.velocity:velocity:jar:1.7 in the shaded jar.
[INFO] Including commons-collections:commons-collections:jar:3.2.1 in the shaded jar.
[INFO] Including commons-lang:commons-lang:jar:2.4 in the shaded jar.
[INFO] Including commons-io:commons-io:jar:2.4 in the shaded jar.
[INFO] Including org.apache.creadur.whisker:apache-whisker-app:jar:0.2-SNAPSHOT in the shaded
jar.
[INFO] Replacing original artifact with shaded artifact.
[INFO] Replacing <https://builds.apache.org/job/Creadur-Whisker/ws/apache-whisker-cli/target/apache-whisker-0.2-SNAPSHOT.jar>
with <https://builds.apache.org/job/Creadur-Whisker/ws/apache-whisker-cli/target/apache-whisker-cli-0.2-SNAPSHOT-shaded.jar>
[INFO] Dependency-reduced POM written at: <https://builds.apache.org/job/Creadur-Whisker/ws/apache-whisker-cli/dependency-reduced-pom.xml>
[INFO] 
[INFO] --- maven-install-plugin:2.5.1:install (default-install) @ apache-whisker-cli ---
[INFO] Installing <https://builds.apache.org/job/Creadur-Whisker/ws/apache-whisker-cli/target/apache-whisker-0.2-SNAPSHOT.jar>
to /home/jenkins/jenkins-slave/maven-repositories/0/org/apache/creadur/whisker/apache-whisker-cli/0.2-SNAPSHOT/apache-whisker-cli-0.2-SNAPSHOT.jar
[INFO] Installing <https://builds.apache.org/job/Creadur-Whisker/ws/apache-whisker-cli/dependency-reduced-pom.xml>
to /home/jenkins/jenkins-slave/maven-repositories/0/org/apache/creadur/whisker/apache-whisker-cli/0.2-SNAPSHOT/apache-whisker-cli-0.2-SNAPSHOT.pom
[INFO]                                                                         
[INFO] ------------------------------------------------------------------------
[INFO] Building Apache Whisker::Plugin(Maven) 0.2-SNAPSHOT
[INFO] ------------------------------------------------------------------------
Downloading: http://repo.maven.apache.org/maven2/org/apache/maven/plugins/maven-invoker-plugin/1.8/maven-invoker-plugin-1.8.pom
Downloaded: http://repo.maven.apache.org/maven2/org/apache/maven/plugins/maven-invoker-plugin/1.8/maven-invoker-plugin-1.8.pom
(13 KB at 159.9 KB/sec)
Downloading: http://repo.maven.apache.org/maven2/org/apache/maven/plugins/maven-invoker-plugin/1.8/maven-invoker-plugin-1.8.jar
Downloaded: http://repo.maven.apache.org/maven2/org/apache/maven/plugins/maven-invoker-plugin/1.8/maven-invoker-plugin-1.8.jar
(103 KB at 902.4 KB/sec)
Downloading: http://repo.maven.apache.org/maven2/org/apache/maven/plugins/maven-plugin-plugin/3.2/maven-plugin-plugin-3.2.pom
Downloaded: http://repo.maven.apache.org/maven2/org/apache/maven/plugins/maven-plugin-plugin/3.2/maven-plugin-plugin-3.2.pom
(12 KB at 152.8 KB/sec)
Downloading: http://repo.maven.apache.org/maven2/org/apache/maven/plugins/maven-plugin-plugin/3.2/maven-plugin-plugin-3.2.jar
Downloaded: http://repo.maven.apache.org/maven2/org/apache/maven/plugins/maven-plugin-plugin/3.2/maven-plugin-plugin-3.2.jar
(47 KB at 591.3 KB/sec)
Downloading: http://repo.maven.apache.org/maven2/org/apache/maven/maven-plugin-api/3.2.3/maven-plugin-api-3.2.3.pom
Downloaded: http://repo.maven.apache.org/maven2/org/apache/maven/maven-plugin-api/3.2.3/maven-plugin-api-3.2.3.pom
(3 KB at 38.4 KB/sec)
Downloading: http://repo.maven.apache.org/maven2/org/apache/maven/maven/3.2.3/maven-3.2.3.pom
Downloaded: http://repo.maven.apache.org/maven2/org/apache/maven/maven/3.2.3/maven-3.2.3.pom
(23 KB at 289.1 KB/sec)
Downloading: http://repo.maven.apache.org/maven2/org/apache/maven/maven-model/3.2.3/maven-model-3.2.3.pom
Downloaded: http://repo.maven.apache.org/maven2/org/apache/maven/maven-model/3.2.3/maven-model-3.2.3.pom
(5 KB at 52.5 KB/sec)
Downloading: http://repo.maven.apache.org/maven2/org/codehaus/plexus/plexus-utils/3.0.17/plexus-utils-3.0.17.pom
Downloaded: http://repo.maven.apache.org/maven2/org/codehaus/plexus/plexus-utils/3.0.17/plexus-utils-3.0.17.pom
(4 KB at 43.1 KB/sec)
Downloading: http://repo.maven.apache.org/maven2/org/apache/maven/maven-artifact/3.2.3/maven-artifact-3.2.3.pom
Downloaded: http://repo.maven.apache.org/maven2/org/apache/maven/maven-artifact/3.2.3/maven-artifact-3.2.3.pom
(2 KB at 25.3 KB/sec)
Downloading: http://repo.maven.apache.org/maven2/org/eclipse/sisu/org.eclipse.sisu.plexus/0.0.0.M5/org.eclipse.sisu.plexus-0.0.0.M5.pom
Downloaded: http://repo.maven.apache.org/maven2/org/eclipse/sisu/org.eclipse.sisu.plexus/0.0.0.M5/org.eclipse.sisu.plexus-0.0.0.M5.pom
(5 KB at 62.1 KB/sec)
Downloading: http://repo.maven.apache.org/maven2/org/eclipse/sisu/sisu-plexus/0.0.0.M5/sisu-plexus-0.0.0.M5.pom
Downloaded: http://repo.maven.apache.org/maven2/org/eclipse/sisu/sisu-plexus/0.0.0.M5/sisu-plexus-0.0.0.M5.pom
(13 KB at 167.4 KB/sec)
Downloading: http://repo.maven.apache.org/maven2/org/eclipse/sisu/org.eclipse.sisu.inject/0.0.0.M5/org.eclipse.sisu.inject-0.0.0.M5.pom
Downloaded: http://repo.maven.apache.org/maven2/org/eclipse/sisu/org.eclipse.sisu.inject/0.0.0.M5/org.eclipse.sisu.inject-0.0.0.M5.pom
(3 KB at 32.4 KB/sec)
Downloading: http://repo.maven.apache.org/maven2/org/eclipse/sisu/sisu-inject/0.0.0.M5/sisu-inject-0.0.0.M5.pom
Downloaded: http://repo.maven.apache.org/maven2/org/eclipse/sisu/sisu-inject/0.0.0.M5/sisu-inject-0.0.0.M5.pom
(14 KB at 179.8 KB/sec)
Downloading: http://repo.maven.apache.org/maven2/org/apache/maven/plugin-tools/maven-plugin-annotations/3.3/maven-plugin-annotations-3.3.pom
Downloaded: http://repo.maven.apache.org/maven2/org/apache/maven/plugin-tools/maven-plugin-annotations/3.3/maven-plugin-annotations-3.3.pom
(2 KB at 20.7 KB/sec)
Downloading: http://repo.maven.apache.org/maven2/org/apache/maven/plugin-tools/maven-plugin-tools/3.3/maven-plugin-tools-3.3.pom
Downloaded: http://repo.maven.apache.org/maven2/org/apache/maven/plugin-tools/maven-plugin-tools/3.3/maven-plugin-tools-3.3.pom
(13 KB at 162.5 KB/sec)
Downloading: http://repo.maven.apache.org/maven2/org/apache/maven/maven-plugin-api/3.2.3/maven-plugin-api-3.2.3.jar
Downloading: http://repo.maven.apache.org/maven2/org/apache/maven/maven-model/3.2.3/maven-model-3.2.3.jar
Downloading: http://repo.maven.apache.org/maven2/org/codehaus/plexus/plexus-utils/3.0.17/plexus-utils-3.0.17.jar
Downloading: http://repo.maven.apache.org/maven2/org/apache/maven/maven-artifact/3.2.3/maven-artifact-3.2.3.jar
Downloading: http://repo.maven.apache.org/maven2/org/eclipse/sisu/org.eclipse.sisu.plexus/0.0.0.M5/org.eclipse.sisu.plexus-0.0.0.M5.jar
Downloaded: http://repo.maven.apache.org/maven2/org/apache/maven/maven-plugin-api/3.2.3/maven-plugin-api-3.2.3.jar
(45 KB at 470.3 KB/sec)
Downloading: http://repo.maven.apache.org/maven2/com/google/guava/guava/10.0.1/guava-10.0.1.jar
Downloaded: http://repo.maven.apache.org/maven2/org/apache/maven/maven-artifact/3.2.3/maven-artifact-3.2.3.jar
(53 KB at 291.5 KB/sec)
Downloading: http://repo.maven.apache.org/maven2/org/eclipse/sisu/org.eclipse.sisu.inject/0.0.0.M5/org.eclipse.sisu.inject-0.0.0.M5.jar
Downloaded: http://repo.maven.apache.org/maven2/org/apache/maven/maven-model/3.2.3/maven-model-3.2.3.jar
(157 KB at 543.9 KB/sec)
Downloading: http://repo.maven.apache.org/maven2/org/apache/maven/plugin-tools/maven-plugin-annotations/3.3/maven-plugin-annotations-3.3.jar
Downloaded: http://repo.maven.apache.org/maven2/org/eclipse/sisu/org.eclipse.sisu.plexus/0.0.0.M5/org.eclipse.sisu.plexus-0.0.0.M5.jar
(192 KB at 664.1 KB/sec)
Downloaded: http://repo.maven.apache.org/maven2/org/codehaus/plexus/plexus-utils/3.0.17/plexus-utils-3.0.17.jar
(246 KB at 773.2 KB/sec)
Downloaded: http://repo.maven.apache.org/maven2/org/apache/maven/plugin-tools/maven-plugin-annotations/3.3/maven-plugin-annotations-3.3.jar
(14 KB at 185.3 KB/sec)
Downloaded: http://repo.maven.apache.org/maven2/org/eclipse/sisu/org.eclipse.sisu.inject/0.0.0.M5/org.eclipse.sisu.inject-0.0.0.M5.jar
(285 KB at 1020.0 KB/sec)
Downloaded: http://repo.maven.apache.org/maven2/com/google/guava/guava/10.0.1/guava-10.0.1.jar
(1467 KB at 2869.6 KB/sec)
[INFO] 
[INFO] --- maven-clean-plugin:2.5:clean (default-clean) @ apache-whisker-plugin4maven ---
[INFO] 
[INFO] --- apache-rat-plugin:0.10:check (default) @ apache-whisker-plugin4maven ---
[INFO] 51 implicit excludes (use -debug for more details).
[INFO] No excludes explicitly specified.
[INFO] 60 resources included (use -debug for more details)
[INFO] Rat check: Summary of files. Unapproved: 0 unknown: 0 generated: 0 approved: 58 licence.
[INFO] 
[INFO] --- maven-plugin-plugin:3.2:descriptor (default-descriptor) @ apache-whisker-plugin4maven
---
Downloading: http://repo.maven.apache.org/maven2/org/apache/maven/plugin-tools/maven-plugin-tools-annotations/3.2/maven-plugin-tools-annotations-3.2.pom
Downloaded: http://repo.maven.apache.org/maven2/org/apache/maven/plugin-tools/maven-plugin-tools-annotations/3.2/maven-plugin-tools-annotations-3.2.pom
(5 KB at 55.1 KB/sec)
Downloading: http://repo.maven.apache.org/maven2/org/apache/maven/plugin-tools/maven-plugin-tools-api/3.2/maven-plugin-tools-api-3.2.pom
Downloaded: http://repo.maven.apache.org/maven2/org/apache/maven/plugin-tools/maven-plugin-tools-api/3.2/maven-plugin-tools-api-3.2.pom
(3 KB at 39.0 KB/sec)
Downloading: http://repo.maven.apache.org/maven2/com/thoughtworks/qdox/qdox/1.12.1/qdox-1.12.1.pom
Downloaded: http://repo.maven.apache.org/maven2/com/thoughtworks/qdox/qdox/1.12.1/qdox-1.12.1.pom
(18 KB at 223.2 KB/sec)
Downloading: http://repo.maven.apache.org/maven2/org/apache/maven/plugin-tools/maven-plugin-tools-generators/3.2/maven-plugin-tools-generators-3.2.pom
Downloaded: http://repo.maven.apache.org/maven2/org/apache/maven/plugin-tools/maven-plugin-tools-generators/3.2/maven-plugin-tools-generators-3.2.pom
(5 KB at 55.3 KB/sec)
Downloading: http://repo.maven.apache.org/maven2/org/apache/maven/plugin-tools/maven-plugin-tools-java/3.2/maven-plugin-tools-java-3.2.pom
Downloaded: http://repo.maven.apache.org/maven2/org/apache/maven/plugin-tools/maven-plugin-tools-java/3.2/maven-plugin-tools-java-3.2.pom
(4 KB at 46.1 KB/sec)
Downloading: http://repo.maven.apache.org/maven2/org/apache/maven/plugin-tools/maven-plugin-tools-beanshell/3.2/maven-plugin-tools-beanshell-3.2.pom
Downloaded: http://repo.maven.apache.org/maven2/org/apache/maven/plugin-tools/maven-plugin-tools-beanshell/3.2/maven-plugin-tools-beanshell-3.2.pom
(3 KB at 30.8 KB/sec)
Downloading: http://repo.maven.apache.org/maven2/org/apache/maven/plugin-tools/maven-plugin-tools-model/3.2/maven-plugin-tools-model-3.2.pom
Downloaded: http://repo.maven.apache.org/maven2/org/apache/maven/plugin-tools/maven-plugin-tools-model/3.2/maven-plugin-tools-model-3.2.pom
(4 KB at 39.7 KB/sec)
Downloading: http://repo.maven.apache.org/maven2/org/apache/maven/plugin-tools/maven-plugin-tools-annotations/3.2/maven-plugin-tools-annotations-3.2.jar
Downloading: http://repo.maven.apache.org/maven2/com/thoughtworks/qdox/qdox/1.12.1/qdox-1.12.1.jar
Downloading: http://repo.maven.apache.org/maven2/org/apache/maven/plugin-tools/maven-plugin-tools-api/3.2/maven-plugin-tools-api-3.2.jar
Downloading: http://repo.maven.apache.org/maven2/org/apache/maven/plugin-tools/maven-plugin-tools-generators/3.2/maven-plugin-tools-generators-3.2.jar
Downloading: http://repo.maven.apache.org/maven2/org/apache/maven/plugin-tools/maven-plugin-tools-java/3.2/maven-plugin-tools-java-3.2.jar
Downloaded: http://repo.maven.apache.org/maven2/org/apache/maven/plugin-tools/maven-plugin-tools-annotations/3.2/maven-plugin-tools-annotations-3.2.jar
(39 KB at 498.5 KB/sec)
Downloading: http://repo.maven.apache.org/maven2/org/apache/maven/plugin-tools/maven-plugin-tools-beanshell/3.2/maven-plugin-tools-beanshell-3.2.jar
Downloaded: http://repo.maven.apache.org/maven2/org/apache/maven/plugin-tools/maven-plugin-tools-api/3.2/maven-plugin-tools-api-3.2.jar
(23 KB at 283.7 KB/sec)
Downloading: http://repo.maven.apache.org/maven2/org/apache/maven/plugin-tools/maven-plugin-tools-model/3.2/maven-plugin-tools-model-3.2.jar
Downloaded: http://repo.maven.apache.org/maven2/org/apache/maven/plugin-tools/maven-plugin-tools-generators/3.2/maven-plugin-tools-generators-3.2.jar
(46 KB at 549.1 KB/sec)
Downloaded: http://repo.maven.apache.org/maven2/org/apache/maven/plugin-tools/maven-plugin-tools-java/3.2/maven-plugin-tools-java-3.2.jar
(18 KB at 209.3 KB/sec)
Downloaded: http://repo.maven.apache.org/maven2/com/thoughtworks/qdox/qdox/1.12.1/qdox-1.12.1.jar
(176 KB at 1194.6 KB/sec)
Downloaded: http://repo.maven.apache.org/maven2/org/apache/maven/plugin-tools/maven-plugin-tools-beanshell/3.2/maven-plugin-tools-beanshell-3.2.jar
(13 KB at 169.2 KB/sec)
Downloaded: http://repo.maven.apache.org/maven2/org/apache/maven/plugin-tools/maven-plugin-tools-model/3.2/maven-plugin-tools-model-3.2.jar
(32 KB at 415.2 KB/sec)
[WARNING] 

Goal prefix is specified as: 'plugin'. Maven currently expects it to be 'apache-whisker4'.

[INFO] Using 'UTF-8' encoding to read mojo metadata.
[INFO] Applying mojo extractor for language: java-annotations
[INFO] Mojo extractor for language: java-annotations found 0 mojo descriptors.
[INFO] Applying mojo extractor for language: java
[INFO] Mojo extractor for language: java found 0 mojo descriptors.
[INFO] Applying mojo extractor for language: bsh
[INFO] Mojo extractor for language: bsh found 0 mojo descriptors.
[INFO] ------------------------------------------------------------------------
[INFO] Reactor Summary:
[INFO] 
[INFO] Apache Whisker .................................... SUCCESS [36.192s]
[INFO] Apache Whisker::Model ............................. SUCCESS [18.504s]
[INFO] Apache Whisker::Scan .............................. SUCCESS [3.278s]
[INFO] Apache Whisker::XML ............................... SUCCESS [6.738s]
[INFO] Apache Whisker::App ............................... SUCCESS [3.719s]
[INFO] Apache Whisker::Output(velocity) .................. SUCCESS [6.546s]
[INFO] Apache Whisker::Command Line Interface ............ SUCCESS [7.969s]
[INFO] Apache Whisker::Plugin(Maven) ..................... FAILURE [5.403s]
[INFO] ------------------------------------------------------------------------
[INFO] BUILD FAILURE
[INFO] ------------------------------------------------------------------------
[INFO] Total time: 1:43.731s
[INFO] Finished at: Fri Aug 22 21:09:06 UTC 2014
[INFO] Final Memory: 21M/97M
[INFO] ------------------------------------------------------------------------
Waiting for Jenkins to finish collecting data[ERROR] Failed to execute goal org.apache.maven.plugins:maven-plugin-plugin:3.2:descriptor
(default-descriptor) on project apache-whisker-plugin4maven: Error extracting plugin descriptor:
'No mojo definitions were found for plugin: org.apache.creadur.whisker:apache-whisker-plugin4maven.'
-> [Help 1]
org.apache.maven.lifecycle.LifecycleExecutionException: Failed to execute goal org.apache.maven.plugins:maven-plugin-plugin:3.2:descriptor
(default-descriptor) on project apache-whisker-plugin4maven: Error extracting plugin descriptor:
'No mojo definitions were found for plugin: org.apache.creadur.whisker:apache-whisker-plugin4maven.'
	at org.apache.maven.lifecycle.internal.MojoExecutor.execute(MojoExecutor.java:217)
	at org.apache.maven.lifecycle.internal.MojoExecutor.execute(MojoExecutor.java:153)
	at org.apache.maven.lifecycle.internal.MojoExecutor.execute(MojoExecutor.java:145)
	at org.apache.maven.lifecycle.internal.LifecycleModuleBuilder.buildProject(LifecycleModuleBuilder.java:84)
	at org.apache.maven.lifecycle.internal.LifecycleModuleBuilder.buildProject(LifecycleModuleBuilder.java:59)
	at org.apache.maven.lifecycle.internal.LifecycleStarter.singleThreadedBuild(LifecycleStarter.java:183)
	at org.apache.maven.lifecycle.internal.LifecycleStarter.execute(LifecycleStarter.java:161)
	at org.apache.maven.DefaultMaven.doExecute(DefaultMaven.java:320)
	at org.apache.maven.DefaultMaven.execute(DefaultMaven.java:156)
	at org.jvnet.hudson.maven3.launcher.Maven3Launcher.main(Maven3Launcher.java:117)
	at sun.reflect.NativeMethodAccessorImpl.invoke0(Native Method)
	at sun.reflect.NativeMethodAccessorImpl.invoke(NativeMethodAccessorImpl.java:39)
	at sun.reflect.DelegatingMethodAccessorImpl.invoke(DelegatingMethodAccessorImpl.java:25)
	at java.lang.reflect.Method.invoke(Method.java:597)
	at org.codehaus.plexus.classworlds.launcher.Launcher.launchStandard(Launcher.java:329)
	at org.codehaus.plexus.classworlds.launcher.Launcher.launch(Launcher.java:239)
	at org.jvnet.hudson.maven3.agent.Maven3Main.launch(Maven3Main.java:178)
	at sun.reflect.NativeMethodAccessorImpl.invoke0(Native Method)
	at sun.reflect.NativeMethodAccessorImpl.invoke(NativeMethodAccessorImpl.java:39)
	at sun.reflect.DelegatingMethodAccessorImpl.invoke(DelegatingMethodAccessorImpl.java:25)
	at java.lang.reflect.Method.invoke(Method.java:597)
	at hudson.maven.Maven3Builder.call(Maven3Builder.java:134)
	at hudson.maven.Maven3Builder.call(Maven3Builder.java:69)
	at hudson.remoting.UserRequest.perform(UserRequest.java:118)
	at hudson.remoting.UserRequest.perform(UserRequest.java:48)
	at hudson.remoting.Request$2.run(Request.java:328)
	at hudson.remoting.InterceptingExecutorService$1.call(InterceptingExecutorService.java:72)
	at java.util.concurrent.FutureTask$Sync.innerRun(FutureTask.java:303)
	at java.util.concurrent.FutureTask.run(FutureTask.java:138)
	at java.util.concurrent.ThreadPoolExecutor$Worker.runTask(ThreadPoolExecutor.java:895)
	at java.util.concurrent.ThreadPoolExecutor$Worker.run(ThreadPoolExecutor.java:918)
	at java.lang.Thread.run(Thread.java:662)
Caused by: org.apache.maven.plugin.MojoExecutionException: Error extracting plugin descriptor:
'No mojo definitions were found for plugin: org.apache.creadur.whisker:apache-whisker-plugin4maven.'
	at org.apache.maven.plugin.plugin.AbstractGeneratorMojo.execute(AbstractGeneratorMojo.java:245)
	at org.apache.maven.plugin.plugin.DescriptorGeneratorMojo.execute(DescriptorGeneratorMojo.java:92)
	at org.apache.maven.plugin.DefaultBuildPluginManager.executeMojo(DefaultBuildPluginManager.java:101)
	at org.apache.maven.lifecycle.internal.MojoExecutor.execute(MojoExecutor.java:209)
	... 31 more
Caused by: org.apache.maven.plugin.descriptor.InvalidPluginDescriptorException: No mojo definitions
were found for plugin: org.apache.creadur.whisker:apache-whisker-plugin4maven.
	at org.apache.maven.tools.plugin.scanner.DefaultMojoScanner.populatePluginDescriptor(DefaultMojoScanner.java:126)
	at org.apache.maven.plugin.plugin.AbstractGeneratorMojo.execute(AbstractGeneratorMojo.java:233)
	... 34 more
[ERROR] 
[ERROR] Re-run Maven using the -X switch to enable full debug logging.
[ERROR] 
[ERROR] For more information about the errors and possible solutions, please read the following
articles:
[ERROR] [Help 1] http://cwiki.apache.org/confluence/display/MAVEN/MojoExecutionException
[ERROR] 
[ERROR] After correcting the problems, you can resume the build with the command
[ERROR]   mvn <goals> -rf :apache-whisker-plugin4maven

[JENKINS] Archiving <https://builds.apache.org/job/Creadur-Whisker/ws/pom.xml> to org.apache.creadur.whisker/apache-whisker/0.2-SNAPSHOT/apache-whisker-0.2-SNAPSHOT.pom
[JENKINS] Archiving <https://builds.apache.org/job/Creadur-Whisker/ws/target/apache-whisker-0.2-SNAPSHOT-site.xml>
to org.apache.creadur.whisker/apache-whisker/0.2-SNAPSHOT/apache-whisker-0.2-SNAPSHOT-site.xml
Sending artifact delta relative to Creadur-Whisker ? Apache Whisker #8
Archived 2 artifacts
Archive block size is 32768
Received 0 blocks and 20402 bytes
Compression is 0.0%
Took 0.16 sec
[JENKINS] Archiving <https://builds.apache.org/job/Creadur-Whisker/ws/apache-whisker-model/pom.xml>
to org.apache.creadur.whisker/apache-whisker-model/0.2-SNAPSHOT/apache-whisker-model-0.2-SNAPSHOT.pom
[JENKINS] Archiving <https://builds.apache.org/job/Creadur-Whisker/ws/apache-whisker-model/target/apache-whisker-model-0.2-SNAPSHOT.jar>
to org.apache.creadur.whisker/apache-whisker-model/0.2-SNAPSHOT/apache-whisker-model-0.2-SNAPSHOT.jar
Sending artifact delta relative to Creadur-Whisker ? Apache Whisker::Model #8
Archived 2 artifacts
Archive block size is 32768
Received 0 blocks and 29626 bytes
Compression is 0.0%
Took 99 ms
[JENKINS] Archiving <https://builds.apache.org/job/Creadur-Whisker/ws/apache-whisker-plugin4maven/pom.xml>
to org.apache.creadur.whisker/apache-whisker-plugin4maven/0.2-SNAPSHOT/apache-whisker-plugin4maven-0.2-SNAPSHOT.pom
No prior successful build to compare, so performing full copy of artifacts
[JENKINS] Archiving <https://builds.apache.org/job/Creadur-Whisker/ws/apache-whisker-xml/pom.xml>
to org.apache.creadur.whisker/apache-whisker-xml/0.2-SNAPSHOT/apache-whisker-xml-0.2-SNAPSHOT.pom
[JENKINS] Archiving <https://builds.apache.org/job/Creadur-Whisker/ws/apache-whisker-xml/target/apache-whisker-xml-0.2-SNAPSHOT.jar>
to org.apache.creadur.whisker/apache-whisker-xml/0.2-SNAPSHOT/apache-whisker-xml-0.2-SNAPSHOT.jar
Sending artifact delta relative to Creadur-Whisker ? Apache Whisker::XML #8
Archived 2 artifacts
Archive block size is 32768
Received 0 blocks and 18389 bytes
Compression is 0.0%
Took 85 ms
[JENKINS] Archiving <https://builds.apache.org/job/Creadur-Whisker/ws/apache-whisker-scan/pom.xml>
to org.apache.creadur.whisker/apache-whisker-scan/0.2-SNAPSHOT/apache-whisker-scan-0.2-SNAPSHOT.pom
[JENKINS] Archiving <https://builds.apache.org/job/Creadur-Whisker/ws/apache-whisker-scan/target/apache-whisker-scan-0.2-SNAPSHOT.jar>
to org.apache.creadur.whisker/apache-whisker-scan/0.2-SNAPSHOT/apache-whisker-scan-0.2-SNAPSHOT.jar
Sending artifact delta relative to Creadur-Whisker ? Apache Whisker::Scan #8
Archived 2 artifacts
Archive block size is 32768
Received 0 blocks and 15285 bytes
Compression is 0.0%
Took 0.12 sec
[JENKINS] Archiving <https://builds.apache.org/job/Creadur-Whisker/ws/apache-whisker-app/pom.xml>
to org.apache.creadur.whisker/apache-whisker-app/0.2-SNAPSHOT/apache-whisker-app-0.2-SNAPSHOT.pom
[JENKINS] Archiving <https://builds.apache.org/job/Creadur-Whisker/ws/apache-whisker-app/target/apache-whisker-app-0.2-SNAPSHOT.jar>
to org.apache.creadur.whisker/apache-whisker-app/0.2-SNAPSHOT/apache-whisker-app-0.2-SNAPSHOT.jar
Sending artifact delta relative to Creadur-Whisker ? Apache Whisker::App #8
Archived 2 artifacts
Archive block size is 32768
Received 0 blocks and 32952 bytes
Compression is 0.0%
Took 2 sec
[JENKINS] Archiving <https://builds.apache.org/job/Creadur-Whisker/ws/apache-whisker-cli/dependency-reduced-pom.xml>
to org.apache.creadur.whisker/apache-whisker-cli/0.2-SNAPSHOT/apache-whisker-cli-0.2-SNAPSHOT.pom
[JENKINS] Archiving <https://builds.apache.org/job/Creadur-Whisker/ws/apache-whisker-cli/target/apache-whisker-0.2-SNAPSHOT.jar>
to org.apache.creadur.whisker/apache-whisker-cli/0.2-SNAPSHOT/apache-whisker-cli-0.2-SNAPSHOT.jar
Sending artifact delta relative to Creadur-Whisker ? Apache Whisker::Command Line Interface
#8
Archived 2 artifacts
Archive block size is 32768
Received 0 blocks and 2240700 bytes
Compression is 0.0%
Took 0.81 sec
[JENKINS] Archiving <https://builds.apache.org/job/Creadur-Whisker/ws/apache-whisker-velocity/pom.xml>
to org.apache.creadur.whisker/apache-whisker-velocity/0.2-SNAPSHOT/apache-whisker-velocity-0.2-SNAPSHOT.pom
[JENKINS] Archiving <https://builds.apache.org/job/Creadur-Whisker/ws/apache-whisker-velocity/target/apache-whisker-velocity-0.2-SNAPSHOT.jar>
to org.apache.creadur.whisker/apache-whisker-velocity/0.2-SNAPSHOT/apache-whisker-velocity-0.2-SNAPSHOT.jar
Sending artifact delta relative to Creadur-Whisker ? Apache Whisker::Output(velocity) #8
Archived 2 artifacts
Archive block size is 32768
Received 0 blocks and 61531 bytes
Compression is 0.0%
Took 0.17 sec
channel stopped

Mime
View raw message