creadur-dev mailing list archives

Site index · List index
Message view « Date » · « Thread »
Top « Date » · « Thread »
From Apache Jenkins Server <jenk...@builds.apache.org>
Subject Build failed in Jenkins: Creadur-Whisker-Site #13
Date Fri, 22 Aug 2014 23:17:57 GMT
See <https://builds.apache.org/job/Creadur-Whisker-Site/13/changes>

Changes:

[pottlinger] WHISKER-12: MavenPluginErrors again

- Followed instructions from http://maven.apache.org/plugin-tools/maven-plugin-plugin/examples/using-annotations.html
to get rid of the mojo error.
- Extracted version number of mavenPluginPlugin, use it for maven-annotations as well to keep
these dependencies in sync.

------------------------------------------
[...truncated 341 lines...]
A         apache-whisker-xml/src/main/java/org/apache/creadur
A         apache-whisker-xml/src/main/java/org/apache/creadur/whisker
A         apache-whisker-xml/src/main/java/org/apache/creadur/whisker/fromxml
AU        apache-whisker-xml/src/main/java/org/apache/creadur/whisker/fromxml/MissingIDException.java
AU        apache-whisker-xml/src/main/java/org/apache/creadur/whisker/fromxml/InvalidXmlException.java
AU        apache-whisker-xml/src/main/java/org/apache/creadur/whisker/fromxml/UnexpectedElementException.java
AU        apache-whisker-xml/src/main/java/org/apache/creadur/whisker/fromxml/JDomBuilder.java
AU        apache-whisker-xml/src/main/java/org/apache/creadur/whisker/fromxml/DuplicateElementException.java
A         apache-whisker-xml/src/main/resources
A         apache-whisker-xml/src/site
A         apache-whisker-xml/src/site/resources
A         apache-whisker-xml/src/site/resources/css
AU        apache-whisker-xml/src/site/resources/css/site.css
AU        apache-whisker-xml/src/site/site.xml
A         apache-whisker-xml/src/test
A         apache-whisker-xml/src/test/java
A         apache-whisker-xml/src/test/java/org
A         apache-whisker-xml/src/test/java/org/apache
A         apache-whisker-xml/src/test/java/org/apache/creadur
A         apache-whisker-xml/src/test/java/org/apache/creadur/whisker
A         apache-whisker-xml/src/test/java/org/apache/creadur/whisker/fromxml
AU        apache-whisker-xml/src/test/java/org/apache/creadur/whisker/fromxml/JDomBuilderOrganisationTest.java
AU        apache-whisker-xml/src/test/java/org/apache/creadur/whisker/fromxml/JDomBuilderWithLicenseTest.java
AU        apache-whisker-xml/src/test/java/org/apache/creadur/whisker/fromxml/JDomBuilderWithDirectoryTest.java
AU        apache-whisker-xml/src/test/java/org/apache/creadur/whisker/fromxml/JDomBuilderLicenseTest.java
AU        apache-whisker-xml/src/test/java/org/apache/creadur/whisker/fromxml/JDomBuilderWorkTest.java
AU        apache-whisker-xml/src/test/java/org/apache/creadur/whisker/fromxml/JDomBuilderResourceTest.java
AU        apache-whisker-xml/src/test/java/org/apache/creadur/whisker/fromxml/JDomBuilderByOrganisationTest.java
AU        pom.xml
A         apache-whisker-scan
AU        apache-whisker-scan/pom.xml
AU        apache-whisker-scan/NOTICE
AU        apache-whisker-scan/LICENSE
A         apache-whisker-scan/src
A         apache-whisker-scan/src/main
A         apache-whisker-scan/src/main/java
A         apache-whisker-scan/src/main/java/org
A         apache-whisker-scan/src/main/java/org/apache
A         apache-whisker-scan/src/main/java/org/apache/creadur
A         apache-whisker-scan/src/main/java/org/apache/creadur/whisker
A         apache-whisker-scan/src/main/java/org/apache/creadur/whisker/scan
AU        apache-whisker-scan/src/main/java/org/apache/creadur/whisker/scan/FromFileSystem.java
AU        apache-whisker-scan/src/main/java/org/apache/creadur/whisker/scan/Directory.java
AU        apache-whisker-scan/src/main/java/org/apache/creadur/whisker/scan/package-info.java
A         apache-whisker-scan/src/main/resources
A         apache-whisker-scan/src/site
A         apache-whisker-scan/src/site/resources
A         apache-whisker-scan/src/site/resources/css
AU        apache-whisker-scan/src/site/resources/css/site.css
AU        apache-whisker-scan/src/site/site.xml
A         apache-whisker-scan/src/test
A         apache-whisker-scan/src/test/java
A         apache-whisker-scan/src/test/java/org
A         apache-whisker-scan/src/test/java/org/apache
A         apache-whisker-scan/src/test/java/org/apache/creadur
A         apache-whisker-scan/src/test/java/org/apache/creadur/whisker
 U        .
At revision 1619951
Parsing POMs
maven3-agent.jar already up to date
maven3-interceptor.jar already up to date
maven3-interceptor-commons.jar already up to date
[Creadur-Whisker-Site] $ /home/jenkins/jenkins-slave/tools/hudson.model.JDK/jdk-1.8.0/bin/java
-cp /home/jenkins/jenkins-slave/maven3-agent.jar:/home/jenkins/tools/maven/apache-maven-3.0.4/boot/plexus-classworlds-2.4.jar
org.jvnet.hudson.maven3.agent.Maven3Main /home/jenkins/tools/maven/apache-maven-3.0.4 /x1/jenkins/jenkins-slave/slave.jar
/home/jenkins/jenkins-slave/maven3-interceptor.jar /home/jenkins/jenkins-slave/maven3-interceptor-commons.jar
57068
<===[JENKINS REMOTING CAPACITY]===>   channel started
log4j:WARN No appenders could be found for logger (org.apache.commons.beanutils.converters.BooleanConverter).
log4j:WARN Please initialize the log4j system properly.
Executing Maven:  -B -f <https://builds.apache.org/job/Creadur-Whisker-Site/ws/pom.xml>
-Dmaven.repo.local=/home/jenkins/jenkins-slave/maven-repositories/0 -e clean deploy site -Dmaven.test.skip=true
[INFO] Error stacktraces are turned on.
[INFO] Scanning for projects...
[INFO] ------------------------------------------------------------------------
[INFO] Reactor Build Order:
[INFO] 
[INFO] Apache Whisker
[INFO] Apache Whisker::Model
[INFO] Apache Whisker::Scan
[INFO] Apache Whisker::XML
[INFO] Apache Whisker::App
[INFO] Apache Whisker::Output(velocity)
[INFO] Apache Whisker::Command Line Interface
[INFO] Apache Whisker::Plugin(Maven)
[INFO]                                                                         
[INFO] ------------------------------------------------------------------------
[INFO] Building Apache Whisker 0.2-SNAPSHOT
[INFO] ------------------------------------------------------------------------
[INFO] 
[INFO] --- maven-clean-plugin:2.5:clean (default-clean) @ apache-whisker ---
[INFO] 
[INFO] --- maven-remote-resources-plugin:1.5:process (default) @ apache-whisker ---
[INFO] 
[INFO] --- maven-site-plugin:3.4:attach-descriptor (attach-descriptor) @ apache-whisker ---
[INFO] 
[INFO] --- maven-install-plugin:2.5.1:install (default-install) @ apache-whisker ---
[INFO] Installing <https://builds.apache.org/job/Creadur-Whisker-Site/ws/pom.xml> to
/home/jenkins/jenkins-slave/maven-repositories/0/org/apache/creadur/whisker/apache-whisker/0.2-SNAPSHOT/apache-whisker-0.2-SNAPSHOT.pom
[INFO] Installing <https://builds.apache.org/job/Creadur-Whisker-Site/ws/target/apache-whisker-0.2-SNAPSHOT-site.xml>
to /home/jenkins/jenkins-slave/maven-repositories/0/org/apache/creadur/whisker/apache-whisker/0.2-SNAPSHOT/apache-whisker-0.2-SNAPSHOT-site.xml
[INFO] 
[INFO] --- maven-deploy-plugin:2.8.1:deploy (default-deploy) @ apache-whisker ---
Downloading: https://repository.apache.org/content/repositories/snapshots/org/apache/creadur/whisker/apache-whisker/0.2-SNAPSHOT/maven-metadata.xml
Downloaded: https://repository.apache.org/content/repositories/snapshots/org/apache/creadur/whisker/apache-whisker/0.2-SNAPSHOT/maven-metadata.xml
(822 B at 1.3 KB/sec)
Uploading: https://repository.apache.org/content/repositories/snapshots/org/apache/creadur/whisker/apache-whisker/0.2-SNAPSHOT/apache-whisker-0.2-20140822.231737-9.pom
Uploaded: https://repository.apache.org/content/repositories/snapshots/org/apache/creadur/whisker/apache-whisker/0.2-SNAPSHOT/apache-whisker-0.2-20140822.231737-9.pom
(14 KB at 159.1 KB/sec)
Downloading: https://repository.apache.org/content/repositories/snapshots/org/apache/creadur/whisker/apache-whisker/maven-metadata.xml
Downloaded: https://repository.apache.org/content/repositories/snapshots/org/apache/creadur/whisker/apache-whisker/maven-metadata.xml
(298 B at 10.0 KB/sec)
Uploading: https://repository.apache.org/content/repositories/snapshots/org/apache/creadur/whisker/apache-whisker/0.2-SNAPSHOT/maven-metadata.xml
Uploaded: https://repository.apache.org/content/repositories/snapshots/org/apache/creadur/whisker/apache-whisker/0.2-SNAPSHOT/maven-metadata.xml
(822 B at 14.9 KB/sec)
Uploading: https://repository.apache.org/content/repositories/snapshots/org/apache/creadur/whisker/apache-whisker/maven-metadata.xml
Uploaded: https://repository.apache.org/content/repositories/snapshots/org/apache/creadur/whisker/apache-whisker/maven-metadata.xml
(298 B at 6.1 KB/sec)
Uploading: https://repository.apache.org/content/repositories/snapshots/org/apache/creadur/whisker/apache-whisker/0.2-SNAPSHOT/apache-whisker-0.2-20140822.231737-9-site.xml
Uploaded: https://repository.apache.org/content/repositories/snapshots/org/apache/creadur/whisker/apache-whisker/0.2-SNAPSHOT/apache-whisker-0.2-20140822.231737-9-site.xml
(6 KB at 28.0 KB/sec)
Uploading: https://repository.apache.org/content/repositories/snapshots/org/apache/creadur/whisker/apache-whisker/0.2-SNAPSHOT/maven-metadata.xml
Uploaded: https://repository.apache.org/content/repositories/snapshots/org/apache/creadur/whisker/apache-whisker/0.2-SNAPSHOT/maven-metadata.xml
(822 B at 16.1 KB/sec)
[INFO] 
[INFO] --- maven-site-plugin:3.4:site (default-site) @ apache-whisker ---
[INFO] configuring report plugin org.apache.rat:apache-rat-plugin:0.10
[INFO] configuring report plugin org.apache.maven.plugins:maven-checkstyle-plugin:2.12.1
[INFO] configuring report plugin org.apache.maven.plugins:maven-javadoc-plugin:2.9.1
[INFO] preparing 'aggregate' report requires 'generate-sources' forked phase execution
[INFO]                                                                         
[INFO] >>>>>>>>>>>>>>>>>>>>>>>>>>>>>>>>>>>>>>>>>>>>>>>>>>>>>>>>>>>>>>>>>>>>>>>>
[INFO] Forking Apache Whisker::Plugin(Maven) 0.2-SNAPSHOT
[INFO] >>>>>>>>>>>>>>>>>>>>>>>>>>>>>>>>>>>>>>>>>>>>>>>>>>>>>>>>>>>>>>>>>>>>>>>>
Downloading: http://repository.apache.org/snapshots/org/apache/creadur/whisker/apache-whisker-scan/0.2-SNAPSHOT/maven-metadata.xml
Downloading: http://repository.apache.org/snapshots/org/apache/creadur/whisker/apache-whisker-model/0.2-SNAPSHOT/maven-metadata.xml
Downloading: http://repository.apache.org/snapshots/org/apache/creadur/whisker/apache-whisker-app/0.2-SNAPSHOT/maven-metadata.xml
Downloading: http://repository.apache.org/snapshots/org/apache/creadur/whisker/apache-whisker-xml/0.2-SNAPSHOT/maven-metadata.xml
Downloading: http://repository.apache.org/snapshots/org/apache/creadur/whisker/apache-whisker-velocity/0.2-SNAPSHOT/maven-metadata.xml
Downloading: http://repo.maven.apache.org/maven2/org/apache/maven/maven-plugin-api/3.2.3/maven-plugin-api-3.2.3.jar
Downloading: http://repo.maven.apache.org/maven2/org/apache/maven/maven-model/3.2.3/maven-model-3.2.3.jar
Downloading: http://repo.maven.apache.org/maven2/org/apache/maven/maven-artifact/3.2.3/maven-artifact-3.2.3.jar
Downloaded: http://repo.maven.apache.org/maven2/org/apache/maven/maven-plugin-api/3.2.3/maven-plugin-api-3.2.3.jar
(45 KB at 248.2 KB/sec)
Downloaded: http://repo.maven.apache.org/maven2/org/apache/maven/maven-artifact/3.2.3/maven-artifact-3.2.3.jar
(53 KB at 293.1 KB/sec)
Downloaded: http://repo.maven.apache.org/maven2/org/apache/maven/maven-model/3.2.3/maven-model-3.2.3.jar
(157 KB at 498.7 KB/sec)
Downloading: http://repository.apache.org/snapshots/org/apache/creadur/whisker/apache-whisker-scan/0.2-SNAPSHOT/apache-whisker-scan-0.2-SNAPSHOT.jar
Downloading: http://repository.apache.org/snapshots/org/apache/creadur/whisker/apache-whisker-model/0.2-SNAPSHOT/apache-whisker-model-0.2-SNAPSHOT.jar
Downloading: http://repository.apache.org/snapshots/org/apache/creadur/whisker/apache-whisker-xml/0.2-SNAPSHOT/apache-whisker-xml-0.2-SNAPSHOT.jar
Downloading: http://repository.apache.org/snapshots/org/apache/creadur/whisker/apache-whisker-app/0.2-SNAPSHOT/apache-whisker-app-0.2-SNAPSHOT.jar
Downloading: http://repository.apache.org/snapshots/org/apache/creadur/whisker/apache-whisker-velocity/0.2-SNAPSHOT/apache-whisker-velocity-0.2-SNAPSHOT.jar
[INFO] ------------------------------------------------------------------------
[INFO] Reactor Summary:
[INFO] 
[INFO] Apache Whisker .................................... FAILURE [21.460s]
[INFO] Apache Whisker::Model ............................. SKIPPED
[INFO] Apache Whisker::Scan .............................. SKIPPED
[INFO] Apache Whisker::XML ............................... SKIPPED
[INFO] Apache Whisker::App ............................... SKIPPED
[INFO] Apache Whisker::Output(velocity) .................. SKIPPED
[INFO] Apache Whisker::Command Line Interface ............ SKIPPED
[INFO] Apache Whisker::Plugin(Maven) ..................... SKIPPED
[INFO] ------------------------------------------------------------------------
[INFO] BUILD FAILURE
[INFO] ------------------------------------------------------------------------
[INFO] Total time: 23.774s
[INFO] Finished at: Fri Aug 22 23:17:43 UTC 2014
[INFO] Final Memory: 25M/101M
[INFO] ------------------------------------------------------------------------
Waiting for Jenkins to finish collecting data[ERROR] Failed to execute goal org.apache.maven.plugins:maven-site-plugin:3.4:site
(default-site) on project apache-whisker: failed to get report for org.apache.maven.plugins:maven-javadoc-plugin:
Failed to execute goal on project apache-whisker-plugin4maven: Could not resolve dependencies
for project org.apache.creadur.whisker:apache-whisker-plugin4maven:maven-plugin:0.2-SNAPSHOT:
The following artifacts could not be resolved: org.apache.creadur.whisker:apache-whisker-scan:jar:0.2-SNAPSHOT,
org.apache.creadur.whisker:apache-whisker-model:jar:0.2-SNAPSHOT, org.apache.creadur.whisker:apache-whisker-app:jar:0.2-SNAPSHOT,
org.apache.creadur.whisker:apache-whisker-xml:jar:0.2-SNAPSHOT, org.apache.creadur.whisker:apache-whisker-velocity:jar:0.2-SNAPSHOT:
Could not find artifact org.apache.creadur.whisker:apache-whisker-scan:jar:0.2-SNAPSHOT in
Nexus (http://repository.apache.org/snapshots) -> [Help 1]
org.apache.maven.lifecycle.LifecycleExecutionException: Failed to execute goal org.apache.maven.plugins:maven-site-plugin:3.4:site
(default-site) on project apache-whisker: failed to get report for org.apache.maven.plugins:maven-javadoc-plugin
	at org.apache.maven.lifecycle.internal.MojoExecutor.execute(MojoExecutor.java:217)
	at org.apache.maven.lifecycle.internal.MojoExecutor.execute(MojoExecutor.java:153)
	at org.apache.maven.lifecycle.internal.MojoExecutor.execute(MojoExecutor.java:145)
	at org.apache.maven.lifecycle.internal.LifecycleModuleBuilder.buildProject(LifecycleModuleBuilder.java:84)
	at org.apache.maven.lifecycle.internal.LifecycleModuleBuilder.buildProject(LifecycleModuleBuilder.java:59)
	at org.apache.maven.lifecycle.internal.LifecycleStarter.singleThreadedBuild(LifecycleStarter.java:183)
	at org.apache.maven.lifecycle.internal.LifecycleStarter.execute(LifecycleStarter.java:161)
	at org.apache.maven.DefaultMaven.doExecute(DefaultMaven.java:320)
	at org.apache.maven.DefaultMaven.execute(DefaultMaven.java:156)
	at org.jvnet.hudson.maven3.launcher.Maven3Launcher.main(Maven3Launcher.java:117)
	at sun.reflect.NativeMethodAccessorImpl.invoke0(Native Method)
	at sun.reflect.NativeMethodAccessorImpl.invoke(NativeMethodAccessorImpl.java:62)
	at sun.reflect.DelegatingMethodAccessorImpl.invoke(DelegatingMethodAccessorImpl.java:43)
	at java.lang.reflect.Method.invoke(Method.java:483)
	at org.codehaus.plexus.classworlds.launcher.Launcher.launchStandard(Launcher.java:329)
	at org.codehaus.plexus.classworlds.launcher.Launcher.launch(Launcher.java:239)
	at org.jvnet.hudson.maven3.agent.Maven3Main.launch(Maven3Main.java:178)
	at sun.reflect.NativeMethodAccessorImpl.invoke0(Native Method)
	at sun.reflect.NativeMethodAccessorImpl.invoke(NativeMethodAccessorImpl.java:62)
	at sun.reflect.DelegatingMethodAccessorImpl.invoke(DelegatingMethodAccessorImpl.java:43)
	at java.lang.reflect.Method.invoke(Method.java:483)
	at hudson.maven.Maven3Builder.call(Maven3Builder.java:134)
	at hudson.maven.Maven3Builder.call(Maven3Builder.java:69)
	at hudson.remoting.UserRequest.perform(UserRequest.java:118)
	at hudson.remoting.UserRequest.perform(UserRequest.java:48)
	at hudson.remoting.Request$2.run(Request.java:328)
	at hudson.remoting.InterceptingExecutorService$1.call(InterceptingExecutorService.java:72)
	at java.util.concurrent.FutureTask.run(FutureTask.java:266)
	at java.util.concurrent.ThreadPoolExecutor.runWorker(ThreadPoolExecutor.java:1142)
	at java.util.concurrent.ThreadPoolExecutor$Worker.run(ThreadPoolExecutor.java:617)
	at java.lang.Thread.run(Thread.java:745)
Caused by: org.apache.maven.plugin.MojoExecutionException: failed to get report for org.apache.maven.plugins:maven-javadoc-plugin
	at org.apache.maven.reporting.exec.DefaultMavenReportExecutor.buildMavenReports(DefaultMavenReportExecutor.java:156)
	at org.apache.maven.plugins.site.render.AbstractSiteRenderingMojo.getReports(AbstractSiteRenderingMojo.java:239)
	at org.apache.maven.plugins.site.render.SiteMojo.execute(SiteMojo.java:124)
	at org.apache.maven.plugin.DefaultBuildPluginManager.executeMojo(DefaultBuildPluginManager.java:101)
	at org.apache.maven.lifecycle.internal.MojoExecutor.execute(MojoExecutor.java:209)
	... 30 more
Caused by: org.apache.maven.lifecycle.LifecycleExecutionException: Failed to execute goal
on project apache-whisker-plugin4maven: Could not resolve dependencies for project org.apache.creadur.whisker:apache-whisker-plugin4maven:maven-plugin:0.2-SNAPSHOT:
The following artifacts could not be resolved: org.apache.creadur.whisker:apache-whisker-scan:jar:0.2-SNAPSHOT,
org.apache.creadur.whisker:apache-whisker-model:jar:0.2-SNAPSHOT, org.apache.creadur.whisker:apache-whisker-app:jar:0.2-SNAPSHOT,
org.apache.creadur.whisker:apache-whisker-xml:jar:0.2-SNAPSHOT, org.apache.creadur.whisker:apache-whisker-velocity:jar:0.2-SNAPSHOT:
Could not find artifact org.apache.creadur.whisker:apache-whisker-scan:jar:0.2-SNAPSHOT in
Nexus (http://repository.apache.org/snapshots)
	at org.apache.maven.lifecycle.internal.LifecycleDependencyResolver.getDependencies(LifecycleDependencyResolver.java:210)
	at org.apache.maven.lifecycle.internal.LifecycleDependencyResolver.resolveProjectDependencies(LifecycleDependencyResolver.java:117)
	at org.apache.maven.lifecycle.internal.MojoExecutor.ensureDependenciesAreResolved(MojoExecutor.java:258)
	at org.apache.maven.lifecycle.internal.MojoExecutor.execute(MojoExecutor.java:201)
	at org.apache.maven.lifecycle.internal.MojoExecutor.execute(MojoExecutor.java:153)
	at org.apache.maven.lifecycle.internal.MojoExecutor.execute(MojoExecutor.java:145)
	at org.apache.maven.lifecycle.internal.MojoExecutor.executeForkedExecutions(MojoExecutor.java:365)
	at org.apache.maven.lifecycle.DefaultLifecycleExecutor.executeForkedExecutions(DefaultLifecycleExecutor.java:173)
	at org.apache.maven.reporting.exec.DefaultMavenReportExecutor.buildReportPlugin(DefaultMavenReportExecutor.java:309)
	at org.apache.maven.reporting.exec.DefaultMavenReportExecutor.buildMavenReports(DefaultMavenReportExecutor.java:151)
	... 34 more
Caused by: org.apache.maven.project.DependencyResolutionException: Could not resolve dependencies
for project org.apache.creadur.whisker:apache-whisker-plugin4maven:maven-plugin:0.2-SNAPSHOT:
The following artifacts could not be resolved: org.apache.creadur.whisker:apache-whisker-scan:jar:0.2-SNAPSHOT,
org.apache.creadur.whisker:apache-whisker-model:jar:0.2-SNAPSHOT, org.apache.creadur.whisker:apache-whisker-app:jar:0.2-SNAPSHOT,
org.apache.creadur.whisker:apache-whisker-xml:jar:0.2-SNAPSHOT, org.apache.creadur.whisker:apache-whisker-velocity:jar:0.2-SNAPSHOT:
Could not find artifact org.apache.creadur.whisker:apache-whisker-scan:jar:0.2-SNAPSHOT in
Nexus (http://repository.apache.org/snapshots)
	at org.apache.maven.project.DefaultProjectDependenciesResolver.resolve(DefaultProjectDependenciesResolver.java:189)
	at org.apache.maven.lifecycle.internal.LifecycleDependencyResolver.getDependencies(LifecycleDependencyResolver.java:185)
	... 43 more
Caused by: org.sonatype.aether.resolution.DependencyResolutionException: The following artifacts
could not be resolved: org.apache.creadur.whisker:apache-whisker-scan:jar:0.2-SNAPSHOT, org.apache.creadur.whisker:apache-whisker-model:jar:0.2-SNAPSHOT,
org.apache.creadur.whisker:apache-whisker-app:jar:0.2-SNAPSHOT, org.apache.creadur.whisker:apache-whisker-xml:jar:0.2-SNAPSHOT,
org.apache.creadur.whisker:apache-whisker-velocity:jar:0.2-SNAPSHOT: Could not find artifact
org.apache.creadur.whisker:apache-whisker-scan:jar:0.2-SNAPSHOT in Nexus (http://repository.apache.org/snapshots)
	at org.sonatype.aether.impl.internal.DefaultRepositorySystem.resolveDependencies(DefaultRepositorySystem.java:375)
	at org.apache.maven.project.DefaultProjectDependenciesResolver.resolve(DefaultProjectDependenciesResolver.java:183)
	... 44 more
Caused by: org.sonatype.aether.resolution.ArtifactResolutionException: The following artifacts
could not be resolved: org.apache.creadur.whisker:apache-whisker-scan:jar:0.2-SNAPSHOT, org.apache.creadur.whisker:apache-whisker-model:jar:0.2-SNAPSHOT,
org.apache.creadur.whisker:apache-whisker-app:jar:0.2-SNAPSHOT, org.apache.creadur.whisker:apache-whisker-xml:jar:0.2-SNAPSHOT,
org.apache.creadur.whisker:apache-whisker-velocity:jar:0.2-SNAPSHOT: Could not find artifact
org.apache.creadur.whisker:apache-whisker-scan:jar:0.2-SNAPSHOT in Nexus (http://repository.apache.org/snapshots)
	at org.sonatype.aether.impl.internal.DefaultArtifactResolver.resolve(DefaultArtifactResolver.java:538)
	at org.sonatype.aether.impl.internal.DefaultArtifactResolver.resolveArtifacts(DefaultArtifactResolver.java:216)
	at org.sonatype.aether.impl.internal.DefaultRepositorySystem.resolveDependencies(DefaultRepositorySystem.java:358)
	... 45 more
Caused by: org.sonatype.aether.transfer.ArtifactNotFoundException: Could not find artifact
org.apache.creadur.whisker:apache-whisker-scan:jar:0.2-SNAPSHOT in Nexus (http://repository.apache.org/snapshots)
	at org.sonatype.aether.connector.wagon.WagonRepositoryConnector$4.wrap(WagonRepositoryConnector.java:947)
	at org.sonatype.aether.connector.wagon.WagonRepositoryConnector$4.wrap(WagonRepositoryConnector.java:941)
	at org.sonatype.aether.connector.wagon.WagonRepositoryConnector$GetTask.run(WagonRepositoryConnector.java:669)
	at org.sonatype.aether.util.concurrency.RunnableErrorForwarder$1.run(RunnableErrorForwarder.java:60)
	... 3 more
[ERROR] 
[ERROR] Re-run Maven using the -X switch to enable full debug logging.
[ERROR] 
[ERROR] For more information about the errors and possible solutions, please read the following
articles:
[ERROR] [Help 1] http://cwiki.apache.org/confluence/display/MAVEN/MojoExecutionException

[JENKINS] Archiving <https://builds.apache.org/job/Creadur-Whisker-Site/ws/pom.xml>
to org.apache.creadur.whisker/apache-whisker/0.2-SNAPSHOT/apache-whisker-0.2-SNAPSHOT.pom
[JENKINS] Archiving <https://builds.apache.org/job/Creadur-Whisker-Site/ws/target/apache-whisker-0.2-SNAPSHOT-site.xml>
to org.apache.creadur.whisker/apache-whisker/0.2-20140822.231737-9/apache-whisker-0.2-20140822.231737-9-site.xml
No prior successful build to compare, so performing full copy of artifacts
[JENKINS] Archiving <https://builds.apache.org/job/Creadur-Whisker-Site/ws/apache-whisker-model/pom.xml>
to org.apache.creadur.whisker/apache-whisker-model/0.2-SNAPSHOT/apache-whisker-model-0.2-SNAPSHOT.pom
No prior successful build to compare, so performing full copy of artifacts
[JENKINS] Archiving <https://builds.apache.org/job/Creadur-Whisker-Site/ws/apache-whisker-plugin4maven/pom.xml>
to org.apache.creadur.whisker/apache-whisker-plugin4maven/0.2-SNAPSHOT/apache-whisker-plugin4maven-0.2-SNAPSHOT.pom
No prior successful build to compare, so performing full copy of artifacts
[JENKINS] Archiving <https://builds.apache.org/job/Creadur-Whisker-Site/ws/apache-whisker-xml/pom.xml>
to org.apache.creadur.whisker/apache-whisker-xml/0.2-SNAPSHOT/apache-whisker-xml-0.2-SNAPSHOT.pom
No prior successful build to compare, so performing full copy of artifacts
[JENKINS] Archiving <https://builds.apache.org/job/Creadur-Whisker-Site/ws/apache-whisker-scan/pom.xml>
to org.apache.creadur.whisker/apache-whisker-scan/0.2-SNAPSHOT/apache-whisker-scan-0.2-SNAPSHOT.pom
No prior successful build to compare, so performing full copy of artifacts
[JENKINS] Archiving <https://builds.apache.org/job/Creadur-Whisker-Site/ws/apache-whisker-app/pom.xml>
to org.apache.creadur.whisker/apache-whisker-app/0.2-SNAPSHOT/apache-whisker-app-0.2-SNAPSHOT.pom
No prior successful build to compare, so performing full copy of artifacts
[JENKINS] Archiving <https://builds.apache.org/job/Creadur-Whisker-Site/ws/apache-whisker-cli/pom.xml>
to org.apache.creadur.whisker/apache-whisker-cli/0.2-SNAPSHOT/apache-whisker-cli-0.2-SNAPSHOT.pom
No prior successful build to compare, so performing full copy of artifacts
[JENKINS] Archiving <https://builds.apache.org/job/Creadur-Whisker-Site/ws/apache-whisker-velocity/pom.xml>
to org.apache.creadur.whisker/apache-whisker-velocity/0.2-SNAPSHOT/apache-whisker-velocity-0.2-SNAPSHOT.pom
No prior successful build to compare, so performing full copy of artifacts
channel stopped

Mime
View raw message