creadur-dev mailing list archives

Site index · List index
Message view « Date » · « Thread »
Top « Date » · « Thread »
From Apache Jenkins Server <jenk...@builds.apache.org>
Subject Build failed in Jenkins: Creadur-Rat-ParentPom #1
Date Thu, 21 Aug 2014 08:02:59 GMT
See <https://builds.apache.org/job/Creadur-Rat-ParentPom/1/>

------------------------------------------
[...truncated 281 lines...]
A         apache-rat-core\src\test\resources\javadocs
AU        apache-rat-core\src\test\resources\javadocs\index.html
AU        apache-rat-core\src\test\resources\javadocs\notjavadoc.html
AU        apache-rat-core\src\test\resources\javadocs\ArchiveElement.html
A         apache-rat-core\src\main
A         apache-rat-core\src\main\java
A         apache-rat-core\src\main\java\org
A         apache-rat-core\src\main\java\org\apache
A         apache-rat-core\src\main\java\org\apache\rat
AU        apache-rat-core\src\main\java\org\apache\rat\ReportTransformer.java
A         apache-rat-core\src\main\java\org\apache\rat\document
AU        apache-rat-core\src\main\java\org\apache\rat\document\UnsuitableDocumentException.java
AU        apache-rat-core\src\main\java\org\apache\rat\document\CompositeDocumentException.java
A         apache-rat-core\src\main\java\org\apache\rat\document\impl
AU        apache-rat-core\src\main\java\org\apache\rat\document\impl\DocumentImplUtils.java
AU        apache-rat-core\src\main\java\org\apache\rat\document\impl\ArchiveEntryDocument.java
AU        apache-rat-core\src\main\java\org\apache\rat\document\impl\MonolithicFileDocument.java
AU        apache-rat-core\src\main\java\org\apache\rat\document\impl\AbstractMonolithicDocument.java
A         apache-rat-core\src\main\java\org\apache\rat\document\impl\guesser
AU        apache-rat-core\src\main\java\org\apache\rat\document\impl\guesser\BinaryGuesser.java
AU        apache-rat-core\src\main\java\org\apache\rat\document\impl\guesser\NoteGuesser.java
AU        apache-rat-core\src\main\java\org\apache\rat\document\impl\guesser\GuessUtils.java
AU        apache-rat-core\src\main\java\org\apache\rat\document\impl\guesser\ArchiveGuesser.java
A         apache-rat-core\src\main\java\org\apache\rat\document\impl\util
AU        apache-rat-core\src\main\java\org\apache\rat\document\impl\util\DocumentAnalyserMultiplexer.java
AU        apache-rat-core\src\main\java\org\apache\rat\document\impl\FileDocument.java
AU        apache-rat-core\src\main\java\org\apache\rat\document\IDocumentAnalyser.java
AU        apache-rat-core\src\main\java\org\apache\rat\document\ToNameTransformer.java
AU        apache-rat-core\src\main\java\org\apache\rat\document\RatDocumentAnalysisException.java
A         apache-rat-core\src\main\java\org\apache\rat\policy
AU        apache-rat-core\src\main\java\org\apache\rat\policy\DefaultPolicy.java
A         apache-rat-core\src\main\java\org\apache\rat\license
AU        apache-rat-core\src\main\java\org\apache\rat\license\Apache20LicenseFamily.java
AU        apache-rat-core\src\main\java\org\apache\rat\license\GPL1LicenseFamily.java
AU        apache-rat-core\src\main\java\org\apache\rat\license\GPL2LicenseFamily.java
AU        apache-rat-core\src\main\java\org\apache\rat\license\GPL3LicenseFamily.java
AU        apache-rat-core\src\main\java\org\apache\rat\license\CDDL1LicenseFamily.java
AU        apache-rat-core\src\main\java\org\apache\rat\license\W3CSoftwareLicenseFamily.java
AU        apache-rat-core\src\main\java\org\apache\rat\license\ILicenseFamily.java
AU        apache-rat-core\src\main\java\org\apache\rat\license\MITLicenseFamily.java
AU        apache-rat-core\src\main\java\org\apache\rat\license\ModifiedBSDLicenseFamily.java
AU        apache-rat-core\src\main\java\org\apache\rat\license\SimpleLicenseFamily.java
AU        apache-rat-core\src\main\java\org\apache\rat\license\AcademicFree21LicenseFamily.java
AU        apache-rat-core\src\main\java\org\apache\rat\license\W3CDocumentLicenseFamily.java
AU        apache-rat-core\src\main\java\org\apache\rat\license\OASISLicenseFamily.java
AU        apache-rat-core\src\main\java\org\apache\rat\ReportConfiguration.java
AU        apache-rat-core\src\main\java\org\apache\rat\ReportFailedRuntimeException.java
A         apache-rat-core\src\main\java\org\apache\rat\analysis
AU        apache-rat-core\src\main\java\org\apache\rat\analysis\DefaultAnalyserFactory.java
A         apache-rat-core\src\main\java\org\apache\rat\analysis\generation
AU        apache-rat-core\src\main\java\org\apache\rat\analysis\generation\JavaDocLicenseNotRequired.java
AU        apache-rat-core\src\main\java\org\apache\rat\analysis\generation\GeneratedLicenseNotRequired.java
A         apache-rat-core\src\main\java\org\apache\rat\analysis\util
AU        apache-rat-core\src\main\java\org\apache\rat\analysis\util\HeaderMatcherMultiplexer.java
AU        apache-rat-core\src\main\java\org\apache\rat\analysis\HeaderCheckWorker.java
AU        apache-rat-core\src\main\java\org\apache\rat\analysis\RatHeaderAnalysisException.java
A         apache-rat-core\src\main\java\org\apache\rat\analysis\license
AU        apache-rat-core\src\main\java\org\apache\rat\analysis\license\MITLicense.java
AU        apache-rat-core\src\main\java\org\apache\rat\analysis\license\W3CLicense.java
AU        apache-rat-core\src\main\java\org\apache\rat\analysis\license\AppliedApacheSoftwareLicense20.java
AU        apache-rat-core\src\main\java\org\apache\rat\analysis\license\ApacheSoftwareLicense20.java
AU        apache-rat-core\src\main\java\org\apache\rat\analysis\license\TMF854LicenseHeader.java
AU        apache-rat-core\src\main\java\org\apache\rat\analysis\license\GPL1License.java
AU        apache-rat-core\src\main\java\org\apache\rat\analysis\license\DojoLicenseHeader.java
AU        apache-rat-core\src\main\java\org\apache\rat\analysis\license\GPL2License.java
AU        apache-rat-core\src\main\java\org\apache\rat\analysis\license\GPL3License.java
AU        apache-rat-core\src\main\java\org\apache\rat\analysis\license\BaseLicense.java
AU        apache-rat-core\src\main\java\org\apache\rat\analysis\license\CopyrightHeader.java
AU        apache-rat-core\src\main\java\org\apache\rat\analysis\license\OASISLicense.java
AU        apache-rat-core\src\main\java\org\apache\rat\analysis\license\FullTextMatchingLicense.java
AU        apache-rat-core\src\main\java\org\apache\rat\analysis\license\W3CDocLicense.java
AU        apache-rat-core\src\main\java\org\apache\rat\analysis\license\SimplePatternBasedLicense.java
AU        apache-rat-core\src\main\java\org\apache\rat\analysis\license\CDDL1License.java
AU        apache-rat-core\src\main\java\org\apache\rat\analysis\RatReportAnalysisResultException.java
AU        apache-rat-core\src\main\java\org\apache\rat\analysis\IHeaderMatcher.java
AU        apache-rat-core\src\main\java\org\apache\rat\analysis\DocumentHeaderAnalyser.java
A         apache-rat-core\src\main\java\org\apache\rat\walker
AU        apache-rat-core\src\main\java\org\apache\rat\walker\DirectoryWalker.java
AU        apache-rat-core\src\main\java\org\apache\rat\walker\Walker.java
AU        apache-rat-core\src\main\java\org\apache\rat\walker\ArchiveWalker.java
AU        apache-rat-core\src\main\java\org\apache\rat\walker\FileNameComparator.java
AU        apache-rat-core\src\main\java\org\apache\rat\Defaults.java
A         apache-rat-core\src\main\java\org\apache\rat\header
AU        apache-rat-core\src\main\java\org\apache\rat\header\HeaderMatcher.java
AU        apache-rat-core\src\main\java\org\apache\rat\header\HeaderBean.java
AU        apache-rat-core\src\main\java\org\apache\rat\header\ArrayCharFilter.java
AU        apache-rat-core\src\main\java\org\apache\rat\header\CharFilter.java
AU        apache-rat-core\src\main\java\org\apache\rat\header\FilteringSequenceFactory.java
A         apache-rat-core\src\main\java\org\apache\rat\api
AU        apache-rat-core\src\main\java\org\apache\rat\api\MimeTyper.java
AU        apache-rat-core\src\main\java\org\apache\rat\api\ContentType.java
AU        apache-rat-core\src\main\java\org\apache\rat\api\Document.java
AU        apache-rat-core\src\main\java\org\apache\rat\api\package.html
AU        apache-rat-core\src\main\java\org\apache\rat\api\MetaData.java
AU        apache-rat-core\src\main\java\org\apache\rat\api\RatException.java
A         apache-rat-core\src\main\java\org\apache\rat\annotation
AU        apache-rat-core\src\main\java\org\apache\rat\annotation\ApacheV2LicenceAppender.java
AU        apache-rat-core\src\main\java\org\apache\rat\annotation\AbstractLicenceAppender.java
AU        apache-rat-core\src\main\java\org\apache\rat\Report.java
A         apache-rat-core\src\main\java\org\apache\rat\report
AU        apache-rat-core\src\main\java\org\apache\rat\report\RatReport.java
A         apache-rat-core\src\main\java\org\apache\rat\report\claim
AU        apache-rat-core\src\main\java\org\apache\rat\report\claim\ClaimStatistic.java
A         apache-rat-core\src\main\java\org\apache\rat\report\claim\util
AU        apache-rat-core\src\main\java\org\apache\rat\report\claim\util\ClaimReporterMultiplexer.java
AU        apache-rat-core\src\main\java\org\apache\rat\report\claim\util\LicenseAddingReport.java
A         apache-rat-core\src\main\java\org\apache\rat\report\claim\impl
A         apache-rat-core\src\main\java\org\apache\rat\report\claim\impl\xml
AU        apache-rat-core\src\main\java\org\apache\rat\report\claim\impl\xml\SimpleXmlClaimReporter.java
AU        apache-rat-core\src\main\java\org\apache\rat\report\claim\impl\ClaimAggregator.java
AU        apache-rat-core\src\main\java\org\apache\rat\report\claim\impl\AbstractClaimReporter.java
AU        apache-rat-core\src\main\java\org\apache\rat\report\IReportable.java
A         apache-rat-core\src\main\java\org\apache\rat\report\analyser
AU        apache-rat-core\src\main\java\org\apache\rat\report\AbstractReport.java
A         apache-rat-core\src\main\java\org\apache\rat\report\xml
A         apache-rat-core\src\main\java\org\apache\rat\report\xml\writer
A         apache-rat-core\src\main\java\org\apache\rat\report\xml\writer\impl
A         apache-rat-core\src\main\java\org\apache\rat\report\xml\writer\impl\base
AU        apache-rat-core\src\main\java\org\apache\rat\report\xml\writer\impl\base\XmlWriter.java
AU        apache-rat-core\src\main\java\org\apache\rat\report\xml\writer\IXmlWriter.java
AU        apache-rat-core\src\main\java\org\apache\rat\report\xml\writer\InvalidXmlException.java
AU        apache-rat-core\src\main\java\org\apache\rat\report\xml\writer\OperationNotAllowedException.java
AU        apache-rat-core\src\main\java\org\apache\rat\report\xml\writer\XmlWriterUtils.java
AU        apache-rat-core\src\main\java\org\apache\rat\report\xml\XmlReportFactory.java
A         apache-rat-core\src\main\resources
A         apache-rat-core\src\main\resources\org
A         apache-rat-core\src\main\resources\org\apache
A         apache-rat-core\src\main\resources\org\apache\rat
AU        apache-rat-core\src\main\resources\org\apache\rat\plain-rat.xsl
A         apache-rat-core\src\site
A         apache-rat-core\src\site\resources
A         apache-rat-core\src\site\resources\css
AU        apache-rat-core\src\site\resources\css\site.css
AU        apache-rat-core\src\site\site.xml
A         apache-rat-core\src\site\apt
AU        apache-rat-core\src\site\apt\index.apt.vm
 U        .
At revision 1619306
Parsing POMs
Discovered a new module org.apache.rat:apache-rat-project Apache Creadur Rat
Modules changed, recalculating dependency graph
maven-agent.jar already up to date
classworlds.jar already up to date
maven-interceptor.jar already up to date
maven2.1-interceptor.jar already up to date
[Creadur-Rat-ParentPom] $ f:\jenkins\tools\\java\\latest-1.5-64/bin/java -cp f:\jenkins\jenkins-slave\maven-agent.jar;f:\jenkins\jenkins-slave\classworlds.jar
hudson.maven.agent.Main f:\jenkins\tools\maven\apache-maven-2.2.1 F:\jenkins\jenkins-slave\slave.jar
f:\jenkins\jenkins-slave\maven-interceptor.jar 63940 f:\jenkins\jenkins-slave\maven2.1-interceptor.jar
<===[JENKINS REMOTING CAPACITY]===>   channel started
ERROR: [JENKINS-18403] JDK 5 not supported to run Maven; retrying with slave Java and setting
compile/test properties to point to f:\jenkins\tools\\java\\latest-1.5-64
maven-agent.jar already up to date
classworlds.jar already up to date
maven-interceptor.jar already up to date
maven2.1-interceptor.jar already up to date
[Creadur-Rat-ParentPom] $ "C:\Program Files\Java\jre7/bin/java" -cp f:\jenkins\jenkins-slave\maven-agent.jar;f:\jenkins\jenkins-slave\classworlds.jar
hudson.maven.agent.Main f:\jenkins\tools\maven\apache-maven-2.2.1 F:\jenkins\jenkins-slave\slave.jar
f:\jenkins\jenkins-slave\maven-interceptor.jar 63942 f:\jenkins\jenkins-slave\maven2.1-interceptor.jar
<===[JENKINS REMOTING CAPACITY]===>   channel started
log4j:WARN No appenders could be found for logger (org.apache.commons.beanutils.converters.BooleanConverter).
log4j:WARN Please initialize the log4j system properly.
Executing Maven:  -B -f <https://builds.apache.org/job/Creadur-Rat-ParentPom/ws/pom.xml>
-Dmaven.repo.local=f:\jenkins\jenkins-slave\maven-repositories\1 clean install -N -e
+ Error stacktraces are turned on.
[INFO] Scanning for projects...
Downloading: http://repo1.maven.org/maven2/org/apache/maven/wagon/wagon-ssh/1.0-beta-7/wagon-ssh-1.0-beta-7.pom
2K downloaded  (wagon-ssh-1.0-beta-7.pom)
Downloading: http://repo1.maven.org/maven2/org/apache/maven/wagon/wagon-ssh/1.0-beta-7/wagon-ssh-1.0-beta-7.jar
27K downloaded  (wagon-ssh-1.0-beta-7.jar)
[INFO] ------------------------------------------------------------------------
[INFO] Building Apache Creadur Rat
[INFO]    task-segment: [clean, install]
[INFO] ------------------------------------------------------------------------
Downloading: http://repo1.maven.org/maven2/org/codehaus/mojo/animal-sniffer-maven-plugin/1.11/animal-sniffer-maven-plugin-1.11.pom
4K downloaded  (animal-sniffer-maven-plugin-1.11.pom)
Downloading: http://repo1.maven.org/maven2/org/codehaus/mojo/animal-sniffer-parent/1.11/animal-sniffer-parent-1.11.pom
4K downloaded  (animal-sniffer-parent-1.11.pom)
Downloading: http://repo1.maven.org/maven2/org/codehaus/mojo/animal-sniffer-maven-plugin/1.11/animal-sniffer-maven-plugin-1.11.jar
28K downloaded  (animal-sniffer-maven-plugin-1.11.jar)
[INFO] [clean:clean {execution: default-clean}]
[INFO] [enforcer:enforce {execution: enforce-bytecode-version}]
[INFO] [remote-resources:process {execution: default}]
Downloading: http://repo1.maven.org/maven2/org/codehaus/mojo/animal-sniffer/1.11/animal-sniffer-1.11.pom
2K downloaded  (animal-sniffer-1.11.pom)
Downloading: http://repo1.maven.org/maven2/org/ow2/asm/asm-all/4.0/asm-all-4.0.pom
1K downloaded  (asm-all-4.0.pom)
Downloading: http://repo1.maven.org/maven2/org/codehaus/mojo/java-boot-classpath-detector/1.11/java-boot-classpath-detector-1.11.pom
2K downloaded  (java-boot-classpath-detector-1.11.pom)
Downloading: http://repo1.maven.org/maven2/org/codehaus/mojo/animal-sniffer/1.11/animal-sniffer-1.11.jar
Downloading: http://repo1.maven.org/maven2/org/ow2/asm/asm-all/4.0/asm-all-4.0.jar
31K downloaded  (animal-sniffer-1.11.jar)
Downloading: http://repo1.maven.org/maven2/org/codehaus/mojo/java-boot-classpath-detector/1.11/java-boot-classpath-detector-1.11.jar
4K downloaded  (java-boot-classpath-detector-1.11.jar)
207K downloaded  (asm-all-4.0.jar)
[INFO] [animal-sniffer:check {execution: check-java-1.5-compat}]
[INFO] Checking unresolved references to org.codehaus.mojo.signature:java15:1.0
[INFO] [site:attach-descriptor {execution: default-attach-descriptor}]
[INFO] [install:install {execution: default-install}]
[INFO] Installing <https://builds.apache.org/job/Creadur-Rat-ParentPom/ws/pom.xml> to
f:\jenkins\jenkins-slave\maven-repositories\1\org\apache\rat\apache-rat-project\0.12-SNAPSHOT\apache-rat-project-0.12-SNAPSHOT.pom
[INFO] Installing <https://builds.apache.org/job/Creadur-Rat-ParentPom/ws/target\apache-rat-project-0.12-SNAPSHOT-site.xml>
to f:\jenkins\jenkins-slave\maven-repositories\1\org\apache\rat\apache-rat-project\0.12-SNAPSHOT\apache-rat-project-0.12-SNAPSHOT-site.xml
[INFO] ------------------------------------------------------------------------
[INFO] BUILD SUCCESSFUL
[INFO] ------------------------------------------------------------------------
[INFO] Total time: 14 seconds
[INFO] Finished at: Thu Aug 21 01:01:20 PDT 2014
[INFO] Final Memory: 38M/92M
[INFO] ------------------------------------------------------------------------
[JENKINS] Archiving f:\jenkins\jenkins-slave\maven-repositories\1\org\apache\rat\apache-rat-project\0.12-SNAPSHOT\apache-rat-project-0.12-SNAPSHOT.pom
to org.apache.rat/apache-rat-project/0.12-SNAPSHOT/apache-rat-project-0.12-SNAPSHOT.pom
[JENKINS] Archiving <https://builds.apache.org/job/Creadur-Rat-ParentPom/ws/target\apache-rat-project-0.12-SNAPSHOT-site.xml>
to org.apache.rat/apache-rat-project/0.12-SNAPSHOT/apache-rat-project-0.12-SNAPSHOT-site.xml
F:/jenkins/jenkins-slave/maven-repositories/1/org/apache/rat/apache-rat-project/0.12-SNAPSHOT/apache-rat-project-0.12-SNAPSHOT.pom
is not inside F:/jenkins/jenkins-slave/workspace/Creadur-Rat-ParentPom/; will archive in a
separate pass
No prior successful build to compare, so performing full copy of artifacts
No prior successful build to compare, so performing full copy of artifacts
channel stopped
Maven RedeployPublisher use remote windows2 maven settings from : f:\jenkins\tools\maven\apache-maven-2.2.1/conf/settings.xml
[INFO] Deployment in https://repository.apache.org/content/repositories/snapshots (id=apache.snapshots.https,uniqueVersion=true)
Deploying the main artifact apache-rat-project-0.12-SNAPSHOT.pom
Downloading: https://repository.apache.org/content/repositories/snapshots/org/apache/rat/apache-rat-project/0.12-SNAPSHOT/maven-metadata.xml
ERROR: Failed to retrieve remote metadata org.apache.rat:apache-rat-project:0.12-SNAPSHOT/maven-metadata.xml:
Could not transfer metadata org.apache.rat:apache-rat-project:0.12-SNAPSHOT/maven-metadata.xml
from/to apache.snapshots.https (https://repository.apache.org/content/repositories/snapshots):
Failed to transfer file: https://repository.apache.org/content/repositories/snapshots/org/apache/rat/apache-rat-project/0.12-SNAPSHOT/maven-metadata.xml.
Return code is: 502 , ReasonPhrase:Proxy Error.
org.apache.maven.artifact.deployer.ArtifactDeploymentException: Failed to retrieve remote
metadata org.apache.rat:apache-rat-project:0.12-SNAPSHOT/maven-metadata.xml: Could not transfer
metadata org.apache.rat:apache-rat-project:0.12-SNAPSHOT/maven-metadata.xml from/to apache.snapshots.https
(https://repository.apache.org/content/repositories/snapshots): Failed to transfer file: https://repository.apache.org/content/repositories/snapshots/org/apache/rat/apache-rat-project/0.12-SNAPSHOT/maven-metadata.xml.
Return code is: 502 , ReasonPhrase:Proxy Error.
	at org.apache.maven.artifact.deployer.DefaultArtifactDeployer.deploy(DefaultArtifactDeployer.java:143)
	at hudson.maven.reporters.MavenArtifactRecord.deploy(MavenArtifactRecord.java:193)
	at hudson.maven.RedeployPublisher.perform(RedeployPublisher.java:176)
	at hudson.tasks.BuildStepMonitor$1.perform(BuildStepMonitor.java:20)
	at hudson.model.AbstractBuild$AbstractBuildExecution.perform(AbstractBuild.java:804)
	at hudson.model.AbstractBuild$AbstractBuildExecution.performAllBuildSteps(AbstractBuild.java:776)
	at hudson.maven.MavenModuleSetBuild$MavenModuleSetBuildExecution.post2(MavenModuleSetBuild.java:1040)
	at hudson.model.AbstractBuild$AbstractBuildExecution.post(AbstractBuild.java:725)
	at hudson.model.Run.execute(Run.java:1701)
	at hudson.maven.MavenModuleSetBuild.run(MavenModuleSetBuild.java:529)
	at hudson.model.ResourceController.execute(ResourceController.java:88)
	at hudson.model.Executor.run(Executor.java:231)
Caused by: org.eclipse.aether.deployment.DeploymentException: Failed to retrieve remote metadata
org.apache.rat:apache-rat-project:0.12-SNAPSHOT/maven-metadata.xml: Could not transfer metadata
org.apache.rat:apache-rat-project:0.12-SNAPSHOT/maven-metadata.xml from/to apache.snapshots.https
(https://repository.apache.org/content/repositories/snapshots): Failed to transfer file: https://repository.apache.org/content/repositories/snapshots/org/apache/rat/apache-rat-project/0.12-SNAPSHOT/maven-metadata.xml.
Return code is: 502 , ReasonPhrase:Proxy Error.
	at org.eclipse.aether.internal.impl.DefaultDeployer.upload(DefaultDeployer.java:470)
	at org.eclipse.aether.internal.impl.DefaultDeployer.deploy(DefaultDeployer.java:314)
	at org.eclipse.aether.internal.impl.DefaultDeployer.deploy(DefaultDeployer.java:269)
	at org.eclipse.aether.internal.impl.DefaultRepositorySystem.deploy(DefaultRepositorySystem.java:413)
	at org.apache.maven.artifact.deployer.DefaultArtifactDeployer.deploy(DefaultArtifactDeployer.java:139)
	... 11 more
Caused by: org.eclipse.aether.transfer.MetadataTransferException: Could not transfer metadata
org.apache.rat:apache-rat-project:0.12-SNAPSHOT/maven-metadata.xml from/to apache.snapshots.https
(https://repository.apache.org/content/repositories/snapshots): Failed to transfer file: https://repository.apache.org/content/repositories/snapshots/org/apache/rat/apache-rat-project/0.12-SNAPSHOT/maven-metadata.xml.
Return code is: 502 , ReasonPhrase:Proxy Error.
	at org.eclipse.aether.connector.wagon.WagonRepositoryConnector$5.wrap(WagonRepositoryConnector.java:995)
	at org.eclipse.aether.connector.wagon.WagonRepositoryConnector$5.wrap(WagonRepositoryConnector.java:983)
	at org.eclipse.aether.connector.wagon.WagonRepositoryConnector$GetTask.run(WagonRepositoryConnector.java:725)
	at org.eclipse.aether.util.concurrency.RunnableErrorForwarder$1.run(RunnableErrorForwarder.java:67)
	at java.util.concurrent.ThreadPoolExecutor.runWorker(ThreadPoolExecutor.java:1145)
	at java.util.concurrent.ThreadPoolExecutor$Worker.run(ThreadPoolExecutor.java:615)
	at java.lang.Thread.run(Thread.java:745)
Caused by: org.apache.maven.wagon.TransferFailedException: Failed to transfer file: https://repository.apache.org/content/repositories/snapshots/org/apache/rat/apache-rat-project/0.12-SNAPSHOT/maven-metadata.xml.
Return code is: 502 , ReasonPhrase:Proxy Error.
	at org.apache.maven.wagon.shared.http4.AbstractHttpClientWagon.fillInputData(AbstractHttpClientWagon.java:945)
	at org.apache.maven.wagon.StreamWagon.getInputStream(StreamWagon.java:116)
	at org.apache.maven.wagon.StreamWagon.getIfNewer(StreamWagon.java:88)
	at org.apache.maven.wagon.StreamWagon.get(StreamWagon.java:61)
	at org.eclipse.aether.connector.wagon.WagonRepositoryConnector$GetTask.run(WagonRepositoryConnector.java:660)
	... 4 more
[INFO] Deployment failed after 1 min 1 sec
Build step 'Deploy artifacts to Maven repository' changed build result to FAILURE

Mime
View raw message