creadur-dev mailing list archives

Site index · List index
Message view « Date » · « Thread »
Top « Date » · « Thread »
From Apache Jenkins Server <jenk...@builds.apache.org>
Subject Build failed in Jenkins: Creadur-Rat-site » Apache Creadur Rat #14
Date Fri, 15 Aug 2014 08:45:52 GMT
See <https://builds.apache.org/job/Creadur-Rat-site/org.apache.rat$apache-rat-project/14/changes>

Changes:

[dennisl] Roll back version numbers in preparation for a new release candidate.

[dennisl] Inject project version and name from the POM, so that we don't have to update these
for every new release.
I also tried to inject the project artifactId, but that won't work currently, because our
artifactIds are not quite right. I will revisit that in a later version.

[dennisl] Fix typo.

[dennisl] Correct site publication instructions.

------------------------------------------
maven-agent.jar already up to date
classworlds.jar already up to date
maven-interceptor.jar already up to date
maven2.1-interceptor.jar already up to date
<===[JENKINS REMOTING CAPACITY]===>   channel started
maven-agent.jar already up to date
classworlds.jar already up to date
maven-interceptor.jar already up to date
maven2.1-interceptor.jar already up to date
<===[JENKINS REMOTING CAPACITY]===>   channel started
log4j:WARN No appenders could be found for logger (org.apache.commons.beanutils.converters.BooleanConverter).
log4j:WARN Please initialize the log4j system properly.
Executing Maven:  -B -f <https://builds.apache.org/job/Creadur-Rat-site/org.apache.rat$apache-rat-project/ws/pom.xml>
-Dmaven.repo.local=/home/jenkins/jenkins-slave/maven-repositories/0 deploy site
[INFO] Scanning for projects...
[INFO] Reactor build order: 
[INFO]   Apache Creadur Rat
[INFO]   Apache Creadur Rat::Core
[INFO]   Apache Creadur Rat::Plugin4Maven
[INFO]   Apache Creadur Rat::Tasks4Ant
[INFO]   Apache Creadur Rat::Command Line
[INFO] ------------------------------------------------------------------------
[INFO] Building Apache Creadur Rat
[INFO]    task-segment: [deploy, site]
[INFO] ------------------------------------------------------------------------
[INFO] [enforcer:enforce {execution: enforce-bytecode-version}]
[INFO] [remote-resources:process {execution: default}]
[INFO] [animal-sniffer:check {execution: check-java-1.5-compat}]
[INFO] Checking unresolved references to org.codehaus.mojo.signature:java15:1.0
[INFO] [site:attach-descriptor {execution: default-attach-descriptor}]
[INFO] [install:install {execution: default-install}]
[INFO] Installing <https://builds.apache.org/job/Creadur-Rat-site/org.apache.rat$apache-rat-project/ws/pom.xml>
to /home/jenkins/jenkins-slave/maven-repositories/0/org/apache/rat/apache-rat-project/0.11-SNAPSHOT/apache-rat-project-0.11-SNAPSHOT.pom
[INFO] Installing <https://builds.apache.org/job/Creadur-Rat-site/org.apache.rat$apache-rat-project/ws/target/apache-rat-project-0.11-SNAPSHOT-site.xml>
to /home/jenkins/jenkins-slave/maven-repositories/0/org/apache/rat/apache-rat-project/0.11-SNAPSHOT/apache-rat-project-0.11-SNAPSHOT-site.xml
[INFO] [deploy:deploy {execution: default-deploy}]
[INFO] Retrieving previous build number from apache.snapshots.https
[WARNING] *** CHECKSUM FAILED - Checksum failed on download: local = '990f67b953a9fb739882e127075b69f0a0b9a6c5';
remote = '0da568e17ed6a3f39e3049afb70f11f03bc84f8f' - RETRYING
[WARNING] *** CHECKSUM FAILED - Checksum failed on download: local = '990f67b953a9fb739882e127075b69f0a0b9a6c5';
remote = '0da568e17ed6a3f39e3049afb70f11f03bc84f8f' - IGNORING
Uploading: https://repository.apache.org/content/repositories/snapshots/org/apache/rat/apache-rat-project/0.11-SNAPSHOT/apache-rat-project-0.11-20140815.084119-3.pom
19K uploaded  (apache-rat-project-0.11-20140815.084119-3.pom)
[INFO] Retrieving previous metadata from apache.snapshots.https
[INFO] Uploading repository metadata for: 'artifact org.apache.rat:apache-rat-project'
[INFO] ------------------------------------------------------------------------
[ERROR] BUILD ERROR
[INFO] ------------------------------------------------------------------------
[INFO] Error installing artifact's metadata: Error while deploying metadata: Failed to transfer
file: https://repository.apache.org/content/repositories/snapshots/org/apache/rat/apache-rat-project/maven-metadata.xml.md5.
Return code is: 502

[INFO] ------------------------------------------------------------------------
[INFO] For more information, run Maven with the -e switch
[INFO] ------------------------------------------------------------------------
[INFO] Total time: 4 minutes 38 seconds
[INFO] Finished at: Fri Aug 15 08:45:51 UTC 2014
[INFO] Final Memory: 61M/1030M
[INFO] ------------------------------------------------------------------------

Mime
View raw message