creadur-dev mailing list archives

Site index · List index
Message view « Date » · « Thread »
Top « Date » · « Thread »
From Apache Jenkins Server <jenk...@builds.apache.org>
Subject Build failed in Jenkins: Creadur-Rat #82
Date Wed, 06 Aug 2014 09:21:40 GMT
See <https://builds.apache.org/job/Creadur-Rat/82/>

------------------------------------------
Started by user dennisl
Building remotely on ubuntu-2 (Ubuntu ubuntu) in workspace <https://builds.apache.org/job/Creadur-Rat/ws/>
Cleaning up <https://builds.apache.org/job/Creadur-Rat/ws/.>
Deleting <https://builds.apache.org/job/Creadur-Rat/ws/target>
Deleting <https://builds.apache.org/job/Creadur-Rat/ws/apache-rat/target>
Deleting <https://builds.apache.org/job/Creadur-Rat/ws/apache-rat-core/target>
Deleting <https://builds.apache.org/job/Creadur-Rat/ws/apache-rat-tasks/target>
Deleting <https://builds.apache.org/job/Creadur-Rat/ws/apache-rat-plugin/target>
Updating http://svn.apache.org/repos/asf/creadur/rat/trunk at revision '2014-08-06T09:17:49.985
+0000'
At revision 1616133
no change for http://svn.apache.org/repos/asf/creadur/rat/trunk since the previous build
Parsing POMs
Modules changed, recalculating dependency graph
maven-agent.jar already up to date
classworlds.jar already up to date
maven-interceptor.jar already up to date
maven2.1-interceptor.jar already up to date
[Creadur-Rat] $ /home/hudson/tools/java/latest1.5/bin/java -cp /home/jenkins/jenkins-slave/maven-agent.jar:/home/jenkins/jenkins-slave/classworlds.jar
hudson.maven.agent.Main /home/hudson/tools/maven/apache-maven-2.2.1 /home/jenkins/jenkins-slave/slave.jar
/home/jenkins/jenkins-slave/maven-interceptor.jar 35680 /home/jenkins/jenkins-slave/maven2.1-interceptor.jar
<===[JENKINS REMOTING CAPACITY]===channel started
>   ERROR: [JENKINS-18403] JDK 5 not supported to run Maven; retrying with slave Java and
setting compile/test properties to point to /home/hudson/tools/java/latest1.5
maven-agent.jar already up to date
classworlds.jar already up to date
maven-interceptor.jar already up to date
maven2.1-interceptor.jar already up to date
[Creadur-Rat] $ /home/jenkins/tools/java/jdk1.7.0_55/jre/bin/java -cp /home/jenkins/jenkins-slave/maven-agent.jar:/home/jenkins/jenkins-slave/classworlds.jar
hudson.maven.agent.Main /home/hudson/tools/maven/apache-maven-2.2.1 /home/jenkins/jenkins-slave/slave.jar
/home/jenkins/jenkins-slave/maven-interceptor.jar 53697 /home/jenkins/jenkins-slave/maven2.1-interceptor.jar
<===[JENKINS REMOTING CAPACITY]===>   channel started
log4j:WARN No appenders could be found for logger (org.apache.commons.beanutils.converters.BooleanConverter).
log4j:WARN Please initialize the log4j system properly.
Executing Maven:  -B -f <https://builds.apache.org/job/Creadur-Rat/ws/pom.xml> -Dmaven.repo.local=/home/jenkins/jenkins-slave/maven-repositories/1
clean install -B -U -e -fae -V -Prat
+ Error stacktraces are turned on.
Apache Maven 2.2.1 (r801777; 2009-08-06 19:16:01+0000)
Java version: 1.7.0_55
Java home: /home/jenkins/tools/java/jdk1.7.0_55/jre
Default locale: en_US, platform encoding: ANSI_X3.4-1968
OS name: "linux" version: "3.13.0-24-generic" arch: "amd64" Family: "unix"
[INFO] Scanning for projects...
[INFO] ------------------------------------------------------------------------
[ERROR] BUILD FAILURE
[INFO] ------------------------------------------------------------------------
[INFO] The projects in the reactor contain a cyclic reference: Edge between 'Vertex{label='org.apache.rat:apache-rat-plugin'}'
and 'Vertex{label='org.apache.rat:apache-rat-core'}' introduces to cycle in the graph org.apache.rat:apache-rat-core
--> org.apache.rat:apache-rat-plugin --> org.apache.rat:apache-rat-core
[INFO] ------------------------------------------------------------------------
[INFO] Trace
org.apache.maven.BuildFailureException: The projects in the reactor contain a cyclic reference:
Edge between 'Vertex{label='org.apache.rat:apache-rat-plugin'}' and 'Vertex{label='org.apache.rat:apache-rat-core'}'
introduces to cycle in the graph org.apache.rat:apache-rat-core --> org.apache.rat:apache-rat-plugin
--> org.apache.rat:apache-rat-core
	at org.apache.maven.DefaultMaven.doExecute(DefaultMaven.java:295)
	at org.apache.maven.DefaultMaven.execute(DefaultMaven.java:138)
	at org.apache.maven.cli.MavenCli.main(MavenCli.java:362)
	at sun.reflect.NativeMethodAccessorImpl.invoke0(Native Method)
	at sun.reflect.NativeMethodAccessorImpl.invoke(NativeMethodAccessorImpl.java:57)
	at sun.reflect.DelegatingMethodAccessorImpl.invoke(DelegatingMethodAccessorImpl.java:43)
	at java.lang.reflect.Method.invoke(Method.java:606)
	at org.codehaus.classworlds.Launcher.launchEnhanced(Launcher.java:315)
	at org.codehaus.classworlds.Launcher.launch(Launcher.java:255)
	at hudson.maven.agent.Main.launch(Main.java:205)
	at hudson.maven.MavenBuilder.call(MavenBuilder.java:154)
	at hudson.maven.Maven2Builder.call(Maven2Builder.java:79)
	at hudson.maven.Maven2Builder.call(Maven2Builder.java:55)
	at hudson.remoting.UserRequest.perform(UserRequest.java:118)
	at hudson.remoting.UserRequest.perform(UserRequest.java:48)
	at hudson.remoting.Request$2.run(Request.java:328)
	at hudson.remoting.InterceptingExecutorService$1.call(InterceptingExecutorService.java:72)
	at java.util.concurrent.FutureTask.run(FutureTask.java:262)
	at java.util.concurrent.ThreadPoolExecutor.runWorker(ThreadPoolExecutor.java:1145)
	at java.util.concurrent.ThreadPoolExecutor$Worker.run(ThreadPoolExecutor.java:615)
	at java.lang.Thread.run(Thread.java:745)
Caused by: hidden.org.codehaus.plexus.util.dag.CycleDetectedException: Edge between 'Vertex{label='org.apache.rat:apache-rat-plugin'}'
and 'Vertex{label='org.apache.rat:apache-rat-core'}' introduces to cycle in the graph org.apache.rat:apache-rat-core
--> org.apache.rat:apache-rat-plugin --> org.apache.rat:apache-rat-core
	at hidden.org.codehaus.plexus.util.dag.DAG.addEdge(DAG.java:143)
	at hidden.org.codehaus.plexus.util.dag.DAG.addEdge(DAG.java:123)
	at org.apache.maven.project.ProjectSorter.<init>(ProjectSorter.java:118)
	at org.apache.maven.execution.ReactorManager.<init>(ReactorManager.java:99)
	at org.apache.maven.DefaultMaven.doExecute(DefaultMaven.java:288)
	... 20 more
[INFO] ------------------------------------------------------------------------
[INFO] Total time: < 1 second
[INFO] Finished at: Wed Aug 06 09:19:04 UTC 2014
[INFO] Final Memory: 12M/723M
[INFO] ------------------------------------------------------------------------
channel stopped

Mime
View raw message