creadur-dev mailing list archives

Site index · List index
Message view « Date » · « Thread »
Top « Date » · « Thread »
From Apache Jenkins Server <jenk...@builds.apache.org>
Subject Build failed in Jenkins: Creadur-Tentacles-Site » Apache Tentacles #2
Date Wed, 20 Aug 2014 02:32:33 GMT
See <https://builds.apache.org/job/Creadur-Tentacles-Site/org.apache.creadur.tentacles$apache-tentacles/2/changes>

Changes:

[pottlinger] TENTACLES-4 Streamline Build Infrastructure

- Added rat profile to enable RAT checks.
- Added rat reports to site-plugin configuration.
- Upgraded dependencies and added license headers and exclusions.

[pottlinger] Local development with git - more ignores.

------------------------------------------
maven-agent.jar already up to date
classworlds.jar already up to date
maven-interceptor.jar already up to date
maven2.1-interceptor.jar already up to date
<===[JENKINS REMOTING CAPACITY]===>   channel started
log4j:WARN No appenders could be found for logger (org.apache.commons.beanutils.converters.BooleanConverter).
log4j:WARN Please initialize the log4j system properly.
Executing Maven:  -B -f <https://builds.apache.org/job/Creadur-Tentacles-Site/org.apache.creadur.tentacles$apache-tentacles/ws/pom.xml>
-Dmaven.repo.local=/home/jenkins/jenkins-slave/maven-repositories/0 deploy site
[INFO] Scanning for projects...
[INFO] ------------------------------------------------------------------------
[INFO] Building Apache Tentacles
[INFO]    task-segment: [deploy, site]
[INFO] ------------------------------------------------------------------------
[INFO] [remote-resources:process {execution: default}]
[INFO] [resources:resources {execution: default-resources}]
[INFO] Using 'UTF-8' encoding to copy filtered resources.
[INFO] Copying 9 resources
[INFO] Copying 3 resources
[INFO] [compiler:compile {execution: default-compile}]
[INFO] Changes detected - recompiling the module!
[INFO] Compiling 30 source files to <https://builds.apache.org/job/Creadur-Tentacles-Site/org.apache.creadur.tentacles$apache-tentacles/ws/target/classes>
[INFO] [resources:testResources {execution: default-testResources}]
[INFO] Using 'UTF-8' encoding to copy filtered resources.
[INFO] skip non existing resourceDirectory <https://builds.apache.org/job/Creadur-Tentacles-Site/org.apache.creadur.tentacles$apache-tentacles/ws/src/test/resources>
[INFO] Copying 3 resources
[INFO] [compiler:testCompile {execution: default-testCompile}]
[INFO] Changes detected - recompiling the module!
[INFO] Compiling 2 source files to <https://builds.apache.org/job/Creadur-Tentacles-Site/org.apache.creadur.tentacles$apache-tentacles/ws/target/test-classes>
[INFO] [surefire:test {execution: default-test}]
[INFO] Surefire report directory: <https://builds.apache.org/job/Creadur-Tentacles-Site/org.apache.creadur.tentacles$apache-tentacles/ws/target/surefire-reports>

-------------------------------------------------------
 T E S T S
-------------------------------------------------------
Running org.apache.creadur.tentacles.ArchivesJsonTest
{
  "archives" : [ {
    "path" : "one/two/hello.jar",
    "name" : "hello.jar",
    "type" : null,
    "jars" : 0,
    "license" : null,
    "notice" : null
  } ]
}Tests run: 1, Failures: 0, Errors: 0, Skipped: 0, Time elapsed: 0.324 sec - in org.apache.creadur.tentacles.ArchivesJsonTest
Running org.apache.creadur.tentacles.filter.ListOfFilesFilterTest
Tests run: 1, Failures: 0, Errors: 0, Skipped: 0, Time elapsed: 0 sec - in org.apache.creadur.tentacles.filter.ListOfFilesFilterTest

Results :

Tests run: 2, Failures: 0, Errors: 0, Skipped: 0

[JENKINS] Recording test results
[INFO] [jar:jar {execution: default-jar}]
[INFO] Building jar: <https://builds.apache.org/job/Creadur-Tentacles-Site/org.apache.creadur.tentacles$apache-tentacles/ws/target/apache-tentacles-0.1-SNAPSHOT.jar>
[INFO] [assembly:single {execution: make-assembly}]
[INFO] Building jar: <https://builds.apache.org/job/Creadur-Tentacles-Site/org.apache.creadur.tentacles$apache-tentacles/ws/target/apache-tentacles-0.1-SNAPSHOT-jar-with-dependencies.jar>
[INFO] [install:install {execution: default-install}]
[INFO] Installing <https://builds.apache.org/job/Creadur-Tentacles-Site/org.apache.creadur.tentacles$apache-tentacles/ws/target/apache-tentacles-0.1-SNAPSHOT.jar>
to /home/jenkins/jenkins-slave/maven-repositories/0/org/apache/creadur/tentacles/apache-tentacles/0.1-SNAPSHOT/apache-tentacles-0.1-SNAPSHOT.jar
[INFO] Installing <https://builds.apache.org/job/Creadur-Tentacles-Site/org.apache.creadur.tentacles$apache-tentacles/ws/target/apache-tentacles-0.1-SNAPSHOT-jar-with-dependencies.jar>
to /home/jenkins/jenkins-slave/maven-repositories/0/org/apache/creadur/tentacles/apache-tentacles/0.1-SNAPSHOT/apache-tentacles-0.1-SNAPSHOT-jar-with-dependencies.jar
[INFO] [deploy:deploy {execution: default-deploy}]
[INFO] Retrieving previous build number from apache.snapshots.https
[WARNING] *** CHECKSUM FAILED - Checksum failed on download: local = '3cd5ea53b13b0ce870367ceb102749a7a7df0896';
remote = '198aef5eeb6032f313693371e48ac2c8a181da51' - RETRYING
[WARNING] *** CHECKSUM FAILED - Checksum failed on download: local = '3cd5ea53b13b0ce870367ceb102749a7a7df0896';
remote = '198aef5eeb6032f313693371e48ac2c8a181da51' - IGNORING
Uploading: https://repository.apache.org/content/repositories/snapshots/org/apache/creadur/tentacles/apache-tentacles/0.1-SNAPSHOT/apache-tentacles-0.1-20140820.023208-3.jar
70K uploaded  (apache-tentacles-0.1-20140820.023208-3.jar)
[INFO] Retrieving previous metadata from apache.snapshots.https
[WARNING] *** CHECKSUM FAILED - Checksum failed on download: local = '3cd5ea53b13b0ce870367ceb102749a7a7df0896';
remote = '198aef5eeb6032f313693371e48ac2c8a181da51' - RETRYING
[WARNING] *** CHECKSUM FAILED - Checksum failed on download: local = '3cd5ea53b13b0ce870367ceb102749a7a7df0896';
remote = '198aef5eeb6032f313693371e48ac2c8a181da51' - IGNORING
[INFO] Uploading repository metadata for: 'snapshot org.apache.creadur.tentacles:apache-tentacles:0.1-SNAPSHOT'
[INFO] Uploading project information for apache-tentacles 0.1-20140820.023208-3
[INFO] Retrieving previous metadata from apache.snapshots.https
[INFO] Uploading repository metadata for: 'artifact org.apache.creadur.tentacles:apache-tentacles'
[INFO] Retrieving previous build number from apache.snapshots.https
Uploading: https://repository.apache.org/content/repositories/snapshots/org/apache/creadur/tentacles/apache-tentacles/0.1-SNAPSHOT/apache-tentacles-0.1-20140820.023208-3-jar-with-dependencies.jar
4260K uploaded  (apache-tentacles-0.1-20140820.023208-3-jar-with-dependencies.jar)
Downloading: http://repo1.maven.org/maven2/org/apache/maven/plugins/maven-project-info-reports-plugin/2.1/maven-project-info-reports-plugin-2.1.pom
22K downloaded  (maven-project-info-reports-plugin-2.1.pom)
Downloading: http://repo1.maven.org/maven2/org/apache/maven/plugins/maven-project-info-reports-plugin/2.1/maven-project-info-reports-plugin-2.1.jar
191K downloaded  (maven-project-info-reports-plugin-2.1.jar)
Downloading: http://repo1.maven.org/maven2/org/apache/maven/shared/maven-shared-jar/1.0/maven-shared-jar-1.0.pom
4K downloaded  (maven-shared-jar-1.0.pom)
Downloading: http://repo1.maven.org/maven2/org/apache/maven/wagon/wagon-ssh/1.0-beta-3/wagon-ssh-1.0-beta-3.pom
1K downloaded  (wagon-ssh-1.0-beta-3.pom)
Downloading: http://repo1.maven.org/maven2/org/apache/maven/wagon/wagon-providers/1.0-beta-3/wagon-providers-1.0-beta-3.pom
1K downloaded  (wagon-providers-1.0-beta-3.pom)
Downloading: http://repo1.maven.org/maven2/org/apache/maven/wagon/wagon-ssh-common/1.0-beta-3/wagon-ssh-common-1.0-beta-3.pom
968b downloaded  (wagon-ssh-common-1.0-beta-3.pom)
Downloading: http://repo1.maven.org/maven2/org/apache/maven/wagon/wagon-file/1.0-beta-3/wagon-file-1.0-beta-3.pom
575b downloaded  (wagon-file-1.0-beta-3.pom)
Downloading: http://repo1.maven.org/maven2/org/apache/maven/wagon/wagon-http-lightweight/1.0-beta-3/wagon-http-lightweight-1.0-beta-3.pom
1K downloaded  (wagon-http-lightweight-1.0-beta-3.pom)
Downloading: http://repo1.maven.org/maven2/org/apache/maven/wagon/wagon-http-shared/1.0-beta-3/wagon-http-shared-1.0-beta-3.pom
1K downloaded  (wagon-http-shared-1.0-beta-3.pom)
Downloading: http://repo1.maven.org/maven2/org/apache/maven/scm/maven-scm-provider-perforce/1.0/maven-scm-provider-perforce-1.0.pom
1K downloaded  (maven-scm-provider-perforce-1.0.pom)
Downloading: http://repo1.maven.org/maven2/org/apache/maven/scm/maven-scm-providers/1.0/maven-scm-providers-1.0.pom
3K downloaded  (maven-scm-providers-1.0.pom)
Downloading: http://repo1.maven.org/maven2/org/apache/maven/scm/maven-scm-provider-starteam/1.0/maven-scm-provider-starteam-1.0.pom
1K downloaded  (maven-scm-provider-starteam-1.0.pom)
Downloading: http://repo1.maven.org/maven2/org/apache/maven/scm/maven-scm-provider-svn-commons/1.0/maven-scm-provider-svn-commons-1.0.pom
1K downloaded  (maven-scm-provider-svn-commons-1.0.pom)
Downloading: http://repo1.maven.org/maven2/org/apache/maven/scm/maven-scm-providers-svn/1.0/maven-scm-providers-svn-1.0.pom
1K downloaded  (maven-scm-providers-svn-1.0.pom)
Downloading: http://repo1.maven.org/maven2/org/apache/maven/scm/maven-scm-provider-svnexe/1.0/maven-scm-provider-svnexe-1.0.pom
1K downloaded  (maven-scm-provider-svnexe-1.0.pom)
Downloading: http://repo1.maven.org/maven2/org/apache/maven/scm/maven-scm-provider-cvs-commons/1.0/maven-scm-provider-cvs-commons-1.0.pom
1K downloaded  (maven-scm-provider-cvs-commons-1.0.pom)
Downloading: http://repo1.maven.org/maven2/org/apache/maven/scm/maven-scm-providers-cvs/1.0/maven-scm-providers-cvs-1.0.pom
1K downloaded  (maven-scm-providers-cvs-1.0.pom)
Downloading: http://repo1.maven.org/maven2/org/apache/maven/scm/maven-scm-provider-cvsexe/1.0/maven-scm-provider-cvsexe-1.0.pom
1K downloaded  (maven-scm-provider-cvsexe-1.0.pom)
Downloading: http://repo1.maven.org/maven2/org/apache/maven/scm/maven-scm-provider-cvsjava/1.0/maven-scm-provider-cvsjava-1.0.pom
1K downloaded  (maven-scm-provider-cvsjava-1.0.pom)
Downloading: http://repo1.maven.org/maven2/org/apache/maven/scm/maven-scm-api/1.0/maven-scm-api-1.0.jar
Downloading: http://repo1.maven.org/maven2/org/apache/maven/shared/maven-shared-jar/1.0/maven-shared-jar-1.0.jar
80K downloaded  (maven-scm-api-1.0.jar)
Downloading: http://repo1.maven.org/maven2/org/apache/maven/scm/maven-scm-provider-perforce/1.0/maven-scm-provider-perforce-1.0.jar
36K downloaded  (maven-shared-jar-1.0.jar)
61K downloaded  (maven-scm-provider-perforce-1.0.jar)
Downloading: http://repo1.maven.org/maven2/org/apache/maven/scm/maven-scm-provider-starteam/1.0/maven-scm-provider-starteam-1.0.jar
67K downloaded  (maven-scm-provider-starteam-1.0.jar)
Downloading: http://repo1.maven.org/maven2/org/apache/maven/scm/maven-scm-provider-svn-commons/1.0/maven-scm-provider-svn-commons-1.0.jar
35K downloaded  (maven-scm-provider-svn-commons-1.0.jar)
Downloading: http://repo1.maven.org/maven2/org/apache/maven/scm/maven-scm-provider-svnexe/1.0/maven-scm-provider-svnexe-1.0.jar
56K downloaded  (maven-scm-provider-svnexe-1.0.jar)
Downloading: http://repo1.maven.org/maven2/org/apache/maven/scm/maven-scm-provider-cvs-commons/1.0/maven-scm-provider-cvs-commons-1.0.jar
66K downloaded  (maven-scm-provider-cvs-commons-1.0.jar)
Downloading: http://repo1.maven.org/maven2/org/apache/maven/scm/maven-scm-provider-cvsexe/1.0/maven-scm-provider-cvsexe-1.0.jar
24K downloaded  (maven-scm-provider-cvsexe-1.0.jar)
Downloading: http://repo1.maven.org/maven2/org/apache/maven/scm/maven-scm-provider-cvsjava/1.0/maven-scm-provider-cvsjava-1.0.jar
38K downloaded  (maven-scm-provider-cvsjava-1.0.jar)
[INFO] ------------------------------------------------------------------------
[ERROR] BUILD ERROR
[INFO] ------------------------------------------------------------------------
[INFO] Error configuring: org.apache.maven.plugins:maven-site-plugin. Reason: ERROR: Cannot
override read-only parameter: reportPlugins in goal: site:site
[INFO] ------------------------------------------------------------------------
[INFO] For more information, run Maven with the -e switch
[INFO] ------------------------------------------------------------------------
[INFO] Total time: 39 seconds
[INFO] Finished at: Wed Aug 20 02:32:22 UTC 2014
[INFO] Final Memory: 68M/423M
[INFO] ------------------------------------------------------------------------

Mime
View raw message