creadur-dev mailing list archives

Site index · List index
Message view « Date » · « Thread »
Top « Date » · « Thread »
From Apache Jenkins Server <jenk...@builds.apache.org>
Subject Build failed in Jenkins: Creadur-Whisker #10
Date Fri, 22 Aug 2014 23:26:36 GMT
See <https://builds.apache.org/job/Creadur-Whisker/10/changes>

Changes:

[pottlinger] WHISKER-12: MavenPluginErrors again

- Followed instructions from http://maven.apache.org/plugin-tools/maven-plugin-plugin/examples/using-annotations.html
to get rid of the mojo error.
- Extracted version number of mavenPluginPlugin, use it for maven-annotations as well to keep
these dependencies in sync.

------------------------------------------
[...truncated 2441 lines...]
Downloading: http://repo.maven.apache.org/maven2/org/apache/maven/doxia/doxia-decoration-model/1.1.4/doxia-decoration-model-1.1.4.pom
Downloaded: http://repo.maven.apache.org/maven2/org/apache/maven/doxia/doxia-decoration-model/1.1.4/doxia-decoration-model-1.1.4.pom
(3 KB at 170.9 KB/sec)
Downloading: http://repo.maven.apache.org/maven2/org/apache/maven/doxia/doxia-module-xhtml/1.1.4/doxia-module-xhtml-1.1.4.pom
Downloaded: http://repo.maven.apache.org/maven2/org/apache/maven/doxia/doxia-module-xhtml/1.1.4/doxia-module-xhtml-1.1.4.pom
(2 KB at 92.0 KB/sec)
Downloading: http://repo.maven.apache.org/maven2/org/apache/maven/doxia/doxia-modules/1.1.4/doxia-modules-1.1.4.pom
Downloaded: http://repo.maven.apache.org/maven2/org/apache/maven/doxia/doxia-modules/1.1.4/doxia-modules-1.1.4.pom
(3 KB at 140.0 KB/sec)
Downloading: http://repo.maven.apache.org/maven2/org/apache/maven/doxia/doxia-module-fml/1.1.4/doxia-module-fml-1.1.4.pom
Downloaded: http://repo.maven.apache.org/maven2/org/apache/maven/doxia/doxia-module-fml/1.1.4/doxia-module-fml-1.1.4.pom
(6 KB at 315.0 KB/sec)
Downloading: http://repo.maven.apache.org/maven2/org/codehaus/groovy/groovy-all/2.0.1/groovy-all-2.0.1.pom
Downloaded: http://repo.maven.apache.org/maven2/org/codehaus/groovy/groovy-all/2.0.1/groovy-all-2.0.1.pom
(18 KB at 965.0 KB/sec)
Downloading: http://repo.maven.apache.org/maven2/org/codehaus/plexus/plexus-utils/3.0.7/plexus-utils-3.0.7.pom
Downloaded: http://repo.maven.apache.org/maven2/org/codehaus/plexus/plexus-utils/3.0.7/plexus-utils-3.0.7.pom
(3 KB at 136.3 KB/sec)
Downloading: http://repo.maven.apache.org/maven2/org/codehaus/plexus/plexus/3.1/plexus-3.1.pom
Downloaded: http://repo.maven.apache.org/maven2/org/codehaus/plexus/plexus/3.1/plexus-3.1.pom
(19 KB at 626.9 KB/sec)
Downloading: http://repo.maven.apache.org/maven2/org/codehaus/plexus/plexus-interpolation/1.2/plexus-interpolation-1.2.pom
Downloaded: http://repo.maven.apache.org/maven2/org/codehaus/plexus/plexus-interpolation/1.2/plexus-interpolation-1.2.pom
(3 KB at 167.0 KB/sec)
Downloading: http://repo.maven.apache.org/maven2/org/apache/maven/shared/maven-invoker/2.1.1/maven-invoker-2.1.1.jar
Downloading: http://repo.maven.apache.org/maven2/org/apache/maven/doxia/doxia-core/1.1.2/doxia-core-1.1.2.jar
Downloading: http://repo.maven.apache.org/maven2/xerces/xercesImpl/2.8.1/xercesImpl-2.8.1.jar
Downloading: http://repo.maven.apache.org/maven2/commons-httpclient/commons-httpclient/3.1/commons-httpclient-3.1.jar
Downloading: http://repo.maven.apache.org/maven2/commons-codec/commons-codec/1.2/commons-codec-1.2.jar
Downloaded: http://repo.maven.apache.org/maven2/org/apache/maven/shared/maven-invoker/2.1.1/maven-invoker-2.1.1.jar
(30 KB at 967.9 KB/sec)
Downloading: http://repo.maven.apache.org/maven2/org/apache/maven/shared/maven-script-interpreter/1.1/maven-script-interpreter-1.1.jar
Downloaded: http://repo.maven.apache.org/maven2/commons-codec/commons-codec/1.2/commons-codec-1.2.jar
(30 KB at 773.2 KB/sec)
Downloading: http://repo.maven.apache.org/maven2/org/codehaus/groovy/groovy/2.0.1/groovy-2.0.1.jar
Downloaded: http://repo.maven.apache.org/maven2/org/apache/maven/shared/maven-script-interpreter/1.1/maven-script-interpreter-1.1.jar
(21 KB at 934.9 KB/sec)
Downloading: http://repo.maven.apache.org/maven2/antlr/antlr/2.7.7/antlr-2.7.7.jar
Downloaded: http://repo.maven.apache.org/maven2/org/apache/maven/doxia/doxia-core/1.1.2/doxia-core-1.1.2.jar
(155 KB at 2240.4 KB/sec)
Downloading: http://repo.maven.apache.org/maven2/org/ow2/asm/asm-tree/4.0/asm-tree-4.0.jar
Downloaded: http://repo.maven.apache.org/maven2/org/ow2/asm/asm-tree/4.0/asm-tree-4.0.jar
(22 KB at 1262.8 KB/sec)
Downloading: http://repo.maven.apache.org/maven2/org/ow2/asm/asm-commons/4.0/asm-commons-4.0.jar
Downloaded: http://repo.maven.apache.org/maven2/commons-httpclient/commons-httpclient/3.1/commons-httpclient-3.1.jar
(298 KB at 3588.6 KB/sec)
Downloading: http://repo.maven.apache.org/maven2/org/ow2/asm/asm/4.0/asm-4.0.jar
Downloaded: http://repo.maven.apache.org/maven2/org/ow2/asm/asm-commons/4.0/asm-commons-4.0.jar
(37 KB at 2049.5 KB/sec)
Downloading: http://repo.maven.apache.org/maven2/org/ow2/asm/asm-util/4.0/asm-util-4.0.jar
Downloaded: http://repo.maven.apache.org/maven2/org/ow2/asm/asm/4.0/asm-4.0.jar (45 KB at
2365.4 KB/sec)
Downloading: http://repo.maven.apache.org/maven2/org/ow2/asm/asm-analysis/4.0/asm-analysis-4.0.jar
Downloaded: http://repo.maven.apache.org/maven2/org/ow2/asm/asm-util/4.0/asm-util-4.0.jar
(37 KB at 2007.1 KB/sec)
Downloading: http://repo.maven.apache.org/maven2/org/apache/maven/doxia/doxia-sink-api/1.1.4/doxia-sink-api-1.1.4.jar
Downloaded: http://repo.maven.apache.org/maven2/org/ow2/asm/asm-analysis/4.0/asm-analysis-4.0.jar
(20 KB at 1126.7 KB/sec)
Downloading: http://repo.maven.apache.org/maven2/org/apache/maven/doxia/doxia-logging-api/1.1.4/doxia-logging-api-1.1.4.jar
Downloaded: http://repo.maven.apache.org/maven2/antlr/antlr/2.7.7/antlr-2.7.7.jar (435 KB
at 5368.5 KB/sec)
Downloading: http://repo.maven.apache.org/maven2/org/apache/maven/doxia/doxia-site-renderer/1.1.4/doxia-site-renderer-1.1.4.jar
Downloaded: http://repo.maven.apache.org/maven2/org/apache/maven/doxia/doxia-sink-api/1.1.4/doxia-sink-api-1.1.4.jar
(13 KB at 728.7 KB/sec)
Downloading: http://repo.maven.apache.org/maven2/org/apache/maven/doxia/doxia-decoration-model/1.1.4/doxia-decoration-model-1.1.4.jar
Downloaded: http://repo.maven.apache.org/maven2/org/apache/maven/doxia/doxia-logging-api/1.1.4/doxia-logging-api-1.1.4.jar
(12 KB at 651.2 KB/sec)
Downloading: http://repo.maven.apache.org/maven2/org/apache/maven/doxia/doxia-module-xhtml/1.1.4/doxia-module-xhtml-1.1.4.jar
Downloaded: http://repo.maven.apache.org/maven2/xerces/xercesImpl/2.8.1/xercesImpl-2.8.1.jar
(1185 KB at 8341.8 KB/sec)
Downloading: http://repo.maven.apache.org/maven2/org/apache/maven/doxia/doxia-module-fml/1.1.4/doxia-module-fml-1.1.4.jar
Downloaded: http://repo.maven.apache.org/maven2/org/apache/maven/doxia/doxia-site-renderer/1.1.4/doxia-site-renderer-1.1.4.jar
(50 KB at 2754.8 KB/sec)
Downloading: http://repo.maven.apache.org/maven2/commons-collections/commons-collections/3.2/commons-collections-3.2.jar
Downloaded: http://repo.maven.apache.org/maven2/org/apache/maven/doxia/doxia-module-xhtml/1.1.4/doxia-module-xhtml-1.1.4.jar
(15 KB at 815.4 KB/sec)
Downloading: http://repo.maven.apache.org/maven2/org/beanshell/bsh/2.0b4/bsh-2.0b4.jar
Downloaded: http://repo.maven.apache.org/maven2/org/apache/maven/doxia/doxia-module-fml/1.1.4/doxia-module-fml-1.1.4.jar
(37 KB at 2029.9 KB/sec)
Downloading: http://repo.maven.apache.org/maven2/org/codehaus/groovy/groovy-all/2.0.1/groovy-all-2.0.1.jar
Downloaded: http://repo.maven.apache.org/maven2/org/apache/maven/doxia/doxia-decoration-model/1.1.4/doxia-decoration-model-1.1.4.jar
(52 KB at 2221.7 KB/sec)
Downloading: http://repo.maven.apache.org/maven2/org/apache/ant/ant/1.8.1/ant-1.8.1.jar
Downloaded: http://repo.maven.apache.org/maven2/org/beanshell/bsh/2.0b4/bsh-2.0b4.jar (276
KB at 7859.8 KB/sec)
Downloading: http://repo.maven.apache.org/maven2/org/codehaus/plexus/plexus-utils/3.0.7/plexus-utils-3.0.7.jar
Downloaded: http://repo.maven.apache.org/maven2/commons-collections/commons-collections/3.2/commons-collections-3.2.jar
(558 KB at 8855.1 KB/sec)
Downloading: http://repo.maven.apache.org/maven2/org/codehaus/plexus/plexus-interpolation/1.2/plexus-interpolation-1.2.jar
Downloaded: http://repo.maven.apache.org/maven2/org/codehaus/plexus/plexus-utils/3.0.7/plexus-utils-3.0.7.jar
(226 KB at 7260.4 KB/sec)
Downloaded: http://repo.maven.apache.org/maven2/org/codehaus/plexus/plexus-interpolation/1.2/plexus-interpolation-1.2.jar
(36 KB at 1945.0 KB/sec)
Downloaded: http://repo.maven.apache.org/maven2/org/codehaus/groovy/groovy/2.0.1/groovy-2.0.1.jar
(3194 KB at 15209.4 KB/sec)
Downloaded: http://repo.maven.apache.org/maven2/org/apache/ant/ant/1.8.1/ant-1.8.1.jar (1479
KB at 14357.1 KB/sec)
Downloaded: http://repo.maven.apache.org/maven2/org/codehaus/groovy/groovy-all/2.0.1/groovy-all-2.0.1.jar
(6047 KB at 32164.0 KB/sec)
[INFO] Installing <https://builds.apache.org/job/Creadur-Whisker/ws/pom.xml> to <https://builds.apache.org/job/Creadur-Whisker/ws/apache-whisker-plugin4maven/target/local-repo/org/apache/creadur/whisker/apache-whisker/0.2-SNAPSHOT/apache-whisker-0.2-SNAPSHOT.pom>
[INFO] Installing <https://builds.apache.org/job/Creadur-Whisker/ws/target/apache-whisker-0.2-SNAPSHOT-site.xml>
to <https://builds.apache.org/job/Creadur-Whisker/ws/apache-whisker-plugin4maven/target/local-repo/org/apache/creadur/whisker/apache-whisker/0.2-SNAPSHOT/apache-whisker-0.2-SNAPSHOT-site.xml>
[INFO] Installing <https://builds.apache.org/job/Creadur-Whisker/ws/apache-whisker-model/pom.xml>
to <https://builds.apache.org/job/Creadur-Whisker/ws/apache-whisker-plugin4maven/target/local-repo/org/apache/creadur/whisker/apache-whisker-model/0.2-SNAPSHOT/apache-whisker-model-0.2-SNAPSHOT.pom>
[INFO] Installing <https://builds.apache.org/job/Creadur-Whisker/ws/apache-whisker-model/target/apache-whisker-model-0.2-SNAPSHOT.jar>
to <https://builds.apache.org/job/Creadur-Whisker/ws/apache-whisker-plugin4maven/target/local-repo/org/apache/creadur/whisker/apache-whisker-model/0.2-SNAPSHOT/apache-whisker-model-0.2-SNAPSHOT.jar>
[INFO] Installing <https://builds.apache.org/job/Creadur-Whisker/ws/apache-whisker-model/pom.xml>
to <https://builds.apache.org/job/Creadur-Whisker/ws/apache-whisker-plugin4maven/target/local-repo/org/apache/creadur/whisker/apache-whisker-model/0.2-SNAPSHOT/apache-whisker-model-0.2-SNAPSHOT.pom>
[INFO] Installing <https://builds.apache.org/job/Creadur-Whisker/ws/apache-whisker-scan/pom.xml>
to <https://builds.apache.org/job/Creadur-Whisker/ws/apache-whisker-plugin4maven/target/local-repo/org/apache/creadur/whisker/apache-whisker-scan/0.2-SNAPSHOT/apache-whisker-scan-0.2-SNAPSHOT.pom>
[INFO] Installing <https://builds.apache.org/job/Creadur-Whisker/ws/apache-whisker-scan/target/apache-whisker-scan-0.2-SNAPSHOT.jar>
to <https://builds.apache.org/job/Creadur-Whisker/ws/apache-whisker-plugin4maven/target/local-repo/org/apache/creadur/whisker/apache-whisker-scan/0.2-SNAPSHOT/apache-whisker-scan-0.2-SNAPSHOT.jar>
[INFO] Installing <https://builds.apache.org/job/Creadur-Whisker/ws/apache-whisker-scan/pom.xml>
to <https://builds.apache.org/job/Creadur-Whisker/ws/apache-whisker-plugin4maven/target/local-repo/org/apache/creadur/whisker/apache-whisker-scan/0.2-SNAPSHOT/apache-whisker-scan-0.2-SNAPSHOT.pom>
[INFO] Installing <https://builds.apache.org/job/Creadur-Whisker/ws/apache-whisker-xml/pom.xml>
to <https://builds.apache.org/job/Creadur-Whisker/ws/apache-whisker-plugin4maven/target/local-repo/org/apache/creadur/whisker/apache-whisker-xml/0.2-SNAPSHOT/apache-whisker-xml-0.2-SNAPSHOT.pom>
[INFO] Installing <https://builds.apache.org/job/Creadur-Whisker/ws/apache-whisker-xml/target/apache-whisker-xml-0.2-SNAPSHOT.jar>
to <https://builds.apache.org/job/Creadur-Whisker/ws/apache-whisker-plugin4maven/target/local-repo/org/apache/creadur/whisker/apache-whisker-xml/0.2-SNAPSHOT/apache-whisker-xml-0.2-SNAPSHOT.jar>
[INFO] Installing <https://builds.apache.org/job/Creadur-Whisker/ws/apache-whisker-xml/pom.xml>
to <https://builds.apache.org/job/Creadur-Whisker/ws/apache-whisker-plugin4maven/target/local-repo/org/apache/creadur/whisker/apache-whisker-xml/0.2-SNAPSHOT/apache-whisker-xml-0.2-SNAPSHOT.pom>
[INFO] Installing <https://builds.apache.org/job/Creadur-Whisker/ws/apache-whisker-app/pom.xml>
to <https://builds.apache.org/job/Creadur-Whisker/ws/apache-whisker-plugin4maven/target/local-repo/org/apache/creadur/whisker/apache-whisker-app/0.2-SNAPSHOT/apache-whisker-app-0.2-SNAPSHOT.pom>
[INFO] Installing <https://builds.apache.org/job/Creadur-Whisker/ws/apache-whisker-app/target/apache-whisker-app-0.2-SNAPSHOT.jar>
to <https://builds.apache.org/job/Creadur-Whisker/ws/apache-whisker-plugin4maven/target/local-repo/org/apache/creadur/whisker/apache-whisker-app/0.2-SNAPSHOT/apache-whisker-app-0.2-SNAPSHOT.jar>
[INFO] Installing <https://builds.apache.org/job/Creadur-Whisker/ws/apache-whisker-app/pom.xml>
to <https://builds.apache.org/job/Creadur-Whisker/ws/apache-whisker-plugin4maven/target/local-repo/org/apache/creadur/whisker/apache-whisker-app/0.2-SNAPSHOT/apache-whisker-app-0.2-SNAPSHOT.pom>
[INFO] Installing <https://builds.apache.org/job/Creadur-Whisker/ws/apache-whisker-velocity/pom.xml>
to <https://builds.apache.org/job/Creadur-Whisker/ws/apache-whisker-plugin4maven/target/local-repo/org/apache/creadur/whisker/apache-whisker-velocity/0.2-SNAPSHOT/apache-whisker-velocity-0.2-SNAPSHOT.pom>
[INFO] Installing <https://builds.apache.org/job/Creadur-Whisker/ws/apache-whisker-velocity/target/apache-whisker-velocity-0.2-SNAPSHOT.jar>
to <https://builds.apache.org/job/Creadur-Whisker/ws/apache-whisker-plugin4maven/target/local-repo/org/apache/creadur/whisker/apache-whisker-velocity/0.2-SNAPSHOT/apache-whisker-velocity-0.2-SNAPSHOT.jar>
[INFO] Installing <https://builds.apache.org/job/Creadur-Whisker/ws/apache-whisker-velocity/pom.xml>
to <https://builds.apache.org/job/Creadur-Whisker/ws/apache-whisker-plugin4maven/target/local-repo/org/apache/creadur/whisker/apache-whisker-velocity/0.2-SNAPSHOT/apache-whisker-velocity-0.2-SNAPSHOT.pom>
[INFO] Installing <https://builds.apache.org/job/Creadur-Whisker/ws/apache-whisker-cli/dependency-reduced-pom.xml>
to <https://builds.apache.org/job/Creadur-Whisker/ws/apache-whisker-plugin4maven/target/local-repo/org/apache/creadur/whisker/apache-whisker-cli/0.2-SNAPSHOT/apache-whisker-cli-0.2-SNAPSHOT.pom>
[INFO] Installing <https://builds.apache.org/job/Creadur-Whisker/ws/apache-whisker-cli/target/apache-whisker-0.2-SNAPSHOT.jar>
to <https://builds.apache.org/job/Creadur-Whisker/ws/apache-whisker-plugin4maven/target/local-repo/org/apache/creadur/whisker/apache-whisker-cli/0.2-SNAPSHOT/apache-whisker-cli-0.2-SNAPSHOT.jar>
[INFO] Installing <https://builds.apache.org/job/Creadur-Whisker/ws/apache-whisker-cli/dependency-reduced-pom.xml>
to <https://builds.apache.org/job/Creadur-Whisker/ws/apache-whisker-plugin4maven/target/local-repo/org/apache/creadur/whisker/apache-whisker-cli/0.2-SNAPSHOT/apache-whisker-cli-0.2-SNAPSHOT.pom>
[INFO] Installing <https://builds.apache.org/job/Creadur-Whisker/ws/apache-whisker-plugin4maven/pom.xml>
to <https://builds.apache.org/job/Creadur-Whisker/ws/apache-whisker-plugin4maven/target/local-repo/org/apache/creadur/whisker/apache-whisker-plugin4maven/0.2-SNAPSHOT/apache-whisker-plugin4maven-0.2-SNAPSHOT.pom>
[INFO] Installing <https://builds.apache.org/job/Creadur-Whisker/ws/apache-whisker-plugin4maven/target/apache-whisker-plugin4maven-0.2-SNAPSHOT.jar>
to <https://builds.apache.org/job/Creadur-Whisker/ws/apache-whisker-plugin4maven/target/local-repo/org/apache/creadur/whisker/apache-whisker-plugin4maven/0.2-SNAPSHOT/apache-whisker-plugin4maven-0.2-SNAPSHOT.jar>
[INFO] 
[INFO] --- maven-invoker-plugin:1.8:run (integration-test) @ apache-whisker-plugin4maven ---
[INFO] Building: example-copyright-notices/pom.xml
[INFO] run script verify.groovy
[INFO] ..SUCCESS (5.0 s)
[INFO] Building: in-5/pom.xml
[INFO] run script verify.groovy
[INFO] ..SUCCESS (3.2 s)
[INFO] Building: license-family/pom.xml
[INFO] run script verify.groovy
[INFO] ..SUCCESS (3.2 s)
[INFO] Building: whisker-10/pom.xml
[INFO] run script verify.groovy
[INFO] ..SUCCESS (3.4 s)
[INFO] Building: third-party-corp/pom.xml
[INFO] run script verify.groovy
[INFO] ..SUCCESS (3.1 s)
[INFO] Building: third-party-group/pom.xml
[INFO] run script verify.groovy
[INFO] ..SUCCESS (3.1 s)
[INFO] Building: primary-license-with-copyright-notice/pom.xml
[INFO] run script verify.groovy
[INFO] ..SUCCESS (3.1 s)
[INFO] Building: smoke4generate/pom.xml
[INFO] run script verify.bsh
[INFO] ..SUCCESS (3.3 s)
[INFO] Building: third-party/pom.xml
[INFO] run script verify.groovy
[INFO] ..SUCCESS (3.4 s)
[INFO] Building: minimal/pom.xml
[INFO] run script verify.groovy
[INFO] ..SUCCESS (3.5 s)
[INFO] -------------------------------------------------
[INFO] Build Summary:
[INFO]   Passed: 10, Failed: 0, Errors: 0, Skipped: 0
[INFO] -------------------------------------------------
[INFO] 
[INFO] --- maven-install-plugin:2.5.1:install (default-install) @ apache-whisker-plugin4maven
---
[INFO] Installing <https://builds.apache.org/job/Creadur-Whisker/ws/apache-whisker-plugin4maven/target/apache-whisker-plugin4maven-0.2-SNAPSHOT.jar>
to /jenkins/maven-repositories/0/org/apache/creadur/whisker/apache-whisker-plugin4maven/0.2-SNAPSHOT/apache-whisker-plugin4maven-0.2-SNAPSHOT.jar
[INFO] Installing <https://builds.apache.org/job/Creadur-Whisker/ws/apache-whisker-plugin4maven/pom.xml>
to /jenkins/maven-repositories/0/org/apache/creadur/whisker/apache-whisker-plugin4maven/0.2-SNAPSHOT/apache-whisker-plugin4maven-0.2-SNAPSHOT.pom
[INFO] ------------------------------------------------------------------------
[INFO] Reactor Summary:
[INFO] 
[INFO] Apache Whisker .................................... SUCCESS [2:03.143s]
[INFO] Apache Whisker::Model ............................. SUCCESS [45.368s]
[INFO] Apache Whisker::Scan .............................. SUCCESS [4.052s]
[INFO] Apache Whisker::XML ............................... SUCCESS [9.323s]
[INFO] Apache Whisker::App ............................... SUCCESS [12.393s]
[INFO] Apache Whisker::Output(velocity) .................. SUCCESS [6.899s]
[INFO] Apache Whisker::Command Line Interface ............ SUCCESS [11.743s]
[INFO] Apache Whisker::Plugin(Maven) ..................... SUCCESS [54.171s]
[INFO] ------------------------------------------------------------------------
[INFO] BUILD SUCCESS
[INFO] ------------------------------------------------------------------------
[INFO] Total time: 5:14.312s
[INFO] Finished at: Fri Aug 22 23:25:25 UTC 2014
[INFO] Final Memory: 27M/100M
[INFO] ------------------------------------------------------------------------
Waiting for Jenkins to finish collecting data
[JENKINS] Archiving <https://builds.apache.org/job/Creadur-Whisker/ws/pom.xml> to org.apache.creadur.whisker/apache-whisker/0.2-SNAPSHOT/apache-whisker-0.2-SNAPSHOT.pom
[JENKINS] Archiving <https://builds.apache.org/job/Creadur-Whisker/ws/target/apache-whisker-0.2-SNAPSHOT-site.xml>
to org.apache.creadur.whisker/apache-whisker/0.2-SNAPSHOT/apache-whisker-0.2-SNAPSHOT-site.xml
Sending artifact delta relative to Creadur-Whisker » Apache Whisker #9
Archived 2 artifacts
Archive block size is 32768
Received 0 blocks and 20463 bytes
Compression is 0.0%
Took 0.24 sec
[JENKINS] Archiving <https://builds.apache.org/job/Creadur-Whisker/ws/apache-whisker-model/pom.xml>
to org.apache.creadur.whisker/apache-whisker-model/0.2-SNAPSHOT/apache-whisker-model-0.2-SNAPSHOT.pom
[JENKINS] Archiving <https://builds.apache.org/job/Creadur-Whisker/ws/apache-whisker-model/target/apache-whisker-model-0.2-SNAPSHOT.jar>
to org.apache.creadur.whisker/apache-whisker-model/0.2-SNAPSHOT/apache-whisker-model-0.2-SNAPSHOT.jar
Sending artifact delta relative to Creadur-Whisker » Apache Whisker::Model #9
Archived 2 artifacts
Archive block size is 32768
Received 0 blocks and 29625 bytes
Compression is 0.0%
Took 0.39 sec
[JENKINS] Archiving <https://builds.apache.org/job/Creadur-Whisker/ws/apache-whisker-plugin4maven/pom.xml>
to org.apache.creadur.whisker/apache-whisker-plugin4maven/0.2-SNAPSHOT/apache-whisker-plugin4maven-0.2-SNAPSHOT.pom
[JENKINS] Archiving <https://builds.apache.org/job/Creadur-Whisker/ws/apache-whisker-plugin4maven/target/apache-whisker-plugin4maven-0.2-SNAPSHOT.jar>
to org.apache.creadur.whisker/apache-whisker-plugin4maven/0.2-SNAPSHOT/apache-whisker-plugin4maven-0.2-SNAPSHOT.jar
No prior successful build to compare, so performing full copy of artifacts
[JENKINS] Archiving <https://builds.apache.org/job/Creadur-Whisker/ws/apache-whisker-xml/pom.xml>
to org.apache.creadur.whisker/apache-whisker-xml/0.2-SNAPSHOT/apache-whisker-xml-0.2-SNAPSHOT.pom
[JENKINS] Archiving <https://builds.apache.org/job/Creadur-Whisker/ws/apache-whisker-xml/target/apache-whisker-xml-0.2-SNAPSHOT.jar>
to org.apache.creadur.whisker/apache-whisker-xml/0.2-SNAPSHOT/apache-whisker-xml-0.2-SNAPSHOT.jar
Sending artifact delta relative to Creadur-Whisker » Apache Whisker::XML #9
Archived 2 artifacts
Archive block size is 32768
Received 0 blocks and 18389 bytes
Compression is 0.0%
Took 2 sec
[JENKINS] Archiving <https://builds.apache.org/job/Creadur-Whisker/ws/apache-whisker-scan/pom.xml>
to org.apache.creadur.whisker/apache-whisker-scan/0.2-SNAPSHOT/apache-whisker-scan-0.2-SNAPSHOT.pom
[JENKINS] Archiving <https://builds.apache.org/job/Creadur-Whisker/ws/apache-whisker-scan/target/apache-whisker-scan-0.2-SNAPSHOT.jar>
to org.apache.creadur.whisker/apache-whisker-scan/0.2-SNAPSHOT/apache-whisker-scan-0.2-SNAPSHOT.jar
Sending artifact delta relative to Creadur-Whisker » Apache Whisker::Scan #9
Archived 2 artifacts
Archive block size is 32768
Received 0 blocks and 15284 bytes
Compression is 0.0%
Took 0.39 sec
[JENKINS] Archiving <https://builds.apache.org/job/Creadur-Whisker/ws/apache-whisker-app/pom.xml>
to org.apache.creadur.whisker/apache-whisker-app/0.2-SNAPSHOT/apache-whisker-app-0.2-SNAPSHOT.pom
[JENKINS] Archiving <https://builds.apache.org/job/Creadur-Whisker/ws/apache-whisker-app/target/apache-whisker-app-0.2-SNAPSHOT.jar>
to org.apache.creadur.whisker/apache-whisker-app/0.2-SNAPSHOT/apache-whisker-app-0.2-SNAPSHOT.jar
Sending artifact delta relative to Creadur-Whisker » Apache Whisker::App #9
Archived 2 artifacts
Archive block size is 32768
Received 0 blocks and 32952 bytes
Compression is 0.0%
Took 0.39 sec
[JENKINS] Archiving <https://builds.apache.org/job/Creadur-Whisker/ws/apache-whisker-cli/dependency-reduced-pom.xml>
to org.apache.creadur.whisker/apache-whisker-cli/0.2-SNAPSHOT/apache-whisker-cli-0.2-SNAPSHOT.pom
[JENKINS] Archiving <https://builds.apache.org/job/Creadur-Whisker/ws/apache-whisker-cli/target/apache-whisker-0.2-SNAPSHOT.jar>
to org.apache.creadur.whisker/apache-whisker-cli/0.2-SNAPSHOT/apache-whisker-cli-0.2-SNAPSHOT.jar
Sending artifact delta relative to Creadur-Whisker » Apache Whisker::Command Line Interface
#9
Archived 2 artifacts
Archive block size is 32768
Received 0 blocks and 2240697 bytes
Compression is 0.0%
Took 8.3 sec
[JENKINS] Archiving <https://builds.apache.org/job/Creadur-Whisker/ws/apache-whisker-velocity/pom.xml>
to org.apache.creadur.whisker/apache-whisker-velocity/0.2-SNAPSHOT/apache-whisker-velocity-0.2-SNAPSHOT.pom
[JENKINS] Archiving <https://builds.apache.org/job/Creadur-Whisker/ws/apache-whisker-velocity/target/apache-whisker-velocity-0.2-SNAPSHOT.jar>
to org.apache.creadur.whisker/apache-whisker-velocity/0.2-SNAPSHOT/apache-whisker-velocity-0.2-SNAPSHOT.jar
Sending artifact delta relative to Creadur-Whisker » Apache Whisker::Output(velocity) #9
Archived 2 artifacts
Archive block size is 32768
Received 0 blocks and 61531 bytes
Compression is 0.0%
Took 2.7 sec
channel stopped
Maven RedeployPublisher use remote jenkins-ubuntu-1404-4gb-ddc maven settings from : /home/jenkins/tools/maven/apache-maven-3.0.4/conf/settings.xml
[INFO] Deployment in https://repository.apache.org/content/repositories/snapshots (id=apache.snapshots.https,uniqueVersion=true)
Deploying the main artifact apache-whisker-0.2-SNAPSHOT.pom
Downloading: https://repository.apache.org/content/repositories/snapshots/org/apache/creadur/whisker/apache-whisker/0.2-SNAPSHOT/maven-metadata.xml
Downloaded: https://repository.apache.org/content/repositories/snapshots/org/apache/creadur/whisker/apache-whisker/0.2-SNAPSHOT/maven-metadata.xml
(822 B at 11.5 KB/sec)
Uploading: https://repository.apache.org/content/repositories/snapshots/org/apache/creadur/whisker/apache-whisker/0.2-SNAPSHOT/apache-whisker-0.2-20140822.232636-10.pom
ERROR: Failed to deploy artifacts: Could not transfer artifact org.apache.creadur.whisker:apache-whisker:pom:0.2-20140822.232636-10
from/to apache.snapshots.https (https://repository.apache.org/content/repositories/snapshots):
Failed to transfer file: https://repository.apache.org/content/repositories/snapshots/org/apache/creadur/whisker/apache-whisker/0.2-SNAPSHOT/apache-whisker-0.2-20140822.232636-10.pom.
Return code is: 401, ReasonPhrase: Unauthorized.
org.apache.maven.artifact.deployer.ArtifactDeploymentException: Failed to deploy artifacts:
Could not transfer artifact org.apache.creadur.whisker:apache-whisker:pom:0.2-20140822.232636-10
from/to apache.snapshots.https (https://repository.apache.org/content/repositories/snapshots):
Failed to transfer file: https://repository.apache.org/content/repositories/snapshots/org/apache/creadur/whisker/apache-whisker/0.2-SNAPSHOT/apache-whisker-0.2-20140822.232636-10.pom.
Return code is: 401, ReasonPhrase: Unauthorized.
	at org.apache.maven.artifact.deployer.DefaultArtifactDeployer.deploy(DefaultArtifactDeployer.java:143)
	at hudson.maven.reporters.MavenArtifactRecord.deploy(MavenArtifactRecord.java:193)
	at hudson.maven.RedeployPublisher.perform(RedeployPublisher.java:176)
	at hudson.tasks.BuildStepMonitor$1.perform(BuildStepMonitor.java:20)
	at hudson.model.AbstractBuild$AbstractBuildExecution.perform(AbstractBuild.java:804)
	at hudson.model.AbstractBuild$AbstractBuildExecution.performAllBuildSteps(AbstractBuild.java:776)
	at hudson.maven.MavenModuleSetBuild$MavenModuleSetBuildExecution.post2(MavenModuleSetBuild.java:1040)
	at hudson.model.AbstractBuild$AbstractBuildExecution.post(AbstractBuild.java:725)
	at hudson.model.Run.execute(Run.java:1701)
	at hudson.maven.MavenModuleSetBuild.run(MavenModuleSetBuild.java:529)
	at hudson.model.ResourceController.execute(ResourceController.java:88)
	at hudson.model.Executor.run(Executor.java:231)
Caused by: org.eclipse.aether.deployment.DeploymentException: Failed to deploy artifacts:
Could not transfer artifact org.apache.creadur.whisker:apache-whisker:pom:0.2-20140822.232636-10
from/to apache.snapshots.https (https://repository.apache.org/content/repositories/snapshots):
Failed to transfer file: https://repository.apache.org/content/repositories/snapshots/org/apache/creadur/whisker/apache-whisker/0.2-SNAPSHOT/apache-whisker-0.2-20140822.232636-10.pom.
Return code is: 401, ReasonPhrase: Unauthorized.
	at org.eclipse.aether.internal.impl.DefaultDeployer.deploy(DefaultDeployer.java:341)
	at org.eclipse.aether.internal.impl.DefaultDeployer.deploy(DefaultDeployer.java:269)
	at org.eclipse.aether.internal.impl.DefaultRepositorySystem.deploy(DefaultRepositorySystem.java:413)
	at org.apache.maven.artifact.deployer.DefaultArtifactDeployer.deploy(DefaultArtifactDeployer.java:139)
	... 11 more
Caused by: org.eclipse.aether.transfer.ArtifactTransferException: Could not transfer artifact
org.apache.creadur.whisker:apache-whisker:pom:0.2-20140822.232636-10 from/to apache.snapshots.https
(https://repository.apache.org/content/repositories/snapshots): Failed to transfer file: https://repository.apache.org/content/repositories/snapshots/org/apache/creadur/whisker/apache-whisker/0.2-SNAPSHOT/apache-whisker-0.2-20140822.232636-10.pom.
Return code is: 401, ReasonPhrase: Unauthorized.
	at org.eclipse.aether.connector.wagon.WagonRepositoryConnector$6.wrap(WagonRepositoryConnector.java:1016)
	at org.eclipse.aether.connector.wagon.WagonRepositoryConnector$6.wrap(WagonRepositoryConnector.java:1004)
	at org.eclipse.aether.connector.wagon.WagonRepositoryConnector$PutTask.run(WagonRepositoryConnector.java:895)
	at org.eclipse.aether.connector.wagon.WagonRepositoryConnector.put(WagonRepositoryConnector.java:522)
	at org.eclipse.aether.internal.impl.DefaultDeployer.deploy(DefaultDeployer.java:335)
	... 14 more
Caused by: org.apache.maven.wagon.TransferFailedException: Failed to transfer file: https://repository.apache.org/content/repositories/snapshots/org/apache/creadur/whisker/apache-whisker/0.2-SNAPSHOT/apache-whisker-0.2-20140822.232636-10.pom.
Return code is: 401, ReasonPhrase: Unauthorized.
	at org.apache.maven.wagon.shared.http4.AbstractHttpClientWagon.put(AbstractHttpClientWagon.java:626)
	at org.apache.maven.wagon.shared.http4.AbstractHttpClientWagon.put(AbstractHttpClientWagon.java:524)
	at org.apache.maven.wagon.shared.http4.AbstractHttpClientWagon.put(AbstractHttpClientWagon.java:505)
	at org.apache.maven.wagon.shared.http4.AbstractHttpClientWagon.put(AbstractHttpClientWagon.java:485)
	at org.eclipse.aether.connector.wagon.WagonRepositoryConnector$PutTask.run(WagonRepositoryConnector.java:871)
	... 16 more
[INFO] Deployment failed after 8.1 sec
Build step 'Deploy artifacts to Maven repository' changed build result to FAILURE

Mime
View raw message