creadur-dev mailing list archives

Site index · List index
Message view « Date » · « Thread »
Top « Date » · « Thread »
From Apache Jenkins Server <jenk...@builds.apache.org>
Subject Build failed in Jenkins: Creadur-Tentacles-Site #9
Date Thu, 21 Aug 2014 07:39:53 GMT
See <https://builds.apache.org/job/Creadur-Tentacles-Site/9/>

------------------------------------------
Started by user pottlinger
Building remotely on windows2 (Windows) in workspace <https://builds.apache.org/job/Creadur-Tentacles-Site/ws/>
Cleaning local Directory .
Checking out http://svn.apache.org/repos/asf/creadur/tentacles/trunk at revision '2014-08-21T00:37:57.048
-0700'
A         .gitignore
A         src
A         src\test
A         src\test\java
A         src\test\java\org
A         src\test\java\org\apache
A         src\test\java\org\apache\creadur
A         src\test\java\org\apache\creadur\tentacles
AU        src\test\java\org\apache\creadur\tentacles\ArchivesJsonTest.java
A         src\test\java\org\apache\creadur\tentacles\filter
A         src\test\java\org\apache\creadur\tentacles\filter\ListOfFilesFilterTest.java
A         src\main
A         src\main\resources
A         src\main\resources\legal
A         src\main\resources\legal\archive-notices.vm
A         src\main\resources\legal\archive-licenses.vm
A         src\main\resources\legal\archives.vm
A         src\main\resources\legal\notices.vm
A         src\main\resources\legal\licenses.vm
A         src\main\resources\legal\style.css
A         src\main\resources\licenses
A         src\main\resources\licenses\cpl-1.0.txt
A         src\main\resources\licenses\asl-2.0.txt
A         src\main\resources\licenses\cddl-1.0.txt
A         src\main\java
A         src\main\java\org
A         src\main\java\org\apache
A         src\main\java\org\apache\creadur
A         src\main\java\org\apache\creadur\tentacles
A         src\main\java\org\apache\creadur\tentacles\filter
AU        src\main\java\org\apache\creadur\tentacles\filter\NotFilter.java
AU        src\main\java\org\apache\creadur\tentacles\filter\IsArchiveInPathFilter.java
AU        src\main\java\org\apache\creadur\tentacles\filter\NoticeFilter.java
AU        src\main\java\org\apache\creadur\tentacles\filter\AndFilter.java
AU        src\main\java\org\apache\creadur\tentacles\filter\Filters.java
AU        src\main\java\org\apache\creadur\tentacles\filter\LicenseFilter.java
AU        src\main\java\org\apache\creadur\tentacles\filter\DeclaredFilter.java
A         src\main\java\org\apache\creadur\tentacles\filter\ListOfFilesFilter.java
AU        src\main\java\org\apache\creadur\tentacles\filter\FilesOnlyFilter.java
AU        src\main\java\org\apache\creadur\tentacles\filter\LegalFilter.java
AU        src\main\java\org\apache\creadur\tentacles\Licenses.java
AU        src\main\java\org\apache\creadur\tentacles\Configuration.java
A         src\main\java\org\apache\creadur\tentacles\IOSystem.java
AU        src\main\java\org\apache\creadur\tentacles\TentaclesResources.java
AU        src\main\java\org\apache\creadur\tentacles\Layout.java
A         src\main\java\org\apache\creadur\tentacles\model
AU        src\main\java\org\apache\creadur\tentacles\model\Archives.java
AU        src\main\java\org\apache\creadur\tentacles\Archive.java
AU        src\main\java\org\apache\creadur\tentacles\Notice.java
AU        src\main\java\org\apache\creadur\tentacles\RepositoryType.java
AU        src\main\java\org\apache\creadur\tentacles\TemplateBuilder.java
AU        src\main\java\org\apache\creadur\tentacles\License.java
A         src\main\java\org\apache\creadur\tentacles\Deauthorize.java
AU        src\main\java\org\apache\creadur\tentacles\Platform.java
A         src\main\java\org\apache\creadur\tentacles\Main.java
AU        src\main\java\org\apache\creadur\tentacles\LicenseType.java
A         src\main\java\org\apache\creadur\tentacles\FileSystem.java
A         src\main\java\org\apache\creadur\tentacles\Templates.java
AU        src\main\java\org\apache\creadur\tentacles\ArchivesJson.java
AU        src\main\java\org\apache\creadur\tentacles\Reports.java
A         src\main\java\org\apache\creadur\tentacles\NexusClient.java
A         pom.xml
AU        NOTICE
A         README.mdtext
AU        LICENSE
 U        .
At revision 1619303
no change for http://svn.apache.org/repos/asf/creadur/tentacles/trunk since the previous build
Parsing POMs
maven31-agent.jar already up to date
maven31-interceptor.jar already up to date
maven3-interceptor-commons.jar already up to date
[Creadur-Tentacles-Site] $ f:\jenkins\tools\java\latest-1.6-64/bin/java -cp f:\jenkins\jenkins-slave\maven31-agent.jar;f:\jenkins\tools\maven\latest3\boot\plexus-classworlds-2.5.1.jar;f:\jenkins\tools\maven\latest3/conf/logging
jenkins.maven3.agent.Maven31Main f:\jenkins\tools\maven\latest3 F:\jenkins\jenkins-slave\slave.jar
f:\jenkins\jenkins-slave\maven31-interceptor.jar f:\jenkins\jenkins-slave\maven3-interceptor-commons.jar
63928
<===[JENKINS REMOTING CAPACITY]===>   channel started
log4j:WARN No appenders could be found for logger (org.apache.commons.beanutils.converters.BooleanConverter).
log4j:WARN Please initialize the log4j system properly.
Executing Maven:  -B -f <https://builds.apache.org/job/Creadur-Tentacles-Site/ws/pom.xml>
-Dmaven.repo.local=f:\jenkins\jenkins-slave\maven-repositories\1 -e deploy site
[INFO] Error stacktraces are turned on.
[INFO] Scanning for projects...
[INFO]                                                                         
[INFO] ------------------------------------------------------------------------
[INFO] Building Apache Tentacles 0.1-SNAPSHOT
[INFO] ------------------------------------------------------------------------
[INFO] 
[INFO] --- maven-remote-resources-plugin:1.5:process (default) @ apache-tentacles ---
[INFO] 
[INFO] --- maven-resources-plugin:2.6:resources (default-resources) @ apache-tentacles ---
[INFO] Using 'UTF-8' encoding to copy filtered resources.
[INFO] Copying 9 resources
[INFO] Copying 3 resources
[INFO] 
[INFO] --- maven-compiler-plugin:3.1:compile (default-compile) @ apache-tentacles ---
[INFO] Changes detected - recompiling the module!
[INFO] Compiling 30 source files to <https://builds.apache.org/job/Creadur-Tentacles-Site/ws/target\classes>
[INFO] 
[INFO] --- maven-resources-plugin:2.6:testResources (default-testResources) @ apache-tentacles
---
[INFO] Using 'UTF-8' encoding to copy filtered resources.
[INFO] skip non existing resourceDirectory <https://builds.apache.org/job/Creadur-Tentacles-Site/ws/src\test\resources>
[INFO] Copying 3 resources
[INFO] 
[INFO] --- maven-compiler-plugin:3.1:testCompile (default-testCompile) @ apache-tentacles
---
[INFO] Changes detected - recompiling the module!
[INFO] Compiling 2 source files to <https://builds.apache.org/job/Creadur-Tentacles-Site/ws/target\test-classes>
[INFO] 
[INFO] --- maven-surefire-plugin:2.16:test (default-test) @ apache-tentacles ---
[INFO] Surefire report directory: <https://builds.apache.org/job/Creadur-Tentacles-Site/ws/target\surefire-reports>

-------------------------------------------------------
 T E S T S
-------------------------------------------------------
Running org.apache.creadur.tentacles.ArchivesJsonTest
{
  "archives" : [ {
    "path" : "one/two/hello.jar",
    "name" : "hello.jar",
    "type" : null,
    "jars" : 0,
    "license" : null,
    "notice" : null
  } ]
}Tests run: 1, Failures: 0, Errors: 0, Skipped: 0, Time elapsed: 0.25 sec - in org.apache.creadur.tentacles.ArchivesJsonTest
Running org.apache.creadur.tentacles.filter.ListOfFilesFilterTest
Tests run: 1, Failures: 0, Errors: 0, Skipped: 0, Time elapsed: 0.001 sec - in org.apache.creadur.tentacles.filter.ListOfFilesFilterTest

Results :

Tests run: 2, Failures: 0, Errors: 0, Skipped: 0

[JENKINS] Recording test results
[INFO] 
[INFO] --- maven-jar-plugin:2.4:jar (default-jar) @ apache-tentacles ---
[INFO] Building jar: <https://builds.apache.org/job/Creadur-Tentacles-Site/ws/target\apache-tentacles-0.1-SNAPSHOT.jar>
[INFO] 
[INFO] --- maven-assembly-plugin:2.4:single (make-assembly) @ apache-tentacles ---
[INFO] Building jar: <https://builds.apache.org/job/Creadur-Tentacles-Site/ws/target\apache-tentacles-0.1-SNAPSHOT-jar-with-dependencies.jar>
[INFO] 
[INFO] --- maven-site-plugin:3.4:attach-descriptor (attach-descriptor) @ apache-tentacles
---
[INFO] 
[INFO] --- maven-install-plugin:2.5.1:install (default-install) @ apache-tentacles ---
[INFO] Installing <https://builds.apache.org/job/Creadur-Tentacles-Site/ws/target\apache-tentacles-0.1-SNAPSHOT.jar>
to f:\jenkins\jenkins-slave\maven-repositories\1\org\apache\creadur\tentacles\apache-tentacles\0.1-SNAPSHOT\apache-tentacles-0.1-SNAPSHOT.jar
[INFO] Installing <https://builds.apache.org/job/Creadur-Tentacles-Site/ws/pom.xml>
to f:\jenkins\jenkins-slave\maven-repositories\1\org\apache\creadur\tentacles\apache-tentacles\0.1-SNAPSHOT\apache-tentacles-0.1-SNAPSHOT.pom
[INFO] Installing <https://builds.apache.org/job/Creadur-Tentacles-Site/ws/target\apache-tentacles-0.1-SNAPSHOT-jar-with-dependencies.jar>
to f:\jenkins\jenkins-slave\maven-repositories\1\org\apache\creadur\tentacles\apache-tentacles\0.1-SNAPSHOT\apache-tentacles-0.1-SNAPSHOT-jar-with-dependencies.jar
[INFO] 
[INFO] --- maven-deploy-plugin:2.8.1:deploy (default-deploy) @ apache-tentacles ---
[INFO] Downloading: https://repository.apache.org/content/repositories/snapshots/org/apache/creadur/tentacles/apache-tentacles/0.1-SNAPSHOT/maven-metadata.xml
[WARNING] Could not transfer metadata org.apache.creadur.tentacles:apache-tentacles:0.1-SNAPSHOT/maven-metadata.xml
from/to apache.snapshots.https (https://repository.apache.org/content/repositories/snapshots):
Failed to transfer file: https://repository.apache.org/content/repositories/snapshots/org/apache/creadur/tentacles/apache-tentacles/0.1-SNAPSHOT/maven-metadata.xml.
Return code is: 503 , ReasonPhrase:Service Temporarily Unavailable.
[INFO] ------------------------------------------------------------------------
[INFO] BUILD FAILURE
[INFO] ------------------------------------------------------------------------
[INFO] Total time: 1:36.255s
[INFO] Finished at: Thu Aug 21 00:39:15 PDT 2014
[INFO] Final Memory: 17M/61M
[INFO] ------------------------------------------------------------------------
Waiting for Jenkins to finish collecting data
[ERROR] Failed to execute goal org.apache.maven.plugins:maven-deploy-plugin:2.8.1:deploy (default-deploy)
on project apache-tentacles: Failed to retrieve remote metadata org.apache.creadur.tentacles:apache-tentacles:0.1-SNAPSHOT/maven-metadata.xml:
Could not transfer metadata org.apache.creadur.tentacles:apache-tentacles:0.1-SNAPSHOT/maven-metadata.xml
from/to apache.snapshots.https (https://repository.apache.org/content/repositories/snapshots):
Failed to transfer file: https://repository.apache.org/content/repositories/snapshots/org/apache/creadur/tentacles/apache-tentacles/0.1-SNAPSHOT/maven-metadata.xml.
Return code is: 503 , ReasonPhrase:Service Temporarily Unavailable. -> [Help 1]
org.apache.maven.lifecycle.LifecycleExecutionException: Failed to execute goal org.apache.maven.plugins:maven-deploy-plugin:2.8.1:deploy
(default-deploy) on project apache-tentacles: Failed to retrieve remote metadata org.apache.creadur.tentacles:apache-tentacles:0.1-SNAPSHOT/maven-metadata.xml:
Could not transfer metadata org.apache.creadur.tentacles:apache-tentacles:0.1-SNAPSHOT/maven-metadata.xml
from/to apache.snapshots.https (https://repository.apache.org/content/repositories/snapshots):
Failed to transfer file: https://repository.apache.org/content/repositories/snapshots/org/apache/creadur/tentacles/apache-tentacles/0.1-SNAPSHOT/maven-metadata.xml.
Return code is: 503 , ReasonPhrase:Service Temporarily Unavailable.
	at org.apache.maven.lifecycle.internal.MojoExecutor.execute(MojoExecutor.java:216)
	at org.apache.maven.lifecycle.internal.MojoExecutor.execute(MojoExecutor.java:153)
	at org.apache.maven.lifecycle.internal.MojoExecutor.execute(MojoExecutor.java:145)
	at org.apache.maven.lifecycle.internal.LifecycleModuleBuilder.buildProject(LifecycleModuleBuilder.java:84)
	at org.apache.maven.lifecycle.internal.LifecycleModuleBuilder.buildProject(LifecycleModuleBuilder.java:59)
	at org.apache.maven.lifecycle.internal.LifecycleStarter.singleThreadedBuild(LifecycleStarter.java:183)
	at org.apache.maven.lifecycle.internal.LifecycleStarter.execute(LifecycleStarter.java:161)
	at org.apache.maven.DefaultMaven.doExecute(DefaultMaven.java:317)
	at org.apache.maven.DefaultMaven.execute(DefaultMaven.java:152)
	at org.jvnet.hudson.maven3.launcher.Maven31Launcher.main(Maven31Launcher.java:132)
	at sun.reflect.NativeMethodAccessorImpl.invoke0(Native Method)
	at sun.reflect.NativeMethodAccessorImpl.invoke(NativeMethodAccessorImpl.java:39)
	at sun.reflect.DelegatingMethodAccessorImpl.invoke(DelegatingMethodAccessorImpl.java:25)
	at java.lang.reflect.Method.invoke(Method.java:597)
	at org.codehaus.plexus.classworlds.launcher.Launcher.launchStandard(Launcher.java:330)
	at org.codehaus.plexus.classworlds.launcher.Launcher.launch(Launcher.java:238)
	at jenkins.maven3.agent.Maven31Main.launch(Maven31Main.java:181)
	at sun.reflect.NativeMethodAccessorImpl.invoke0(Native Method)
	at sun.reflect.NativeMethodAccessorImpl.invoke(NativeMethodAccessorImpl.java:39)
	at sun.reflect.DelegatingMethodAccessorImpl.invoke(DelegatingMethodAccessorImpl.java:25)
	at java.lang.reflect.Method.invoke(Method.java:597)
	at hudson.maven.Maven3Builder.call(Maven3Builder.java:134)
	at hudson.maven.Maven3Builder.call(Maven3Builder.java:69)
	at hudson.remoting.UserRequest.perform(UserRequest.java:118)
	at hudson.remoting.UserRequest.perform(UserRequest.java:48)
	at hudson.remoting.Request$2.run(Request.java:328)
	at hudson.remoting.InterceptingExecutorService$1.call(InterceptingExecutorService.java:72)
	at java.util.concurrent.FutureTask$Sync.innerRun(FutureTask.java:303)
	at java.util.concurrent.FutureTask.run(FutureTask.java:138)
	at java.util.concurrent.ThreadPoolExecutor$Worker.runTask(ThreadPoolExecutor.java:886)
	at java.util.concurrent.ThreadPoolExecutor$Worker.run(ThreadPoolExecutor.java:908)
	at java.lang.Thread.run(Thread.java:662)
Caused by: org.apache.maven.plugin.MojoExecutionException: Failed to retrieve remote metadata
org.apache.creadur.tentacles:apache-tentacles:0.1-SNAPSHOT/maven-metadata.xml: Could not transfer
metadata org.apache.creadur.tentacles:apache-tentacles:0.1-SNAPSHOT/maven-metadata.xml from/to
apache.snapshots.https (https://repository.apache.org/content/repositories/snapshots): Failed
to transfer file: https://repository.apache.org/content/repositories/snapshots/org/apache/creadur/tentacles/apache-tentacles/0.1-SNAPSHOT/maven-metadata.xml.
Return code is: 503 , ReasonPhrase:Service Temporarily Unavailable.
	at org.apache.maven.plugin.deploy.DeployMojo.deployProject(DeployMojo.java:282)
	at org.apache.maven.plugin.deploy.DeployMojo.execute(DeployMojo.java:169)
	at org.apache.maven.plugin.DefaultBuildPluginManager.executeMojo(DefaultBuildPluginManager.java:106)
	at org.apache.maven.lifecycle.internal.MojoExecutor.execute(MojoExecutor.java:208)
	... 31 more
Caused by: org.apache.maven.artifact.deployer.ArtifactDeploymentException: Failed to retrieve
remote metadata org.apache.creadur.tentacles:apache-tentacles:0.1-SNAPSHOT/maven-metadata.xml:
Could not transfer metadata org.apache.creadur.tentacles:apache-tentacles:0.1-SNAPSHOT/maven-metadata.xml
from/to apache.snapshots.https (https://repository.apache.org/content/repositories/snapshots):
Failed to transfer file: https://repository.apache.org/content/repositories/snapshots/org/apache/creadur/tentacles/apache-tentacles/0.1-SNAPSHOT/maven-metadata.xml.
Return code is: 503 , ReasonPhrase:Service Temporarily Unavailable.
	at org.apache.maven.artifact.deployer.DefaultArtifactDeployer.deploy(DefaultArtifactDeployer.java:143)
	at org.apache.maven.plugin.deploy.AbstractDeployMojo.deploy(AbstractDeployMojo.java:171)
	at org.apache.maven.plugin.deploy.DeployMojo.deployProject(DeployMojo.java:248)
	... 34 more
Caused by: org.eclipse.aether.deployment.DeploymentException: Failed to retrieve remote metadata
org.apache.creadur.tentacles:apache-tentacles:0.1-SNAPSHOT/maven-metadata.xml: Could not transfer
metadata org.apache.creadur.tentacles:apache-tentacles:0.1-SNAPSHOT/maven-metadata.xml from/to
apache.snapshots.https (https://repository.apache.org/content/repositories/snapshots): Failed
to transfer file: https://repository.apache.org/content/repositories/snapshots/org/apache/creadur/tentacles/apache-tentacles/0.1-SNAPSHOT/maven-metadata.xml.
Return code is: 503 , ReasonPhrase:Service Temporarily Unavailable.
	at org.eclipse.aether.internal.impl.DefaultDeployer.upload(DefaultDeployer.java:463)
	at org.eclipse.aether.internal.impl.DefaultDeployer.deploy(DefaultDeployer.java:313)
	at org.eclipse.aether.internal.impl.DefaultDeployer.deploy(DefaultDeployer.java:268)
	at org.eclipse.aether.internal.impl.DefaultRepositorySystem.deploy(DefaultRepositorySystem.java:413)
	at org.apache.maven.artifact.deployer.DefaultArtifactDeployer.deploy(DefaultArtifactDeployer.java:139)
	... 36 more
Caused by: org.eclipse.aether.transfer.MetadataTransferException: Could not transfer metadata
org.apache.creadur.tentacles:apache-tentacles:0.1-SNAPSHOT/maven-metadata.xml from/to apache.snapshots.https
(https://repository.apache.org/content/repositories/snapshots): Failed to transfer file: https://repository.apache.org/content/repositories/snapshots/org/apache/creadur/tentacles/apache-tentacles/0.1-SNAPSHOT/maven-metadata.xml.
Return code is: 503 , ReasonPhrase:Service Temporarily Unavailable.
	at org.eclipse.aether.connector.wagon.WagonRepositoryConnector$5.wrap(WagonRepositoryConnector.java:995)
	at org.eclipse.aether.connector.wagon.WagonRepositoryConnector$5.wrap(WagonRepositoryConnector.java:983)
	at org.eclipse.aether.connector.wagon.WagonRepositoryConnector$GetTask.run(WagonRepositoryConnector.java:725)
	at org.eclipse.aether.util.concurrency.RunnableErrorForwarder$1.run(RunnableErrorForwarder.java:67)
	... 3 more
Caused by: org.apache.maven.wagon.TransferFailedException: Failed to transfer file: https://repository.apache.org/content/repositories/snapshots/org/apache/creadur/tentacles/apache-tentacles/0.1-SNAPSHOT/maven-metadata.xml.
Return code is: 503 , ReasonPhrase:Service Temporarily Unavailable.
	at org.apache.maven.wagon.shared.http4.AbstractHttpClientWagon.fillInputData(AbstractHttpClientWagon.java:945)
	at org.apache.maven.wagon.StreamWagon.getInputStream(StreamWagon.java:116)
	at org.apache.maven.wagon.StreamWagon.getIfNewer(StreamWagon.java:88)
	at org.apache.maven.wagon.StreamWagon.get(StreamWagon.java:61)
	at org.eclipse.aether.connector.wagon.WagonRepositoryConnector$GetTask.run(WagonRepositoryConnector.java:660)
	... 4 more
[ERROR] 
[ERROR] Re-run Maven using the -X switch to enable full debug logging.
[ERROR] 
[ERROR] For more information about the errors and possible solutions, please read the following
articles:
[ERROR] [Help 1] http://cwiki.apache.org/confluence/display/MAVEN/MojoExecutionException
[JENKINS] Archiving <https://builds.apache.org/job/Creadur-Tentacles-Site/ws/pom.xml>
to org.apache.creadur.tentacles/apache-tentacles/0.1-SNAPSHOT/apache-tentacles-0.1-SNAPSHOT.pom
[JENKINS] Archiving <https://builds.apache.org/job/Creadur-Tentacles-Site/ws/target\apache-tentacles-0.1-SNAPSHOT.jar>
to org.apache.creadur.tentacles/apache-tentacles/0.1-SNAPSHOT/apache-tentacles-0.1-SNAPSHOT.jar
[JENKINS] Archiving <https://builds.apache.org/job/Creadur-Tentacles-Site/ws/target\apache-tentacles-0.1-SNAPSHOT-jar-with-dependencies.jar>
to org.apache.creadur.tentacles/apache-tentacles/0.1-SNAPSHOT/apache-tentacles-0.1-SNAPSHOT-jar-with-dependencies.jar
Sending artifact delta relative to Creadur-Tentacles-Site ยป Apache Tentacles #1
Archived 3 artifacts
Archive block size is 32768
Received 105 blocks and 1004652 bytes
Compression is 77.4%
Took 1.5 sec
channel stopped

Mime
View raw message