creadur-dev mailing list archives

Site index · List index
Message view « Date » · « Thread »
Top « Date » · « Thread »
From Apache Jenkins Server <jenk...@builds.apache.org>
Subject Build failed in Jenkins: Creadur-Rat #103
Date Fri, 15 Aug 2014 08:39:37 GMT
See <https://builds.apache.org/job/Creadur-Rat/103/changes>

Changes:

[pottlinger] Adapting new test file locations to fix build failures due to wrong paths in
RAT-exclusions.

[dennisl] Roll back version numbers in preparation for a new release candidate.

------------------------------------------
[...truncated 427 lines...]
[INFO] Copying 1 resource to META-INF
[INFO] Copying 3 resources
[INFO] 
[INFO] --- maven-compiler-plugin:3.1:compile (default-compile) @ apache-rat-tasks ---
[INFO] Changes detected - recompiling the module!
[INFO] Compiling 4 source files to <https://builds.apache.org/job/Creadur-Rat/ws/apache-rat-tasks/target/classes>
[INFO] 
[INFO] --- animal-sniffer-maven-plugin:1.11:check (check-java-1.5-compat) @ apache-rat-tasks
---
[INFO] Checking unresolved references to org.codehaus.mojo.signature:java15:1.0
[INFO] 
[INFO] --- maven-dependency-plugin:2.8:copy-dependencies (default) @ apache-rat-tasks ---
[INFO] Copying ant-antunit-1.1.jar to <https://builds.apache.org/job/Creadur-Rat/ws/apache-rat-tasks/target/dependencies/ant-antunit.jar>
[INFO] 
[INFO] --- maven-resources-plugin:2.6:testResources (default-testResources) @ apache-rat-tasks
---
[INFO] Using 'UTF-8' encoding to copy filtered resources.
[INFO] Copying 5 resources
[INFO] Copying 3 resources
[INFO] 
[INFO] --- maven-compiler-plugin:3.1:testCompile (default-testCompile) @ apache-rat-tasks
---
[INFO] Changes detected - recompiling the module!
[INFO] Compiling 4 source files to <https://builds.apache.org/job/Creadur-Rat/ws/apache-rat-tasks/target/test-classes>
[INFO] 
[INFO] --- maven-surefire-plugin:2.17:test (default-test) @ apache-rat-tasks ---
[INFO] Surefire report directory: <https://builds.apache.org/job/Creadur-Rat/ws/apache-rat-tasks/target/surefire-reports>

-------------------------------------------------------
 T E S T S
-------------------------------------------------------
Running org.apache.rat.anttasks.ReportTest
Tests run: 7, Failures: 0, Errors: 0, Skipped: 0, Time elapsed: 0.74 sec - in org.apache.rat.anttasks.ReportTest

Results :

Tests run: 7, Failures: 0, Errors: 0, Skipped: 0

[JENKINS] Recording test results
[INFO] 
[INFO] --- maven-antrun-plugin:1.7:run (default) @ apache-rat-tasks ---
[INFO] Executing tasks

main:

allTests:
[au:antunit] Build File: <https://builds.apache.org/job/Creadur-Rat/ws/apache-rat-tasks/src/test/resources/antunit/report-bad-configurations.xml>
[au:antunit] Tests run: 10, Failures: 0, Errors: 0, Time elapsed: 0.283 sec
[au:antunit] Target: testNoStylesheet took 0.003 sec
[au:antunit] Target: testNoResources took 0.001 sec
[au:antunit] Target: testSubstringMatcherRequiresFamilyName took 0.078 sec
[au:antunit] Target: testFullTextMatcherRequiresFamilyName took 0.021 sec
[au:antunit] Target: testUnusedStylesheet took 0.039 sec
[au:antunit] Target: testFullTextMatcherRequiresText took 0.021 sec
[au:antunit] Target: testSubstringMatcherRequiresFamilyCategory took 0.021 sec
[au:antunit] Target: testSubstringMatcherRequiresPattern took 0.02 sec
[au:antunit] Target: testNoLicenseMatchers took 0.001 sec
[au:antunit] Target: testFullTextMatcherRequiresFamilyCategory took 0.019 sec
    [mkdir] Created dir: <https://builds.apache.org/job/Creadur-Rat/ws/apache-rat-tasks/target/testoutput/dest>

allTests:
[au:antunit] Build File: <https://builds.apache.org/job/Creadur-Rat/ws/apache-rat-tasks/src/test/resources/antunit/report-normal-operation.xml>
[au:antunit] Tests run: 11, Failures: 0, Errors: 1, Time elapsed: 1.25 sec
[au:antunit] Target: testFullTextMatcherNotApprovedSentToFile took 0.083 sec
[au:antunit] Target: testFullTextMatcherSentToFileNoMatch took 0.084 sec
[au:antunit] Target: testFullTextMatcherApprovedSentToFile took 0.072 sec
[au:antunit] Target: testFullTextMatcherExpandsProperties took 0.072 sec
[au:antunit] Target: testXMLReportSentToFile took 0.053 sec
[au:antunit] Target: testSubstringMatcherApprovedSentToFile took 0.075 sec
[au:antunit] Target: testSubstringMatcherSentToFileNoMatch took 0.075 sec
[au:antunit] Target: testSubstringMatcherNotApprovedSentToFile took 0.071 sec
[au:antunit] Target: testWithALUnknownSentToFile took 0.071 sec
[au:antunit] Target: testWithReportSentToFile took 0.069 sec
[au:antunit] Target: testCustomMatcherSentToFile  caused an ERROR
[au:antunit] 	at line 333, column 43
[au:antunit] 	Message: Unable to find a javac compiler;
[au:antunit] com.sun.tools.javac.Main is not on the classpath.
[au:antunit] Perhaps JAVA_HOME does not point to the JDK.
[au:antunit] It is currently set to "/x1/jenkins/tools/java/jdk1.7.0_55/jre"
[au:antunit] 	took 0.02 sec
[INFO] Executed tasks
[INFO] 
[INFO] --- maven-jar-plugin:2.4:jar (default-jar) @ apache-rat-tasks ---
[INFO] Building jar: <https://builds.apache.org/job/Creadur-Rat/ws/apache-rat-tasks/target/apache-rat-tasks-0.11-SNAPSHOT.jar>
[INFO] 
[INFO] --- maven-site-plugin:3.4:attach-descriptor (attach-descriptor) @ apache-rat-tasks
---
[INFO] 
[INFO] --- maven-install-plugin:2.5.1:install (default-install) @ apache-rat-tasks ---
[INFO] Installing <https://builds.apache.org/job/Creadur-Rat/ws/apache-rat-tasks/target/apache-rat-tasks-0.11-SNAPSHOT.jar>
to /home/jenkins/jenkins-slave/maven-repositories/0/org/apache/rat/apache-rat-tasks/0.11-SNAPSHOT/apache-rat-tasks-0.11-SNAPSHOT.jar
[INFO] Installing <https://builds.apache.org/job/Creadur-Rat/ws/apache-rat-tasks/pom.xml>
to /home/jenkins/jenkins-slave/maven-repositories/0/org/apache/rat/apache-rat-tasks/0.11-SNAPSHOT/apache-rat-tasks-0.11-SNAPSHOT.pom
[INFO]                                                                         
[INFO] ------------------------------------------------------------------------
[INFO] Building Apache Creadur Rat::Command Line 0.11-SNAPSHOT
[INFO] ------------------------------------------------------------------------
[INFO] 
[INFO] --- maven-clean-plugin:2.5:clean (default-clean) @ apache-rat ---
[INFO] 
[INFO] --- maven-enforcer-plugin:1.3.1:enforce (enforce-bytecode-version) @ apache-rat ---
[INFO] 
[INFO] --- apache-rat-plugin:0.10:check (default) @ apache-rat ---
[INFO] 51 implicit excludes (use -debug for more details).
[INFO] Exclude: README-ANT.txt
[INFO] Exclude: README-CLI.txt
[INFO] 7 resources included (use -debug for more details)
Warning:  org.apache.xerces.jaxp.SAXParserImpl$JAXPSAXParser: Property 'http://www.oracle.com/xml/jaxp/properties/entityExpansionLimit'
is not recognized.
Compiler warnings:
  WARNING:  'org.apache.xerces.jaxp.SAXParserImpl: Property 'http://javax.xml.XMLConstants/property/accessExternalDTD'
is not recognized.'
Warning:  org.apache.xerces.parsers.SAXParser: Feature 'http://javax.xml.XMLConstants/feature/secure-processing'
is not recognized.
Warning:  org.apache.xerces.parsers.SAXParser: Property 'http://javax.xml.XMLConstants/property/accessExternalDTD'
is not recognized.
Warning:  org.apache.xerces.parsers.SAXParser: Property 'http://www.oracle.com/xml/jaxp/properties/entityExpansionLimit'
is not recognized.
[INFO] Rat check: Summary of files. Unapproved: 0 unknown: 0 generated: 0 approved: 6 licence.
[INFO] 
[INFO] --- maven-remote-resources-plugin:1.5:process (default) @ apache-rat ---
[INFO] 
[INFO] --- maven-resources-plugin:2.6:resources (default-resources) @ apache-rat ---
[INFO] Using 'UTF-8' encoding to copy filtered resources.
[INFO] Copying 2 resources to META-INF
[INFO] Copying 3 resources
[INFO] 
[INFO] --- maven-compiler-plugin:3.1:compile (default-compile) @ apache-rat ---
[INFO] No sources to compile
[INFO] 
[INFO] --- animal-sniffer-maven-plugin:1.11:check (check-java-1.5-compat) @ apache-rat ---
[INFO] Signature checking is skipped.
[INFO] 
[INFO] --- maven-resources-plugin:2.6:testResources (default-testResources) @ apache-rat ---
[INFO] Using 'UTF-8' encoding to copy filtered resources.
[INFO] skip non existing resourceDirectory <https://builds.apache.org/job/Creadur-Rat/ws/apache-rat/src/test/resources>
[INFO] Copying 3 resources
[INFO] 
[INFO] --- maven-compiler-plugin:3.1:testCompile (default-testCompile) @ apache-rat ---
[INFO] No sources to compile
[INFO] 
[INFO] --- maven-surefire-plugin:2.17:test (default-test) @ apache-rat ---
[JENKINS] Recording test results[INFO] 

[INFO] --- maven-dependency-plugin:2.8:unpack-dependencies (default) @ apache-rat ---
[INFO] Unpacking /home/jenkins/jenkins-slave/maven-repositories/0/commons-lang/commons-lang/2.6/commons-lang-2.6.jar
to <https://builds.apache.org/job/Creadur-Rat/ws/apache-rat/target/classes> with includes
"" and excludes "META-INF/**"
[INFO] Unpacking /home/jenkins/jenkins-slave/maven-repositories/0/commons-io/commons-io/2.2/commons-io-2.2.jar
to <https://builds.apache.org/job/Creadur-Rat/ws/apache-rat/target/classes> with includes
"" and excludes "META-INF/**"
[INFO] Unpacking /home/jenkins/jenkins-slave/maven-repositories/0/commons-collections/commons-collections/3.2.1/commons-collections-3.2.1.jar
to <https://builds.apache.org/job/Creadur-Rat/ws/apache-rat/target/classes> with includes
"" and excludes "META-INF/**"
[INFO] Unpacking /home/jenkins/jenkins-slave/maven-repositories/0/commons-cli/commons-cli/1.2/commons-cli-1.2.jar
to <https://builds.apache.org/job/Creadur-Rat/ws/apache-rat/target/classes> with includes
"" and excludes "META-INF/**"
[INFO] Unpacking <https://builds.apache.org/job/Creadur-Rat/ws/apache-rat-tasks/target/apache-rat-tasks-0.11-SNAPSHOT.jar>
to <https://builds.apache.org/job/Creadur-Rat/ws/apache-rat/target/classes> with includes
"" and excludes "META-INF/**"
[INFO] Unpacking <https://builds.apache.org/job/Creadur-Rat/ws/apache-rat-core/target/apache-rat-core-0.11-SNAPSHOT.jar>
to <https://builds.apache.org/job/Creadur-Rat/ws/apache-rat/target/classes> with includes
"" and excludes "META-INF/**"
[INFO] Unpacking /home/jenkins/jenkins-slave/maven-repositories/0/org/apache/commons/commons-compress/1.5/commons-compress-1.5.jar
to <https://builds.apache.org/job/Creadur-Rat/ws/apache-rat/target/classes> with includes
"" and excludes "META-INF/**"
[INFO] 
[INFO] --- maven-jar-plugin:2.4:jar (default-jar) @ apache-rat ---
[INFO] Building jar: <https://builds.apache.org/job/Creadur-Rat/ws/apache-rat/target/apache-rat-0.11-SNAPSHOT.jar>
[INFO] 
[INFO] --- maven-site-plugin:3.4:attach-descriptor (attach-descriptor) @ apache-rat ---
[INFO] 
[INFO] --- maven-install-plugin:2.5.1:install (default-install) @ apache-rat ---
[INFO] Installing <https://builds.apache.org/job/Creadur-Rat/ws/apache-rat/target/apache-rat-0.11-SNAPSHOT.jar>
to /home/jenkins/jenkins-slave/maven-repositories/0/org/apache/rat/apache-rat/0.11-SNAPSHOT/apache-rat-0.11-SNAPSHOT.jar
[INFO] Installing <https://builds.apache.org/job/Creadur-Rat/ws/apache-rat/pom.xml>
to /home/jenkins/jenkins-slave/maven-repositories/0/org/apache/rat/apache-rat/0.11-SNAPSHOT/apache-rat-0.11-SNAPSHOT.pom
[INFO] ------------------------------------------------------------------------
[INFO] Reactor Summary:
[INFO] 
[INFO] Apache Creadur Rat ................................ SUCCESS [15.208s]
[INFO] Apache Creadur Rat::Core .......................... SUCCESS [14.712s]
[INFO] Apache Creadur Rat::Plugin4Maven .................. SUCCESS [24.215s]
[INFO] Apache Creadur Rat::Tasks4Ant ..................... SUCCESS [11.086s]
[INFO] Apache Creadur Rat::Command Line .................. SUCCESS [3.396s]
[INFO] ------------------------------------------------------------------------
[INFO] BUILD SUCCESS
[INFO] ------------------------------------------------------------------------
[INFO] Total time: 1:10.932s
[INFO] Finished at: Fri Aug 15 08:38:31 UTC 2014
[INFO] Final Memory: 31M/340M
[INFO] ------------------------------------------------------------------------
Waiting for Jenkins to finish collecting data
[JENKINS] Archiving <https://builds.apache.org/job/Creadur-Rat/ws/apache-rat-plugin/pom.xml>
to org.apache.rat/apache-rat-plugin/0.11-SNAPSHOT/apache-rat-plugin-0.11-SNAPSHOT.pom
[JENKINS] Archiving <https://builds.apache.org/job/Creadur-Rat/ws/apache-rat-plugin/target/apache-rat-plugin-0.11-SNAPSHOT.jar>
to org.apache.rat/apache-rat-plugin/0.11-SNAPSHOT/apache-rat-plugin-0.11-SNAPSHOT.jar
Sending artifact delta relative to Creadur-Rat ? Apache Creadur Rat::Plugin4Maven #100
Archived 2 artifacts
Archive block size is 32768
Received 0 blocks and 52880 bytes
Compression is 0.0%
Took 0.32 sec
[JENKINS] Archiving <https://builds.apache.org/job/Creadur-Rat/ws/apache-rat-tasks/pom.xml>
to org.apache.rat/apache-rat-tasks/0.11-SNAPSHOT/apache-rat-tasks-0.11-SNAPSHOT.pom
[JENKINS] Archiving <https://builds.apache.org/job/Creadur-Rat/ws/apache-rat-tasks/target/apache-rat-tasks-0.11-SNAPSHOT.jar>
to org.apache.rat/apache-rat-tasks/0.11-SNAPSHOT/apache-rat-tasks-0.11-SNAPSHOT.jar
Sending artifact delta relative to Creadur-Rat ? Apache Creadur Rat::Tasks4Ant #101
Archived 2 artifacts
Archive block size is 32768
Received 0 blocks and 30387 bytes
Compression is 0.0%
Took 14 ms
[JENKINS] Archiving <https://builds.apache.org/job/Creadur-Rat/ws/pom.xml> to org.apache.rat/apache-rat-project/0.11-SNAPSHOT/apache-rat-project-0.11-SNAPSHOT.pom
[JENKINS] Archiving <https://builds.apache.org/job/Creadur-Rat/ws/target/apache-rat-project-0.11-SNAPSHOT-site.xml>
to org.apache.rat/apache-rat-project/0.11-SNAPSHOT/apache-rat-project-0.11-SNAPSHOT-site.xml
Sending artifact delta relative to Creadur-Rat ? Apache Creadur Rat #101
Archived 2 artifacts
Archive block size is 32768
Received 0 blocks and 25363 bytes
Compression is 0.0%
Took 13 ms
[JENKINS] Archiving <https://builds.apache.org/job/Creadur-Rat/ws/apache-rat/pom.xml>
to org.apache.rat/apache-rat/0.11-SNAPSHOT/apache-rat-0.11-SNAPSHOT.pom
[JENKINS] Archiving <https://builds.apache.org/job/Creadur-Rat/ws/apache-rat/target/apache-rat-0.11-SNAPSHOT.jar>
to org.apache.rat/apache-rat/0.11-SNAPSHOT/apache-rat-0.11-SNAPSHOT.jar
Sending artifact delta relative to Creadur-Rat ? Apache Creadur Rat::Command Line #101
Archived 2 artifacts
Archive block size is 32768
Received 0 blocks and 1422768 bytes
Compression is 0.0%
Took 0.39 sec
[JENKINS] Archiving <https://builds.apache.org/job/Creadur-Rat/ws/apache-rat-core/pom.xml>
to org.apache.rat/apache-rat-core/0.11-SNAPSHOT/apache-rat-core-0.11-SNAPSHOT.pom
[JENKINS] Archiving <https://builds.apache.org/job/Creadur-Rat/ws/apache-rat-core/target/apache-rat-core-0.11-SNAPSHOT.jar>
to org.apache.rat/apache-rat-core/0.11-SNAPSHOT/apache-rat-core-0.11-SNAPSHOT.jar
Sending artifact delta relative to Creadur-Rat ? Apache Creadur Rat::Core #101
Archived 2 artifacts
Archive block size is 32768
Received 0 blocks and 122562 bytes
Compression is 0.0%
Took 45 ms
channel stopped
Maven RedeployPublisher use remote ubuntu3 maven settings from : /home/jenkins/.m2/settings.xml
[INFO] Deployment in https://repository.apache.org/content/repositories/snapshots (id=apache.snapshots.https,uniqueVersion=true)
Deploying the main artifact apache-rat-0.11-SNAPSHOT.jar
Downloading: https://repository.apache.org/content/repositories/snapshots/org/apache/rat/apache-rat/0.11-SNAPSHOT/maven-metadata.xml
ERROR: Failed to retrieve remote metadata org.apache.rat:apache-rat:0.11-SNAPSHOT/maven-metadata.xml:
Could not transfer metadata org.apache.rat:apache-rat:0.11-SNAPSHOT/maven-metadata.xml from/to
apache.snapshots.https (https://repository.apache.org/content/repositories/snapshots): Failed
to transfer file: https://repository.apache.org/content/repositories/snapshots/org/apache/rat/apache-rat/0.11-SNAPSHOT/maven-metadata.xml.
Return code is: 502 , ReasonPhrase:Proxy Error.
org.apache.maven.artifact.deployer.ArtifactDeploymentException: Failed to retrieve remote
metadata org.apache.rat:apache-rat:0.11-SNAPSHOT/maven-metadata.xml: Could not transfer metadata
org.apache.rat:apache-rat:0.11-SNAPSHOT/maven-metadata.xml from/to apache.snapshots.https
(https://repository.apache.org/content/repositories/snapshots): Failed to transfer file: https://repository.apache.org/content/repositories/snapshots/org/apache/rat/apache-rat/0.11-SNAPSHOT/maven-metadata.xml.
Return code is: 502 , ReasonPhrase:Proxy Error.
	at org.apache.maven.artifact.deployer.DefaultArtifactDeployer.deploy(DefaultArtifactDeployer.java:143)
	at hudson.maven.reporters.MavenArtifactRecord.deploy(MavenArtifactRecord.java:193)
	at hudson.maven.RedeployPublisher.perform(RedeployPublisher.java:176)
	at hudson.tasks.BuildStepMonitor$1.perform(BuildStepMonitor.java:20)
	at hudson.model.AbstractBuild$AbstractBuildExecution.perform(AbstractBuild.java:804)
	at hudson.model.AbstractBuild$AbstractBuildExecution.performAllBuildSteps(AbstractBuild.java:776)
	at hudson.maven.MavenModuleSetBuild$MavenModuleSetBuildExecution.post2(MavenModuleSetBuild.java:1040)
	at hudson.model.AbstractBuild$AbstractBuildExecution.post(AbstractBuild.java:725)
	at hudson.model.Run.execute(Run.java:1701)
	at hudson.maven.MavenModuleSetBuild.run(MavenModuleSetBuild.java:529)
	at hudson.model.ResourceController.execute(ResourceController.java:88)
	at hudson.model.Executor.run(Executor.java:231)
Caused by: org.eclipse.aether.deployment.DeploymentException: Failed to retrieve remote metadata
org.apache.rat:apache-rat:0.11-SNAPSHOT/maven-metadata.xml: Could not transfer metadata org.apache.rat:apache-rat:0.11-SNAPSHOT/maven-metadata.xml
from/to apache.snapshots.https (https://repository.apache.org/content/repositories/snapshots):
Failed to transfer file: https://repository.apache.org/content/repositories/snapshots/org/apache/rat/apache-rat/0.11-SNAPSHOT/maven-metadata.xml.
Return code is: 502 , ReasonPhrase:Proxy Error.
	at org.eclipse.aether.internal.impl.DefaultDeployer.upload(DefaultDeployer.java:470)
	at org.eclipse.aether.internal.impl.DefaultDeployer.deploy(DefaultDeployer.java:314)
	at org.eclipse.aether.internal.impl.DefaultDeployer.deploy(DefaultDeployer.java:269)
	at org.eclipse.aether.internal.impl.DefaultRepositorySystem.deploy(DefaultRepositorySystem.java:413)
	at org.apache.maven.artifact.deployer.DefaultArtifactDeployer.deploy(DefaultArtifactDeployer.java:139)
	... 11 more
Caused by: org.eclipse.aether.transfer.MetadataTransferException: Could not transfer metadata
org.apache.rat:apache-rat:0.11-SNAPSHOT/maven-metadata.xml from/to apache.snapshots.https
(https://repository.apache.org/content/repositories/snapshots): Failed to transfer file: https://repository.apache.org/content/repositories/snapshots/org/apache/rat/apache-rat/0.11-SNAPSHOT/maven-metadata.xml.
Return code is: 502 , ReasonPhrase:Proxy Error.
	at org.eclipse.aether.connector.wagon.WagonRepositoryConnector$5.wrap(WagonRepositoryConnector.java:995)
	at org.eclipse.aether.connector.wagon.WagonRepositoryConnector$5.wrap(WagonRepositoryConnector.java:983)
	at org.eclipse.aether.connector.wagon.WagonRepositoryConnector$GetTask.run(WagonRepositoryConnector.java:725)
	at org.eclipse.aether.util.concurrency.RunnableErrorForwarder$1.run(RunnableErrorForwarder.java:67)
	at java.util.concurrent.ThreadPoolExecutor.runWorker(ThreadPoolExecutor.java:1145)
	at java.util.concurrent.ThreadPoolExecutor$Worker.run(ThreadPoolExecutor.java:615)
	at java.lang.Thread.run(Thread.java:745)
Caused by: org.apache.maven.wagon.TransferFailedException: Failed to transfer file: https://repository.apache.org/content/repositories/snapshots/org/apache/rat/apache-rat/0.11-SNAPSHOT/maven-metadata.xml.
Return code is: 502 , ReasonPhrase:Proxy Error.
	at org.apache.maven.wagon.shared.http4.AbstractHttpClientWagon.fillInputData(AbstractHttpClientWagon.java:945)
	at org.apache.maven.wagon.StreamWagon.getInputStream(StreamWagon.java:116)
	at org.apache.maven.wagon.StreamWagon.getIfNewer(StreamWagon.java:88)
	at org.apache.maven.wagon.StreamWagon.get(StreamWagon.java:61)
	at org.eclipse.aether.connector.wagon.WagonRepositoryConnector$GetTask.run(WagonRepositoryConnector.java:660)
	... 4 more
[INFO] Deployment failed after 1 min 0 sec
Build step 'Deploy artifacts to Maven repository' changed build result to FAILURE

Mime
View raw message