creadur-dev mailing list archives

Site index · List index
Message view « Date » · « Thread »
Top « Date » · « Thread »
From Apache Jenkins Server <jenk...@builds.apache.org>
Subject Build failed in Jenkins: Creadur-Rat-ParentPom #2
Date Thu, 21 Aug 2014 08:15:51 GMT
See <https://builds.apache.org/job/Creadur-Rat-ParentPom/2/>

------------------------------------------
[...truncated 286 lines...]
AU        apache-rat-core\src\main\java\org\apache\rat\license\W3CDocumentLicenseFamily.java
AU        apache-rat-core\src\main\java\org\apache\rat\license\OASISLicenseFamily.java
AU        apache-rat-core\src\main\java\org\apache\rat\ReportConfiguration.java
AU        apache-rat-core\src\main\java\org\apache\rat\ReportFailedRuntimeException.java
A         apache-rat-core\src\main\java\org\apache\rat\analysis
AU        apache-rat-core\src\main\java\org\apache\rat\analysis\RatHeaderAnalysisException.java
A         apache-rat-core\src\main\java\org\apache\rat\analysis\license
AU        apache-rat-core\src\main\java\org\apache\rat\analysis\license\GPL3License.java
AU        apache-rat-core\src\main\java\org\apache\rat\analysis\license\BaseLicense.java
AU        apache-rat-core\src\main\java\org\apache\rat\analysis\license\CopyrightHeader.java
AU        apache-rat-core\src\main\java\org\apache\rat\analysis\license\OASISLicense.java
AU        apache-rat-core\src\main\java\org\apache\rat\analysis\license\FullTextMatchingLicense.java
AU        apache-rat-core\src\main\java\org\apache\rat\analysis\license\W3CDocLicense.java
AU        apache-rat-core\src\main\java\org\apache\rat\analysis\license\SimplePatternBasedLicense.java
AU        apache-rat-core\src\main\java\org\apache\rat\analysis\license\CDDL1License.java
AU        apache-rat-core\src\main\java\org\apache\rat\analysis\license\MITLicense.java
AU        apache-rat-core\src\main\java\org\apache\rat\analysis\license\W3CLicense.java
AU        apache-rat-core\src\main\java\org\apache\rat\analysis\license\AppliedApacheSoftwareLicense20.java
AU        apache-rat-core\src\main\java\org\apache\rat\analysis\license\ApacheSoftwareLicense20.java
AU        apache-rat-core\src\main\java\org\apache\rat\analysis\license\TMF854LicenseHeader.java
AU        apache-rat-core\src\main\java\org\apache\rat\analysis\license\GPL1License.java
AU        apache-rat-core\src\main\java\org\apache\rat\analysis\license\DojoLicenseHeader.java
AU        apache-rat-core\src\main\java\org\apache\rat\analysis\license\GPL2License.java
AU        apache-rat-core\src\main\java\org\apache\rat\analysis\RatReportAnalysisResultException.java
AU        apache-rat-core\src\main\java\org\apache\rat\analysis\IHeaderMatcher.java
AU        apache-rat-core\src\main\java\org\apache\rat\analysis\DocumentHeaderAnalyser.java
AU        apache-rat-core\src\main\java\org\apache\rat\analysis\DefaultAnalyserFactory.java
A         apache-rat-core\src\main\java\org\apache\rat\analysis\generation
AU        apache-rat-core\src\main\java\org\apache\rat\analysis\generation\JavaDocLicenseNotRequired.java
AU        apache-rat-core\src\main\java\org\apache\rat\analysis\generation\GeneratedLicenseNotRequired.java
A         apache-rat-core\src\main\java\org\apache\rat\analysis\util
AU        apache-rat-core\src\main\java\org\apache\rat\analysis\util\HeaderMatcherMultiplexer.java
AU        apache-rat-core\src\main\java\org\apache\rat\analysis\HeaderCheckWorker.java
A         apache-rat-core\src\main\java\org\apache\rat\walker
AU        apache-rat-core\src\main\java\org\apache\rat\walker\Walker.java
AU        apache-rat-core\src\main\java\org\apache\rat\walker\ArchiveWalker.java
AU        apache-rat-core\src\main\java\org\apache\rat\walker\FileNameComparator.java
AU        apache-rat-core\src\main\java\org\apache\rat\walker\DirectoryWalker.java
AU        apache-rat-core\src\main\java\org\apache\rat\Defaults.java
A         apache-rat-core\src\main\java\org\apache\rat\header
AU        apache-rat-core\src\main\java\org\apache\rat\header\HeaderMatcher.java
AU        apache-rat-core\src\main\java\org\apache\rat\header\HeaderBean.java
AU        apache-rat-core\src\main\java\org\apache\rat\header\ArrayCharFilter.java
AU        apache-rat-core\src\main\java\org\apache\rat\header\CharFilter.java
AU        apache-rat-core\src\main\java\org\apache\rat\header\FilteringSequenceFactory.java
A         apache-rat-core\src\site
AU        apache-rat-core\src\site\site.xml
A         apache-rat-core\src\site\apt
AU        apache-rat-core\src\site\apt\index.apt.vm
A         apache-rat-core\src\site\resources
A         apache-rat-core\src\site\resources\css
AU        apache-rat-core\src\site\resources\css\site.css
AU        BUILD.txt
AU        ant-task-examples.xml
AU        NOTICE
A         apache-rat-plugin
A         apache-rat-plugin\src
A         apache-rat-plugin\src\it
A         apache-rat-plugin\src\it\it4_RAT-168
A         apache-rat-plugin\src\it\it4_RAT-168\invoker.properties
A         apache-rat-plugin\src\it\it4_RAT-168\verify.groovy
A         apache-rat-plugin\src\it\it4_RAT-168\pom.xml
A         apache-rat-plugin\src\it\it1
AU        apache-rat-plugin\src\it\it1\invoker.properties
A         apache-rat-plugin\src\it\it1\verify.groovy
AU        apache-rat-plugin\src\it\it1\pom.xml
AU        apache-rat-plugin\src\it\it1\src.apt
AU        apache-rat-plugin\src\it\settings.xml
A         apache-rat-plugin\src\test
A         apache-rat-plugin\src\test\java
A         apache-rat-plugin\src\test\java\org
A         apache-rat-plugin\src\test\java\org\apache
A         apache-rat-plugin\src\test\java\org\apache\rat
A         apache-rat-plugin\src\test\java\org\apache\rat\mp
A         apache-rat-plugin\src\test\java\org\apache\rat\mp\AbstractRatMojoTest.java
AU        apache-rat-plugin\src\test\java\org\apache\rat\mp\RatCheckMojoTest.java
A         apache-rat-plugin\src\test\java\org\apache\rat\mp\RatTestHelpers.java
A         apache-rat-plugin\src\test\resources
A         apache-rat-plugin\src\test\resources\unit
A         apache-rat-plugin\src\test\resources\unit\it3
AU        apache-rat-plugin\src\test\resources\unit\it3\pom.xml
AU        apache-rat-plugin\src\test\resources\unit\it3\src.apt
A         apache-rat-plugin\src\test\resources\unit\it1
AU        apache-rat-plugin\src\test\resources\unit\it1\pom.xml
A         apache-rat-plugin\src\test\resources\unit\it2
AU        apache-rat-plugin\src\test\resources\unit\it2\pom.xml
AU        apache-rat-plugin\src\test\resources\unit\it2\src.txt
A         apache-rat-plugin\src\main
A         apache-rat-plugin\src\main\filtered-resources
A         apache-rat-plugin\src\main\filtered-resources\org
A         apache-rat-plugin\src\main\filtered-resources\org\apache
A         apache-rat-plugin\src\main\filtered-resources\org\apache\rat
A         apache-rat-plugin\src\main\filtered-resources\org\apache\rat\mp
AU        apache-rat-plugin\src\main\filtered-resources\org\apache\rat\mp\rat-report.properties
A         apache-rat-plugin\src\main\resources
A         apache-rat-plugin\src\main\resources\org
A         apache-rat-plugin\src\main\resources\org\apache
A         apache-rat-plugin\src\main\resources\org\apache\rat
A         apache-rat-plugin\src\main\resources\org\apache\rat\mp
AU        apache-rat-plugin\src\main\resources\org\apache\rat\mp\package.html
A         apache-rat-plugin\src\main\java
A         apache-rat-plugin\src\main\java\org
A         apache-rat-plugin\src\main\java\org\apache
A         apache-rat-plugin\src\main\java\org\apache\rat
A         apache-rat-plugin\src\main\java\org\apache\rat\mp
AU        apache-rat-plugin\src\main\java\org\apache\rat\mp\FilesReportable.java
AU        apache-rat-plugin\src\main\java\org\apache\rat\mp\RatCheckException.java
AU        apache-rat-plugin\src\main\java\org\apache\rat\mp\LicenseFamilySpecification.java
AU        apache-rat-plugin\src\main\java\org\apache\rat\mp\RatReportMojo.java
AU        apache-rat-plugin\src\main\java\org\apache\rat\mp\RatCheckMojo.java
AU        apache-rat-plugin\src\main\java\org\apache\rat\mp\HeaderMatcherSpecification.java
AU        apache-rat-plugin\src\main\java\org\apache\rat\mp\AbstractRatMojo.java
A         apache-rat-plugin\src\site
A         apache-rat-plugin\src\site\resources
A         apache-rat-plugin\src\site\resources\css
AU        apache-rat-plugin\src\site\resources\css\site.css
A         apache-rat-plugin\src\site\fml
AU        apache-rat-plugin\src\site\fml\faq.fml
AU        apache-rat-plugin\src\site\site.xml
A         apache-rat-plugin\src\site\apt
AU        apache-rat-plugin\src\site\apt\usage.apt.vm
AU        apache-rat-plugin\src\site\apt\index.apt
A         apache-rat-plugin\src\site\apt\examples
AU        apache-rat-plugin\src\site\apt\examples\custom-license.apt.vm
AU        apache-rat-plugin\src\site\apt\examples\basic.apt.vm
AU        apache-rat-plugin\src\site\apt\examples\site.apt.vm
AU        apache-rat-plugin\src\site\apt\examples\verify.apt.vm
A         apache-rat-plugin\src\changes
AU        apache-rat-plugin\src\changes\changes.xml
AU        apache-rat-plugin\pom.xml
AU        LICENSE
 U        .
At revision 1619307
no change for http://svn.apache.org/repos/asf/creadur/rat/trunk since the previous build
Parsing POMs
maven-agent.jar already up to date
classworlds.jar already up to date
maven-interceptor.jar already up to date
maven2.1-interceptor.jar already up to date
[Creadur-Rat-ParentPom] $ f:\jenkins\tools\\java\\latest-1.5-64/bin/java -cp f:\jenkins\jenkins-slave\maven-agent.jar;f:\jenkins\jenkins-slave\classworlds.jar
hudson.maven.agent.Main f:\jenkins\tools\maven\apache-maven-2.2.1 F:\jenkins\jenkins-slave\slave.jar
f:\jenkins\jenkins-slave\maven-interceptor.jar 63959 f:\jenkins\jenkins-slave\maven2.1-interceptor.jar
<===[JENKINS REMOTING CAPACITY]===>   channel started
ERROR: [JENKINS-18403] JDK 5 not supported to run Maven; retrying with slave Java and setting
compile/test properties to point to f:\jenkins\tools\\java\\latest-1.5-64
maven-agent.jar already up to date
classworlds.jar already up to date
maven-interceptor.jar already up to date
maven2.1-interceptor.jar already up to date
[Creadur-Rat-ParentPom] $ "C:\Program Files\Java\jre7/bin/java" -cp f:\jenkins\jenkins-slave\maven-agent.jar;f:\jenkins\jenkins-slave\classworlds.jar
hudson.maven.agent.Main f:\jenkins\tools\maven\apache-maven-2.2.1 F:\jenkins\jenkins-slave\slave.jar
f:\jenkins\jenkins-slave\maven-interceptor.jar 63961 f:\jenkins\jenkins-slave\maven2.1-interceptor.jar
<===[JENKINS REMOTING CAPACITY]===>   channel started
log4j:WARN No appenders could be found for logger (org.apache.commons.beanutils.converters.BooleanConverter).
log4j:WARN Please initialize the log4j system properly.
Executing Maven:  -B -f <https://builds.apache.org/job/Creadur-Rat-ParentPom/ws/pom.xml>
-Dmaven.repo.local=f:\jenkins\jenkins-slave\maven-repositories\0 clean install -N -e
+ Error stacktraces are turned on.
[INFO] Scanning for projects...
[INFO] ------------------------------------------------------------------------
[INFO] Building Apache Creadur Rat
[INFO]    task-segment: [clean, install]
[INFO] ------------------------------------------------------------------------
Downloading: http://repo1.maven.org/maven2/org/codehaus/mojo/animal-sniffer-maven-plugin/1.11/animal-sniffer-maven-plugin-1.11.pom
4K downloaded  (animal-sniffer-maven-plugin-1.11.pom)
Downloading: http://repo1.maven.org/maven2/org/codehaus/mojo/animal-sniffer-parent/1.11/animal-sniffer-parent-1.11.pom
4K downloaded  (animal-sniffer-parent-1.11.pom)
Downloading: http://repo1.maven.org/maven2/org/codehaus/mojo/animal-sniffer-maven-plugin/1.11/animal-sniffer-maven-plugin-1.11.jar
28K downloaded  (animal-sniffer-maven-plugin-1.11.jar)
[INFO] [clean:clean {execution: default-clean}]
Downloading: http://repo1.maven.org/maven2/org/apache/maven/plugins/maven-site-plugin/3.4/maven-site-plugin-3.4.pom
19K downloaded  (maven-site-plugin-3.4.pom)
Downloading: http://repo1.maven.org/maven2/org/apache/maven/plugins/maven-site-plugin/3.4/maven-site-plugin-3.4.jar
124K downloaded  (maven-site-plugin-3.4.jar)
[INFO] [enforcer:enforce {execution: enforce-bytecode-version}]
[INFO] [remote-resources:process {execution: default}]
Downloading: http://repo1.maven.org/maven2/org/codehaus/mojo/animal-sniffer/1.11/animal-sniffer-1.11.pom
2K downloaded  (animal-sniffer-1.11.pom)
Downloading: http://repo1.maven.org/maven2/org/codehaus/mojo/java-boot-classpath-detector/1.11/java-boot-classpath-detector-1.11.pom
2K downloaded  (java-boot-classpath-detector-1.11.pom)
Downloading: http://repo1.maven.org/maven2/org/codehaus/mojo/animal-sniffer/1.11/animal-sniffer-1.11.jar
31K downloaded  (animal-sniffer-1.11.jar)
Downloading: http://repo1.maven.org/maven2/org/codehaus/mojo/java-boot-classpath-detector/1.11/java-boot-classpath-detector-1.11.jar
4K downloaded  (java-boot-classpath-detector-1.11.jar)
[INFO] [animal-sniffer:check {execution: check-java-1.5-compat}]
[INFO] Checking unresolved references to org.codehaus.mojo.signature:java15:1.0
[INFO] [site:attach-descriptor {execution: default-attach-descriptor}]
[INFO] [install:install {execution: default-install}]
[INFO] Installing <https://builds.apache.org/job/Creadur-Rat-ParentPom/ws/pom.xml> to
f:\jenkins\jenkins-slave\maven-repositories\0\org\apache\rat\apache-rat-project\0.12-SNAPSHOT\apache-rat-project-0.12-SNAPSHOT.pom
[INFO] Installing <https://builds.apache.org/job/Creadur-Rat-ParentPom/ws/target\apache-rat-project-0.12-SNAPSHOT-site.xml>
to f:\jenkins\jenkins-slave\maven-repositories\0\org\apache\rat\apache-rat-project\0.12-SNAPSHOT\apache-rat-project-0.12-SNAPSHOT-site.xml
[INFO] ------------------------------------------------------------------------
[INFO] BUILD SUCCESSFUL
[INFO] ------------------------------------------------------------------------
[INFO] Total time: 19 seconds
[INFO] Finished at: Thu Aug 21 01:14:56 PDT 2014
[INFO] Final Memory: 38M/92M
[INFO] ------------------------------------------------------------------------
[JENKINS] Archiving f:\jenkins\jenkins-slave\maven-repositories\0\org\apache\rat\apache-rat-project\0.12-SNAPSHOT\apache-rat-project-0.12-SNAPSHOT.pom
to org.apache.rat/apache-rat-project/0.12-SNAPSHOT/apache-rat-project-0.12-SNAPSHOT.pom
[JENKINS] Archiving <https://builds.apache.org/job/Creadur-Rat-ParentPom/ws/target\apache-rat-project-0.12-SNAPSHOT-site.xml>
to org.apache.rat/apache-rat-project/0.12-SNAPSHOT/apache-rat-project-0.12-SNAPSHOT-site.xml
F:/jenkins/jenkins-slave/maven-repositories/0/org/apache/rat/apache-rat-project/0.12-SNAPSHOT/apache-rat-project-0.12-SNAPSHOT.pom
is not inside F:/jenkins/jenkins-slave/workspace/Creadur-Rat-ParentPom/; will archive in a
separate pass
Sending artifact delta relative to Creadur-Rat-ParentPom » Apache Creadur Rat #1
Archived 1 artifacts
Archive block size is 32768
Received 0 blocks and 5264 bytes
Compression is 0.0%
Took 21 ms
Sending artifact delta relative to Creadur-Rat-ParentPom » Apache Creadur Rat #1
Archived 1 artifacts
Archive block size is 32768
Received 0 blocks and 20814 bytes
Compression is 0.0%
Took 10 ms
channel stopped
Maven RedeployPublisher use remote windows2 maven settings from : f:\jenkins\tools\maven\apache-maven-2.2.1/conf/settings.xml
[INFO] Deployment in https://repository.apache.org/content/repositories/snapshots (id=apache.snapshots.https,uniqueVersion=true)
Deploying the main artifact apache-rat-project-0.12-SNAPSHOT.pom
Downloading: https://repository.apache.org/content/repositories/snapshots/org/apache/rat/apache-rat-project/0.12-SNAPSHOT/maven-metadata.xml
Downloaded: https://repository.apache.org/content/repositories/snapshots/org/apache/rat/apache-rat-project/0.12-SNAPSHOT/maven-metadata.xml
(820 B at 0.0 KB/sec)
Uploading: https://repository.apache.org/content/repositories/snapshots/org/apache/rat/apache-rat-project/0.12-SNAPSHOT/apache-rat-project-0.12-20140821.081551-17.pom
ERROR: Failed to deploy artifacts: Could not transfer artifact org.apache.rat:apache-rat-project:pom:0.12-20140821.081551-17
from/to apache.snapshots.https (https://repository.apache.org/content/repositories/snapshots):
Failed to transfer file: https://repository.apache.org/content/repositories/snapshots/org/apache/rat/apache-rat-project/0.12-SNAPSHOT/apache-rat-project-0.12-20140821.081551-17.pom.
Return code is: 401, ReasonPhrase: Unauthorized.
org.apache.maven.artifact.deployer.ArtifactDeploymentException: Failed to deploy artifacts:
Could not transfer artifact org.apache.rat:apache-rat-project:pom:0.12-20140821.081551-17
from/to apache.snapshots.https (https://repository.apache.org/content/repositories/snapshots):
Failed to transfer file: https://repository.apache.org/content/repositories/snapshots/org/apache/rat/apache-rat-project/0.12-SNAPSHOT/apache-rat-project-0.12-20140821.081551-17.pom.
Return code is: 401, ReasonPhrase: Unauthorized.
	at org.apache.maven.artifact.deployer.DefaultArtifactDeployer.deploy(DefaultArtifactDeployer.java:143)
	at hudson.maven.reporters.MavenArtifactRecord.deploy(MavenArtifactRecord.java:193)
	at hudson.maven.RedeployPublisher.perform(RedeployPublisher.java:176)
	at hudson.tasks.BuildStepMonitor$1.perform(BuildStepMonitor.java:20)
	at hudson.model.AbstractBuild$AbstractBuildExecution.perform(AbstractBuild.java:804)
	at hudson.model.AbstractBuild$AbstractBuildExecution.performAllBuildSteps(AbstractBuild.java:776)
	at hudson.maven.MavenModuleSetBuild$MavenModuleSetBuildExecution.post2(MavenModuleSetBuild.java:1040)
	at hudson.model.AbstractBuild$AbstractBuildExecution.post(AbstractBuild.java:725)
	at hudson.model.Run.execute(Run.java:1701)
	at hudson.maven.MavenModuleSetBuild.run(MavenModuleSetBuild.java:529)
	at hudson.model.ResourceController.execute(ResourceController.java:88)
	at hudson.model.Executor.run(Executor.java:231)
Caused by: org.eclipse.aether.deployment.DeploymentException: Failed to deploy artifacts:
Could not transfer artifact org.apache.rat:apache-rat-project:pom:0.12-20140821.081551-17
from/to apache.snapshots.https (https://repository.apache.org/content/repositories/snapshots):
Failed to transfer file: https://repository.apache.org/content/repositories/snapshots/org/apache/rat/apache-rat-project/0.12-SNAPSHOT/apache-rat-project-0.12-20140821.081551-17.pom.
Return code is: 401, ReasonPhrase: Unauthorized.
	at org.eclipse.aether.internal.impl.DefaultDeployer.deploy(DefaultDeployer.java:341)
	at org.eclipse.aether.internal.impl.DefaultDeployer.deploy(DefaultDeployer.java:269)
	at org.eclipse.aether.internal.impl.DefaultRepositorySystem.deploy(DefaultRepositorySystem.java:413)
	at org.apache.maven.artifact.deployer.DefaultArtifactDeployer.deploy(DefaultArtifactDeployer.java:139)
	... 11 more
Caused by: org.eclipse.aether.transfer.ArtifactTransferException: Could not transfer artifact
org.apache.rat:apache-rat-project:pom:0.12-20140821.081551-17 from/to apache.snapshots.https
(https://repository.apache.org/content/repositories/snapshots): Failed to transfer file: https://repository.apache.org/content/repositories/snapshots/org/apache/rat/apache-rat-project/0.12-SNAPSHOT/apache-rat-project-0.12-20140821.081551-17.pom.
Return code is: 401, ReasonPhrase: Unauthorized.
	at org.eclipse.aether.connector.wagon.WagonRepositoryConnector$6.wrap(WagonRepositoryConnector.java:1016)
	at org.eclipse.aether.connector.wagon.WagonRepositoryConnector$6.wrap(WagonRepositoryConnector.java:1004)
	at org.eclipse.aether.connector.wagon.WagonRepositoryConnector$PutTask.run(WagonRepositoryConnector.java:895)
	at org.eclipse.aether.connector.wagon.WagonRepositoryConnector.put(WagonRepositoryConnector.java:522)
	at org.eclipse.aether.internal.impl.DefaultDeployer.deploy(DefaultDeployer.java:335)
	... 14 more
Caused by: org.apache.maven.wagon.TransferFailedException: Failed to transfer file: https://repository.apache.org/content/repositories/snapshots/org/apache/rat/apache-rat-project/0.12-SNAPSHOT/apache-rat-project-0.12-20140821.081551-17.pom.
Return code is: 401, ReasonPhrase: Unauthorized.
	at org.apache.maven.wagon.shared.http4.AbstractHttpClientWagon.put(AbstractHttpClientWagon.java:626)
	at org.apache.maven.wagon.shared.http4.AbstractHttpClientWagon.put(AbstractHttpClientWagon.java:524)
	at org.apache.maven.wagon.shared.http4.AbstractHttpClientWagon.put(AbstractHttpClientWagon.java:505)
	at org.apache.maven.wagon.shared.http4.AbstractHttpClientWagon.put(AbstractHttpClientWagon.java:485)
	at org.eclipse.aether.connector.wagon.WagonRepositoryConnector$PutTask.run(WagonRepositoryConnector.java:871)
	... 16 more
[INFO] Deployment failed after 17 sec
Build step 'Deploy artifacts to Maven repository' changed build result to FAILURE

Mime
View raw message